{"text_format":"1","workbook":"xlsx","n_sheets":8,"sheets":["Loadings","bar Size","Reinf","Geometry","Constants","Sheet1","beam","graph"],"not_rendered":{"charts":0,"images":0,"macros":1,"external_links":0,"defined_names":16,"comments":0,"pivot_tables":0},"unopened":[],"bounds":{"document_bytes":16777216,"sheet_cells":100000,"rows_first":2000,"rows_last":500,"rows_between":2000,"halvings":0,"cell_chars":16384,"cell_head_chars":4096},"cells_cut":0,"cells_raw":0,"read":"whole","date_system":"1900"}

{"sheet":"Loadings","index":0,"n_rows":0,"n_cols":0,"rows_kept":0,"cut":false,"hidden":true,"merged":[]}

{"sheet":"bar Size","index":1,"n_rows":11,"n_cols":15,"rows_kept":11,"cut":false,"hidden":true,"merged":[]}
[null,2.0,2.0,3.0,7.0,null,1.0,3.0,1.0,4.0,null,1.0,3.0,3.0,3.0]
[null,10.0,null,10.0,null,null,10.0,null,10.0,null,null,10.0,null,10.0]
[null,12.0,10.0,12.0,10.0,null,12.0,10.0,12.0,10.0,null,12.0,10.0,12.0,10.0]
[null,16.0,12.0,16.0,12.0,null,16.0,12.0,16.0,12.0,null,16.0,12.0,16.0,12.0]
[null,20.0,16.0,20.0,16.0,null,20.0,16.0,20.0,16.0,null,20.0,16.0,20.0,16.0]
[null,25.0,20.0,25.0,20.0,null,25.0,20.0,25.0,20.0,null,25.0,20.0,25.0,20.0]
[null,32.0,25.0,32.0,25.0,null,32.0,25.0,32.0,25.0,null,32.0,25.0,32.0,25.0]
[null,40.0,32.0,40.0,32.0,null,40.0,32.0,40.0,32.0,null,40.0,32.0,40.0,32.0]
[null,null,40.0,null,40.0,null,null,40.0,null,40.0,null,null,40.0,null,40.0]
[]
[null,{"$f":"IF(B1=1,B2,IF(B1=2,B3,IF(B1=3,B4,IF(B1=4,B5,IF(B1=5,B6,IF(B1=6,B7,B8))))))","v":12},10,16,32,null,{"$f":"IF(G1=1,G2,IF(G1=2,G3,IF(G1=3,G4,IF(G1=4,G5,IF(G1=5,G6,IF(G1=6,G7,G8))))))","v":10},12,10,16,null,{"$f":"IF(L1=1,L2,IF(L1=2,L3,IF(L1=3,L4,IF(L1=4,L5,IF(L1=5,L6,IF(L1=6,L7,L8))))))","v":10},12,16,12]

{"sheet":"Reinf","index":2,"n_rows":0,"n_cols":0,"rows_kept":0,"cut":false,"hidden":true,"merged":[]}

{"sheet":"Geometry","index":3,"n_rows":0,"n_cols":0,"rows_kept":0,"cut":false,"hidden":true,"merged":[]}

{"sheet":"Constants","index":4,"n_rows":0,"n_cols":0,"rows_kept":0,"cut":false,"hidden":true,"merged":[]}

{"sheet":"Sheet1","index":5,"n_rows":40,"n_cols":22,"rows_kept":40,"cut":false,"hidden":true,"merged":[[5,16,5,17],[6,1,6,17],[1,9,1,10],[2,9,2,10],[3,9,3,10],[4,9,4,10],[4,14,4,15],[5,9,5,10],[5,14,5,15],[18,5,18,9]]}
[]
[null,null,null,null,null,null,null,null,null,"Project:",null,"Project"]
[null,null,null,null,null,null,null,null,null,"Location:",null,"Location"]
[null,null,null,null,null,null,null,null,null,"Client:",null,"Client"]
[null,null,null,null,null,null,null,null,null,"Designed by:",null,"RCF",null,null,"Checked by:",null,"RCF"]
[null,null,null,null,null,null,null,null,null,"Subject:",null,"@ Grid A-1",null,null,"Date:",null,"2011-03-26"]
[null,"DESIGN OF RC BEAM AS PER ACI 318-08"]
[null,"Input Data:"]
[]
[null,"Geometry:",null,null,null,null,null,null,null,null,null,null,null,"Material Properties:"]
[null,null,null,null,"Beam Length, L =",10.0,"m",null,null,"Concrete cover, Cc =",50.0,"mm",null,null,null,null,"Concrete Strength, f'c =",20.7,"Mpa"]
[null,null,null,null,"Beam Width, B =",250.0,"mm",null,null,"Start Face, SF =",100.0,"mm",null,null,null,null,"Reinf. Yeild Strength, Fy =",415.0,"Mpa"]
[null,null,null,null,"Beam Depth, H =",500.0,"mm",null,null,"End Face, EF =",100.0,"mm"]
[]
[null,"Loadings:"]
[null,null,null,null,null,"Mu",null,null,"Vu",null,null,"Mu",null,null,null,null,null,"Mu",null,null,"Vu"]
[null,null,null,null,null,null,"kN-m",null,null,"kN",null,null,"kN-m",null,null,null,null,null,"kN-m",null,null,"kN"]
[]
[null,null,null,null,null,"     Left Support",null,null,null,null,null,null,null,"Midspan",null,null,null,null,"       Right Support"]
[]
{"$rows_left_out":21}
{"sheet":"beam","index":6,"n_rows":167,"n_cols":73,"rows_kept":167,"cut":false,"hidden":false,"merged":[[101,36,101,37],[102,36,102,37],[103,15,103,20],[103,36,103,37],[104,36,104,37],[105,36,105,37],[106,36,106,37],[107,36,107,37],[108,36,108,37],[111,36,111,37],[112,36,112,37],[116,36,116,37],[117,36,117,37],[118,36,118,37],[129,36,129,37],[130,36,130,37],[133,36,133,37],[134,36,134,37],[135,36,135,37],[136,36,136,37],[137,36,137,37],[138,36,138,37],[119,36,119,37],[120,36,120,37],[121,36,121,37],[125,36,125,37],[126,36,126,37],[127,36,127,37],[128,36,128,37],[49,35,49,36],[50,35,50,36],[52,6,52,7],[53,6,53,7],[54,6,54,7],[55,6,55,7],[56,6,56,7],[55,36,55,37],[56,36,56,37],[58,36,58,37],[59,36,59,37],[60,36,60,37],[61,36,61,37],[62,36,62,37],[57,6,57,7],[58,6,58,7],[59,6,59,7],[60,6,60,7],[61,6,61,7],[62,6,62,7],[63,6,63,7],[63,36,63,37],[64,36,64,37],[65,36,65,37],[70,36,70,37],[71,36,71,37],[73,36,73,37],[74,36,74,37],[80,6,80,7],[81,6,81,7],[82,6,82,7],[83,6,83,7],[83,15,83,20],[84,6,84,7],[85,6,85,7],[75,36,75,37],[76,36,76,37],[77,36,77,37],[78,36,78,37],[79,36,79,37],[80,36,80,37],[85,36,85,37],[133,6,133,7],[134,6,134,7],[135,6,135,7],[136,6,136,7],[139,8,139,9],[140,8,140,9],[143,6,143,7],[144,6,144,7],[145,6,145,7],[148,6,148,7],[149,6,149,7],[150,6,150,7],[151,6,151,7],[152,6,152,7],[164,6,164,7],[165,6,165,7],[166,6,166,7],[155,6,155,7],[156,6,156,7],[157,6,157,7],[158,6,158,7],[159,6,159,7],[162,6,162,7],[163,6,163,7],[64,6,64,7],[65,6,65,7],[66,6,66,7],[67,6,67,7],[68,6,68,7],[69,6,69,7],[72,6,72,7],[73,6,73,7],[74,6,74,7],[75,6,75,7],[76,6,76,7],[77,6,77,7],[78,6,78,7],[79,6,79,7],[86,6,86,7],[87,6,87,7],[88,6,88,7],[89,6,89,7],[92,6,92,7],[93,6,93,7],[94,6,94,7],[95,6,95,7],[96,6,96,7],[97,6,97,7],[98,6,98,7],[99,6,99,7],[100,6,100,7],[101,6,101,7],[102,6,102,7],[103,6,103,7],[104,6,104,7],[105,6,105,7],[106,6,106,7],[107,6,107,7],[108,6,108,7],[109,6,109,7],[115,6,115,7],[119,6,119,7],[120,6,120,7],[121,6,121,7],[122,6,122,7],[123,6,123,7],[124,6,124,7],[125,6,125,7],[126,6,126,7],[129,6,129,7],[130,6,130,7],[131,6,131,7],[132,6,132,7],[18,68,18,69],[19,68,19,69],[25,68,25,69],[5,68,5,69],[7,68,7,69],[8,68,8,69],[10,68,10,69],[11,68,11,69],[15,68,15,69],[16,68,16,69],[20,58,20,59],[21,58,21,59],[16,50,16,51],[16,58,16,59],[17,50,17,51],[17,58,17,59],[20,50,20,51],[20,68,20,69],[22,68,22,69],[4,23,4,25],[4,26,4,27],[4,68,4,69],[1,10,1,12],[2,10,2,12],[3,10,3,12],[4,10,4,12],[4,13,4,16],[4,17,4,19],[4,20,4,22],[5,10,5,12],[5,13,5,16],[5,17,5,19],[5,20,5,22],[5,23,5,25],[5,26,5,27],[6,1,6,27],[10,4,10,5],[11,4,11,5],[12,4,12,5],[13,4,13,5],[14,4,14,5],[16,43,16,44],[17,43,17,44],[21,50,21,51],[23,50,23,51],[23,58,23,59],[23,68,23,69],[24,50,24,51],[24,58,24,59],[24,68,24,69],[23,35,23,36],[24,35,24,36],[16,35,16,36],[17,35,17,36],[20,35,20,36],[20,43,20,44],[21,35,21,36],[21,43,21,44],[23,43,23,44],[24,43,24,44],[27,5,27,7],[28,6,28,7],[29,6,29,7],[29,8,29,9],[27,8,28,9],[27,11,27,13],[27,14,27,16],[27,17,28,18],[27,20,27,22],[27,23,27,25],[27,26,28,27],[17,4,17,5],[18,4,18,5],[19,4,19,5],[20,4,20,5],[21,4,21,5],[22,4,22,5],[27,2,27,4],[29,43,29,44],[30,43,30,44],[33,43,33,44],[34,43,34,44],[28,21,28,22],[28,24,28,25],[29,21,29,22],[29,24,29,25],[29,26,29,27],[29,35,29,36],[30,35,30,36],[32,14,32,16],[32,20,32,22],[32,23,32,25],[32,26,33,27],[33,21,33,22],[33,24,33,25],[33,35,33,36],[34,35,34,36],[33,3,33,4],[33,6,33,7],[28,12,28,13],[28,15,28,16],[29,12,29,13],[29,15,29,16],[29,17,29,18],[33,12,33,13],[33,15,33,16],[28,3,28,4],[29,3,29,4],[32,2,32,4],[32,5,32,7],[32,8,33,9],[32,11,32,13],[32,17,33,18],[34,24,34,25],[34,26,34,27],[36,20,36,27],[36,35,36,36],[36,43,36,44],[34,3,34,4],[34,6,34,7],[34,8,34,9],[34,12,34,13],[34,15,34,16],[34,17,34,18],[34,21,34,22],[37,22,37,23],[37,24,37,25],[37,35,37,36],[37,43,37,44],[38,22,38,23],[38,24,38,25],[37,2,37,3],[37,4,37,5],[37,6,37,7],[37,8,37,9],[37,11,37,12],[37,13,37,14],[37,15,37,16],[38,2,38,3],[38,4,38,5],[38,6,38,7],[38,8,38,9],[38,11,38,12],[38,13,38,14],[38,15,38,16],[42,14,42,15],[43,14,43,15],[44,5,44,6],[44,23,44,24],[45,5,45,6],[45,23,45,24],[46,5,46,6],[46,23,46,24],[42,5,42,6],[42,23,42,24],[42,43,42,44],[42,58,42,59],[43,5,43,6],[43,23,43,24],[43,43,43,44],[43,58,43,59],[42,35,42,36],[43,35,43,36],[46,35,46,36],[46,43,46,44],[47,35,47,36],[47,43,47,44],[49,43,49,44],[50,43,50,44],[49,50,49,51],[50,50,50,51],[42,50,42,51],[43,50,43,51],[46,50,46,51],[46,58,46,59],[47,50,47,51],[47,58,47,59],[49,58,49,59],[50,58,50,59],[99,36,99,37],[100,36,100,37],[92,36,92,37],[93,36,93,37],[94,36,94,37],[95,36,95,37],[96,36,96,37],[97,36,97,37],[98,36,98,37]]}
[]
[null,null,null,null,null,null,null,null,null,null,"Project:",null,null,"Project",null,null,null,null,null,null,null,null,null,null,null,null,null,null,null,null,null,null,null,null,null,null,null,null,null,null,null,null,null,null,null,null,null,null,null,null,null,null,null,null,null,null,null,null,null,null,null,null,null,"Checks:"]
[null,null,null,null,null,null,null,null,null,null,"Location:",null,null,"Location",null,null,null,null,null,null,null,null,null,null,null,null,null,null,null,null,null,null,null,null,null,null,null,null,null,null,null,null,null,null,null,null,null,null,null,null,null,null,null,null,null,null,null,null,null,null,null,null,null,null,"Moment Capacity and Crack Control Checks"]
[null,null,null,null,null,null,null,null,null,null,"Client:",null,null,"Client",null,null,null,null,null,null,null,null,null,null,null,null,null,null,null,null,null,null,null,null,null,null,null,null,null,null,null,null,null,null,null,null,null,null,null,null,null,null,null,null,null,null,null,null,null,null,null,null,null,null,"Left Support:"]
[null,null,null,null,null,null,null,null,null,null,"Job No.:",null,null,1.0,null,null,null,"Calc. by:",null,null,null,null,null,"Checked by:",null,null,null,null,null,null,null,null,null,null,null,null,null,null,null,null,null,null,null,null,null,null,null,null,null,null,null,null,null,null,null,null,null,null,null,null,null,null,null,null,null,"fMn",null,"=",{"$f":"G70","v":266.8216537},null,"kN-m",null,{"$f":"K70","v":"> Mu = 200 kN-m, O.K."}]
[null,null,null,null,null,null,null,null,null,null,"Subject:",null,null,"Beam",null,null,null,"Date:",null,null,"2011-03-26",null,null,"Revision:",null,null,"-",null,null,null,null,null,null,null,null,null,null,null,null,null,null,null,null,null,null,null,null,null,null,null,null,null,null,null,null,null,null,null,null,null,null,null,null,null,null,"Spacing",null,"=",{"$f":"G153","v":33.33333333},null,"mm",null,{"$f":"K153","v":"s(min) <= s(act) <= s(max), O.K.!"}]
[null,"ANALYSIS & DESIGN OF RC BEAM AS PER ACI 318-08",null,null,null,null,null,null,null,null,null,null,null,null,null,null,null,null,null,null,null,null,null,null,null,null,null,null,null,null,null,null,null,null,null,null,null,null,null,null,null,null,null,null,null,null,null,null,null,null,null,null,null,null,null,null,null,null,null,null,null,null,null,null,"Midspan:"]
[null,null,null,null,null,null,null,null,null,null,null,null,null,null,null,null,null,null,null,null,null,null,null,null,null,null,null,null,null,null,null,null,null,null,null,null,null,null,null,null,null,null,null,null,null,null,null,null,null,null,null,null,null,null,null,null,null,null,null,null,null,null,null,null,null,"fMn",null,"=",{"$f":"G90","v":199.4789112},null,"kN-m",null,{"$f":"K90","v":"> Mu = 150 kN-m, O.K."}]
[null,"INPUT DATA",null,null,null,null,null,null,null,null,null,null,null,null,null,null,null,null,null,null,null,null,null,null,null,null,null,null,null,null,null,null,null,null,null,null,null,null,null,null,null,null,null,null,null,null,null,null,null,null,null,null,null,null,null,null,null,null,null,null,null,null,null,null,null,"Spacing",null,"=",{"$f":"G160","v":33.33333333},null,"mm",null,{"$f":"K160","v":"s(min) <= s(act) <= s(max), O.K.!"}]
[null,"MATERIAL PROPERTIES",null,null,null,null,null,null,null,null,null,null,null,null,null,null,null,null,null,null,null,null,null,null,null,null,null,null,null,null,null,null,null,null,null,null,null,null,null,null,null,null,null,null,null,null,null,null,null,null,null,null,null,null,null,null,null,null,null,null,null,null,null,null,"Right Support:"]
[null,null,"fc'","=",41.0,null,"Mpa",null,"CONCRETE STRENGTH",null,null,null,null,null,null,null,null,null,null,null,null,null,null,null,null,null,null,null,null,null,null,null,null,null,null,null,null,null,null,null,null,null,null,null,null,null,null,null,null,null,null,null,null,null,null,null,null,null,null,null,null,null,null,null,null,"fMn",null,"=",{"$f":"G110","v":236.1992823},null,"kN-m",null,{"$f":"K110","v":"> Mu = 159 kN-m, O.K."}]
[null,null,"fy","=",414.0,null,"Mpa",null,"REBAR YIELD STRESS",null,null,null,null,null,null,null,null,null,null,null,null,null,null,null,null,null,null,null,null,null,null,null,null,"COLUMN SUPPORT",null,null,null,null,null,null,null,null,null,null,null,null,null,null,"SIMPLY SUPPORTED",null,null,null,null,null,null,null,null,null,null,null,null,null,null,null,null,"Spacing",null,"=",{"$f":"G167","v":50},null,"mm",null,{"$f":"K167","v":"s(min) <= s(act) <= s(max), O.K.!"}]
[null,null,"fys","=",414.0,null,"Mpa",null,"LINKS YIELD STRESS"]
[null,null,"Es","=",200000.0,null,"Mpa",null,"Steel Modulus of Elasticity",null,null,null,null,null,null,null,null,null,null,null,null,null,null,null,null,null,null,null,null,null,null,null,null,null,"CALCULATION of d and d'",null,null,null,null,null,null,null,null,null,null,null,null,null,null,"CALCULATION of d and d'",null,null,null,null,null,null,null,null,null,null,null,null,null,null,"Shear Capacity and Torsional Capacity Checks"]
[null,null,"Ec","=",{"$f":"4700*(E11)^0.5","v":30094.68392},null,"Mpa",null,"Ec = 4700*SQRT(f'c)",null,null,null,null,null,null,null,null,null,null,null,null,null,null,null,null,null,null,null,null,null,null,null,null,null,"LEFT SUPPORT",null,null,null,null,null,null,null,null,null,null,null,null,null,null,"LEFT SUPPORT",null,null,null,null,null,null,null,null,null,null,null,null,null,null,null,"Spacing of hoops for seismic provisions"]
[null,null,null,null,null,null,null,null,null,null,null,null,null,null,null,null,null,null,null,null,null,null,null,null,null,null,null,null,null,null,null,null,null,null,"Layer 1",null,null,null,null,null,null,"Layer 1",null,null,null,null,null,null,null,"Layer 1",null,null,null,null,null,null,"Layer 1",null,null,null,null,null,null,null,null,"S(max)",null,"=",{"$f":"G116","v":80.20833333},null,"mm.o.c.",null,{"$f":"G117","v":"< 85mm, N.G."}]
[null,"DIMENSIONS",null,null,null,null,null,null,null,null,null,null,null,null,null,null,null,null,null,null,null,null,null,null,null,null,null,null,null,null,null,null,null,null,"d =",{"$f":"IF($C$30=0,0,$E$20-$E$21-($D$30/2))","v":347.5},null,"mm",null,null,null,null,"d =",{"$f":"IF($C$35=0,0,$E$22+($D$35/2))","v":52.5},null,"mm",null,null,null,"d =",{"$f":"IF($C$35=0,0,$E$20-$E$22-($D$35/2))","v":347.5},null,"mm",null,null,null,null,"d =",{"$f":"IF($C$30=0,0,$E$21+($D$30/2))","v":52.5},null,"mm",null,null,null,null,"@2H",null,"=",{"$f":"2*E20","v":800},null,"mm",null,{"$f":"IF(BQ17<=G39*I39,\"<= \"&G39*I39&\"mm hoops are beyond 2H, O.K.\",\"> \"&G39*I39&\"mm hoops must be provided @\")","v":"<= 935mm hoops are beyond 2H, O.K."}]
[null,null,"L","=",3.15,null,"m",null,"BEAM LENGTH",null,null,null,null,null,null,null,null,null,null,null,null,null,null,null,null,null,null,null,null,null,null,null,null,null,"As =",{"$f":"PI()*$D$30^2*0.25*$C$30","v":1472.621556},null,"mm^2",null,null,null,null,"As =",{"$f":"PI()*$D$35^2*0.25*$C$35","v":981.7477042},null,"mm^2",null,null,null,"As =",{"$f":"PI()*$D$35^2*0.25*$C$35","v":981.7477042},null,"mm^2",null,null,null,null,"As =",{"$f":"PI()*$D$30^2*0.25*$C$30","v":1472.621556},null,"mm^2",null,null,null,null,null,null,null,null,null,null,null,{"$f":"IF(BQ17<=G39*I39,\"\",\"distance 2H from face of support.\")","v":""}]
[null,null,"B","=",200.0,null,"mm",null,"BEAM WIDTH",null,null,null,null,null,null,null,null,null,null,null,null,null,null,null,null,null,null,null,null,null,null,null,null,null,null,null,null,null,null,null,null,null,null,null,null,null,null,null,null,null,null,null,null,null,null,null,null,null,null,null,null,null,null,null,null,"fVn",null,"=",{"$f":"G122","v":97.09435062},null,"kN",null,{"$f":"K122","v":"<Vu =150 kN, not O.K."}]
[null,null,"H","=",400.0,null,"mm",null,"BEAM HEIGHT",null,null,null,null,null,null,null,null,null,null,null,null,null,null,null,null,null,null,null,null,null,null,null,null,null,"Layer 2",null,null,null,null,null,null,"Layer 1",null,null,null,null,null,null,null,"Layer 2",null,null,null,null,null,null,"Layer 1",null,null,null,null,null,null,null,null,"Av(min)",null,"=",{"$f":"G126","v":67.12453911},null,"mm2",null,{"$f":"K126","v":"<= Av(prov) = 157.08 mm^2, O.K."}]
{"$rows_left_out":148}
{"sheet":"graph","index":7,"n_rows":47,"n_cols":18,"rows_kept":47,"cut":false,"hidden":true,"merged":[]}
["For Graph"]
["Space",{"$f":"(B29-B10)/(beam!$L$30-1)","v":90},{"$f":"(B29-B10)/(beam!$L$35-1)","v":45},{"$f":"IF(beam!$O$30<1,0,(B29-B10)/(beam!$O$30-1))","v":45},{"$f":"IF(beam!$O$35<1,0,(B29-B10)/(beam!$O$35-1))","v":90},null,null,null,null,null,null,"Space",{"$f":"(M29-M10)/(beam!C30-1)","v":45},{"$f":"(M29-M10)/(beam!C35-1)","v":90},{"$f":"IF(beam!F30<1,0,(M29-M10)/(beam!$F$30-1))","v":18},{"$f":"IF(beam!F35<1,0,(M29-M10)/(beam!$F$35-1))","v":90}]
[null,0.0,null,null,null,null,null,null,null,null,null,null,0.0]
[null,0.0,null,null,null,null,null,null,null,null,null,null,0.0]
["Section-x",{"$f":"B3-beam!$E$19/2","v":-100},{"$f":"B3+beam!$E$19/2","v":100},{"$f":"B3+beam!$E$19/2","v":100},{"$f":"B3-beam!$E$19/2","v":-100},{"$f":"B3-beam!E$19/2","v":-100},null,null,null,null,null,"Section-x",{"$f":"M3-beam!$E$19/2","v":-100},{"$f":"M3+beam!$E$19/2","v":100},{"$f":"M3+beam!$E$19/2","v":100},{"$f":"M3-beam!$E$19/2","v":-100},{"$f":"M3-beam!P$19/2","v":0}]
["Section-y",{"$f":"B4+beam!$E$20/2","v":200},{"$f":"B4+beam!$E$20/2","v":200},{"$f":"B4-beam!$E$20/2","v":-200},{"$f":"B4-beam!$E$20/2","v":-200},{"$f":"B4+beam!$E$20/2","v":200},null,null,null,null,null,"Section-y",{"$f":"M4+beam!$E$20/2","v":200},{"$f":"M4+beam!$E$20/2","v":200},{"$f":"M4-beam!$E$20/2","v":-200},{"$f":"M4-beam!$E$20/2","v":-200},{"$f":"M4+beam!$E$20/2","v":200}]
["Link-x",{"$f":"B5+beam!$E$23","v":-60},{"$f":"C5-beam!$E$23","v":60},{"$f":"D5-beam!$E$23","v":60},{"$f":"E5+beam!$E$23","v":-60},{"$f":"B7","v":-60},null,null,null,null,null,"Link-x",{"$f":"M5+beam!$E$23","v":-60},{"$f":"N5-beam!$E$23","v":60},{"$f":"O5-beam!$E$23","v":60},{"$f":"P5+beam!$E$23","v":-60},{"$f":"M7","v":-60}]
["Link-y",{"$f":"B6-beam!$E$21","v":160},{"$f":"C6-beam!$E$21","v":160},{"$f":"D6+beam!$E$21","v":-160},{"$f":"E6+beam!$E$21","v":-160},160,null,null,null,null,null,"Link-y",{"$f":"M6-beam!$E$21","v":160},{"$f":"N6-beam!$E$21","v":160},{"$f":"O6+beam!$E$21","v":-160},{"$f":"P6+beam!$E$21","v":-160},160]
["Bars","x","y","x","y","x","y",null,null,null,null,"Bars","x","y","x","y","x","y"]
[null,{"$f":"B7+15","v":-45},{"$f":"C8-15","v":145},{"$f":"IF(beam!$O$30<1,B10,B7+15)","v":-45},{"$f":"IF(beam!$O$30<1,C10,C8-30-beam!$R$30)","v":105},{"$f":"IF(beam!$O$35<2,\"\",D10)","v":-45},0.0,null,null,null,null,null,{"$f":"M7+15","v":-45},{"$f":"N8-15","v":145},{"$f":"IF(beam!$F$30<1,M10,M7+15)","v":-45},{"$f":"IF(beam!$F$30<1,N10,N8-30-beam!$I$30)","v":105},{"$f":"IF(beam!$F$35<2,\"\",O10)","v":-45},0.0]
[null,{"$f":"MIN($B$29,$B10+$B$2)","v":45},{"$f":"C10","v":145},{"$f":"MIN($D$29,$D10+$D$2)","v":0},{"$f":"E10","v":105},{"$f":"D11","v":0},{"$f":"G10","v":0},null,null,null,null,null,{"$f":"MIN($B$29,$M10+$M$2)","v":0},{"$f":"N10","v":145},{"$f":"MIN($D$29,$O10+$O$2)","v":-27},{"$f":"P10","v":105},{"$f":"O11","v":-27},{"$f":"R10","v":0}]
[null,45,145,45,105,45,0,null,null,null,null,null,45,145,-9,105,-9,0]
[null,45,145,45,105,45,0,null,null,null,null,null,45,145,9,105,9,0]
[null,45,145,45,105,45,0,null,null,null,null,null,45,145,27,105,27,0]
[null,45,145,45,105,45,0,null,null,null,null,null,45,145,45,105,45,0]
[null,45,145,45,105,45,0,null,null,null,null,null,45,145,45,105,45,0]
[null,45,145,45,105,45,0,null,null,null,null,null,45,145,45,105,45,0]
[null,45,145,45,105,45,0,null,null,null,null,null,45,145,45,105,45,0]
[null,45,145,45,105,45,0,null,null,null,null,null,45,145,45,105,45,0]
[null,45,145,45,105,45,0,null,null,null,null,null,45,145,45,105,45,0]
{"$rows_left_out":27}