{"text_format":"1","workbook":"xlsx","n_sheets":5,"sheets":["사용안내","공휴일","연간","1월","이름지정"],"not_rendered":{"charts":0,"images":0,"macros":1,"external_links":0,"defined_names":10,"comments":3,"pivot_tables":0},"unopened":[],"bounds":{"document_bytes":16777216,"sheet_cells":100000,"rows_first":2000,"rows_last":500,"rows_between":2000,"halvings":0,"cell_chars":16384,"cell_head_chars":4096},"cells_cut":0,"cells_raw":0,"read":"whole","date_system":"1900"}

{"sheet":"사용안내","index":0,"n_rows":30,"n_cols":7,"rows_kept":30,"cut":false,"hidden":false,"merged":[[28,1,28,10],[29,1,29,10],[13,1,13,10],[14,1,14,10],[15,1,15,10],[20,1,20,10],[22,1,22,10],[23,1,23,10],[24,1,24,10],[25,1,25,10],[27,1,27,10],[19,1,19,10],[18,1,18,10],[0,1,0,10],[17,1,17,10],[6,1,6,5],[6,6,6,10],[7,1,7,5],[8,1,8,5],[9,1,9,5],[10,1,10,5],[2,1,2,10],[3,1,3,10],[4,1,4,10],[7,6,7,10],[8,6,8,10],[9,6,9,10],[10,6,10,10],[11,6,11,10]]}
[null,"탭다 엑셀 양식 사용 안내"]
[]
[null,"탭다 블로그 내 엑셀 양식은"]
[null,"사용 범위를 준수할 경우 모두 무료입니다. "]
[null,"금지 사항 적발 시 관련법에 의거 제재 및 법적 처벌을 받을 수 있습니다."]
[]
[null,"O",null,null,null,null,"X"]
[null,"개인적 비상업적 용도의 사용",null,null,null,null,"디자인 무단 도용 및 판매 금지"]
[null,"온라인 및 오프라인 이용 가능",null,null,null,null,"재배포(개인적, 비상업적 용도라도) 금지"]
[null,"회사원 개인의 회사 내부 보고, 제출, 공유용",null,null,null,null,"외부 유출, 대외적 게시 금지"]
[null,"비영리 단체에서의 사용",null,null,null,null,"영리 목적의 강의에 사용 금지"]
[null,null,null,null,null,null,"기타 이에 준하는 모든 상업적 유사 행위 금지"]
[]
[null,"탭다의 최신 소식을 가장 빨리 받는 방법!"]
[null,"카카오톡 친구 검색에서 '탭다'를 찾아 친구 추가하기!"]
[null,"탭다 블로그 북마크 또는 즐겨찾기 http://tabda.tistory.com"]
[]
[null,"탭다 엑셀 양식이 마음에 드셨나요?"]
[null,"지금 블로그, SNS에 탭다를 홍보해주세요."]
[null,"#탭다, #무료엑셀양식, #고퀄리티, #개이득"]
[null,"여러분들의 우쭈쭈는 저에게 큰 힘이 됩니다."]
[]
[null,"탭다 엑셀 양식이 유용하셨나요?"]
[null,"앞으로도 고퀄리티 엑셀 양식이 꾸준히"]
[null,"만들어질 수 있도록 탭다를 후원해주세요."]
[null,"여러분들의 피드백에 더 나은 컨텐츠 제작으로 보답하겠습니다."]
[]
[null,"네이버 페이 포인트 선물하기 : mkjang0202 장민경"]
[null,"계좌 후원 : 국민은행 240802-04-160014 장민경"]
[null,"후원 및 기타 문의 : 카카오톡 '탭다' 검색 → 채널 친구추가 또는 오픈채팅"]

{"sheet":"공휴일","index":1,"n_rows":17,"n_cols":4,"rows_kept":17,"cut":false,"hidden":false,"merged":[[0,2,0,3],[0,0,0,1]]}
["공휴일",null,"기념일"]
[{"$f":"DATE(연간!$O$2,1,1)","v":"2021-01-01"},"신정",{"$f":"DATE(연간!$O$2,10,10)","v":"2021-10-10"},"기념일 예시"]
[{"$f":"INDEX(날짜,MATCH(연간!$O$2,공휴일연도,0),0)","v":"2021-02-11"},"설날"]
[{"$f":"A3+1","v":"2021-02-12"},"설날"]
[{"$f":"A4+1","v":"2021-02-13"},"설날"]
[{"$f":"DATE(연간!$O$2,3,1)","v":"2021-03-01"},"삼일절"]
[{"$f":"DATE(연간!$O$2,5,5)","v":"2021-05-05"},"어린이날"]
[{"$f":"INDEX(날짜,MATCH(1,($B$8=휴일명)*(연간!$O$2=공휴일연도),0))","v":"2021-05-19"},"석가탄신일"]
[{"$f":"DATE(연간!$O$2,6,6)","v":"2021-06-06"},"현충일"]
[{"$f":"DATE(연간!$O$2,8,15)","v":"2021-08-15"},"광복절"]
[{"$f":"INDEX(날짜,MATCH(1,($B$11=휴일명)*(연간!$O$2=공휴일연도),0))","v":"2021-09-20"},"추석"]
[{"$f":"A11+1","v":"2021-09-21"},"추석"]
[{"$f":"A12+1","v":"2021-09-22"},"추석"]
[{"$f":"DATE(연간!$O$2,10,3)","v":"2021-10-03"},"개천절"]
[{"$f":"DATE(연간!$O$2,10,9)","v":"2021-10-09"},"한글날"]
[{"$f":"DATE(연간!$O$2,12,25)","v":"2021-12-25"},"성탄절"]
["2021-01-02","공휴일 예시"]

{"sheet":"연간","index":2,"n_rows":32,"n_cols":32,"rows_kept":32,"cut":false,"hidden":false,"merged":[[1,14,1,18]]}
[]
[null,"S",null,null,null,null,null,null,null,null,null,null,null,null,2021]
[]
[null,null,null,null,1,null,null,null,null,null,null,null,2,null,null,null,null,null,null,null,3,null,null,null,null,null,null,null,4]
[]
[null,{"$f":"IF($B$2=\"S\",\"S\",IF($B$2=\"M\",\"M\"))","v":"S"},{"$f":"IF($B$2=\"S\",\"M\",IF($B$2=\"M\",\"T\"))","v":"M"},{"$f":"IF($B$2=\"S\",\"T\",IF($B$2=\"M\",\"W\"))","v":"T"},{"$f":"IF($B$2=\"S\",\"W\",IF($B$2=\"M\",\"T\"))","v":"W"},{"$f":"IF($B$2=\"S\",\"T\",IF($B$2=\"M\",\"F\"))","v":"T"},{"$f":"IF($B$2=\"S\",\"F\",IF($B$2=\"M\",\"S\"))","v":"F"},"S",null,{"$f":"IF($B$2=\"S\",\"S\",IF($B$2=\"M\",\"M\"))","v":"S"},{"$f":"IF($B$2=\"S\",\"M\",IF($B$2=\"M\",\"T\"))","v":"M"},{"$f":"IF($B$2=\"S\",\"T\",IF($B$2=\"M\",\"W\"))","v":"T"},{"$f":"IF($B$2=\"S\",\"W\",IF($B$2=\"M\",\"T\"))","v":"W"},{"$f":"IF($B$2=\"S\",\"T\",IF($B$2=\"M\",\"F\"))","v":"T"},{"$f":"IF($B$2=\"S\",\"F\",IF($B$2=\"M\",\"S\"))","v":"F"},"S",null,{"$f":"IF($B$2=\"S\",\"S\",IF($B$2=\"M\",\"M\"))","v":"S"},{"$f":"IF($B$2=\"S\",\"M\",IF($B$2=\"M\",\"T\"))","v":"M"},{"$f":"IF($B$2=\"S\",\"T\",IF($B$2=\"M\",\"W\"))","v":"T"},{"$f":"IF($B$2=\"S\",\"W\",IF($B$2=\"M\",\"T\"))","v":"W"},{"$f":"IF($B$2=\"S\",\"T\",IF($B$2=\"M\",\"F\"))","v":"T"},{"$f":"IF($B$2=\"S\",\"F\",IF($B$2=\"M\",\"S\"))","v":"F"},"S",null,{"$f":"IF($B$2=\"S\",\"S\",IF($B$2=\"M\",\"M\"))","v":"S"},{"$f":"IF($B$2=\"S\",\"M\",IF($B$2=\"M\",\"T\"))","v":"M"},{"$f":"IF($B$2=\"S\",\"T\",IF($B$2=\"M\",\"W\"))","v":"T"},{"$f":"IF($B$2=\"S\",\"W\",IF($B$2=\"M\",\"T\"))","v":"W"},{"$f":"IF($B$2=\"S\",\"T\",IF($B$2=\"M\",\"F\"))","v":"T"},{"$f":"IF($B$2=\"S\",\"F\",IF($B$2=\"M\",\"S\"))","v":"F"},"S"]
[null,{"$f":"IF(B2=\"M\",(IF(DAY(DATE($O$2,$E$4,1)-WEEKDAY(DATE($O$2,$E$4,1))+2)=2,DATE($O$2,$E$4,1)-WEEKDAY(DATE($O$2,$E$4,1))-5,DATE($O$2,$E$4,1)-WEEKDAY(DATE($O$2,$E$4,1))+2)),IF(B2=\"S\",DATE($O$2,$E$4,1)-WEEKDAY(DATE($O$2,$E$4,1))+1))","v":"2020-12-27"},{"$f":"B7+1","v":"2020-12-28"},{"$f":"C7+1","v":"2020-12-29"},"2020-12-30","2020-12-31","2021-01-01","2021-01-02",null,{"$f":"IF(B2=\"M\",(IF(DAY(DATE($O$2,$M$4,1)-WEEKDAY(DATE($O$2,$M$4,1))+2)=2,DATE($O$2,$M$4,1)-WEEKDAY(DATE($O$2,$M$4,1))-5,DATE($O$2,$M$4,1)-WEEKDAY(DATE($O$2,$M$4,1))+2)),IF(B2=\"S\",DATE($O$2,$M$4,1)-WEEKDAY(DATE($O$2,$M$4,1))+1))","v":"2021-01-31"},{"$f":"J7+1","v":"2021-02-01"},{"$f":"K7+1","v":"2021-02-02"},"2021-02-03","2021-02-04","2021-02-05","2021-02-06",null,{"$f":"IF(B2=\"M\",(IF(DAY(DATE($O$2,$U$4,1)-WEEKDAY(DATE($O$2,$U$4,1))+2)=2,DATE($O$2,$U$4,1)-WEEKDAY(DATE($O$2,$U$4,1))-5,DATE($O$2,$U$4,1)-WEEKDAY(DATE($O$2,$U$4,1))+2)),IF(B2=\"S\",DATE($O$2,$U$4,1)-WEEKDAY(DATE($O$2,$U$4,1))+1))","v":"2021-02-28"},{"$f":"R7+1","v":"2021-03-01"},{"$f":"S7+1","v":"2021-03-02"},"2021-03-03","2021-03-04","2021-03-05","2021-03-06",null,{"$f":"IF(B2=\"M\",(IF(DAY(DATE($O$2,$AC$4,1)-WEEKDAY(DATE($O$2,$AC$4,1))+2)=2,DATE($O$2,$AC$4,1)-WEEKDAY(DATE($O$2,$AC$4,1))-5,DATE($O$2,$AC$4,1)-WEEKDAY(DATE($O$2,$AC$4,1))+2)),IF(B2=\"S\",DATE($O$2,$AC$4,1)-WEEKDAY(DATE($O$2,$AC$4,1))+1))","v":"2021-03-28"},{"$f":"Z7+1","v":"2021-03-29"},{"$f":"AA7+1","v":"2021-03-30"},"2021-03-31","2021-04-01","2021-04-02","2021-04-03"]
[null,{"$f":"B7+7","v":"2021-01-03"},{"$f":"C7+7","v":"2021-01-04"},"2021-01-05","2021-01-06","2021-01-07","2021-01-08","2021-01-09",null,{"$f":"J7+7","v":"2021-02-07"},{"$f":"K7+7","v":"2021-02-08"},{"$f":"L7+7","v":"2021-02-09"},{"$f":"M7+7","v":"2021-02-10"},{"$f":"N7+7","v":"2021-02-11"},{"$f":"O7+7","v":"2021-02-12"},{"$f":"P7+7","v":"2021-02-13"},null,{"$f":"R7+7","v":"2021-03-07"},{"$f":"S7+7","v":"2021-03-08"},{"$f":"T7+7","v":"2021-03-09"},{"$f":"U7+7","v":"2021-03-10"},{"$f":"V7+7","v":"2021-03-11"},{"$f":"W7+7","v":"2021-03-12"},{"$f":"X7+7","v":"2021-03-13"},null,{"$f":"Z7+7","v":"2021-04-04"},{"$f":"AA7+7","v":"2021-04-05"},{"$f":"AB7+7","v":"2021-04-06"},{"$f":"AC7+7","v":"2021-04-07"},{"$f":"AD7+7","v":"2021-04-08"},{"$f":"AE7+7","v":"2021-04-09"},{"$f":"AF7+7","v":"2021-04-10"}]
[null,{"$f":"B8+7","v":"2021-01-10"},"2021-01-11","2021-01-12","2021-01-13","2021-01-14","2021-01-15","2021-01-16",null,{"$f":"J8+7","v":"2021-02-14"},"2021-02-15","2021-02-16","2021-02-17","2021-02-18","2021-02-19","2021-02-20",null,{"$f":"R8+7","v":"2021-03-14"},"2021-03-15","2021-03-16","2021-03-17","2021-03-18","2021-03-19","2021-03-20",null,{"$f":"Z8+7","v":"2021-04-11"},"2021-04-12","2021-04-13","2021-04-14","2021-04-15","2021-04-16","2021-04-17"]
[null,{"$f":"B9+7","v":"2021-01-17"},"2021-01-18","2021-01-19","2021-01-20","2021-01-21","2021-01-22","2021-01-23",null,{"$f":"J9+7","v":"2021-02-21"},"2021-02-22","2021-02-23","2021-02-24","2021-02-25","2021-02-26","2021-02-27",null,{"$f":"R9+7","v":"2021-03-21"},"2021-03-22","2021-03-23","2021-03-24","2021-03-25","2021-03-26","2021-03-27",null,{"$f":"Z9+7","v":"2021-04-18"},"2021-04-19","2021-04-20","2021-04-21","2021-04-22","2021-04-23","2021-04-24"]
[null,{"$f":"B10+7","v":"2021-01-24"},"2021-01-25","2021-01-26","2021-01-27","2021-01-28","2021-01-29","2021-01-30",null,{"$f":"J10+7","v":"2021-02-28"},"2021-03-01","2021-03-02","2021-03-03","2021-03-04","2021-03-05","2021-03-06",null,{"$f":"R10+7","v":"2021-03-28"},"2021-03-29","2021-03-30","2021-03-31","2021-04-01","2021-04-02","2021-04-03",null,{"$f":"Z10+7","v":"2021-04-25"},"2021-04-26","2021-04-27","2021-04-28","2021-04-29","2021-04-30","2021-05-01"]
[null,{"$f":"B11+7","v":"2021-01-31"},"2021-02-01","2021-02-02","2021-02-03","2021-02-04","2021-02-05","2021-02-06",null,{"$f":"J11+7","v":"2021-03-07"},"2021-03-08","2021-03-09","2021-03-10","2021-03-11","2021-03-12","2021-03-13",null,{"$f":"R11+7","v":"2021-04-04"},"2021-04-05","2021-04-06","2021-04-07","2021-04-08","2021-04-09","2021-04-10",null,{"$f":"Z11+7","v":"2021-05-02"},"2021-05-03","2021-05-04","2021-05-05","2021-05-06","2021-05-07","2021-05-08"]
[]
[null,null,null,null,5,null,null,null,null,null,null,null,6,null,null,null,null,null,null,null,7,null,null,null,null,null,null,null,8]
[]
[null,{"$f":"IF($B$2=\"S\",\"S\",IF($B$2=\"M\",\"M\"))","v":"S"},{"$f":"IF($B$2=\"S\",\"M\",IF($B$2=\"M\",\"T\"))","v":"M"},{"$f":"IF($B$2=\"S\",\"T\",IF($B$2=\"M\",\"W\"))","v":"T"},{"$f":"IF($B$2=\"S\",\"W\",IF($B$2=\"M\",\"T\"))","v":"W"},{"$f":"IF($B$2=\"S\",\"T\",IF($B$2=\"M\",\"F\"))","v":"T"},{"$f":"IF($B$2=\"S\",\"F\",IF($B$2=\"M\",\"S\"))","v":"F"},"S",null,{"$f":"IF($B$2=\"S\",\"S\",IF($B$2=\"M\",\"M\"))","v":"S"},{"$f":"IF($B$2=\"S\",\"M\",IF($B$2=\"M\",\"T\"))","v":"M"},{"$f":"IF($B$2=\"S\",\"T\",IF($B$2=\"M\",\"W\"))","v":"T"},{"$f":"IF($B$2=\"S\",\"W\",IF($B$2=\"M\",\"T\"))","v":"W"},{"$f":"IF($B$2=\"S\",\"T\",IF($B$2=\"M\",\"F\"))","v":"T"},{"$f":"IF($B$2=\"S\",\"F\",IF($B$2=\"M\",\"S\"))","v":"F"},"S",null,{"$f":"IF($B$2=\"S\",\"S\",IF($B$2=\"M\",\"M\"))","v":"S"},{"$f":"IF($B$2=\"S\",\"M\",IF($B$2=\"M\",\"T\"))","v":"M"},{"$f":"IF($B$2=\"S\",\"T\",IF($B$2=\"M\",\"W\"))","v":"T"},{"$f":"IF($B$2=\"S\",\"W\",IF($B$2=\"M\",\"T\"))","v":"W"},{"$f":"IF($B$2=\"S\",\"T\",IF($B$2=\"M\",\"F\"))","v":"T"},{"$f":"IF($B$2=\"S\",\"F\",IF($B$2=\"M\",\"S\"))","v":"F"},"S",null,{"$f":"IF($B$2=\"S\",\"S\",IF($B$2=\"M\",\"M\"))","v":"S"},{"$f":"IF($B$2=\"S\",\"M\",IF($B$2=\"M\",\"T\"))","v":"M"},{"$f":"IF($B$2=\"S\",\"T\",IF($B$2=\"M\",\"W\"))","v":"T"},{"$f":"IF($B$2=\"S\",\"W\",IF($B$2=\"M\",\"T\"))","v":"W"},{"$f":"IF($B$2=\"S\",\"T\",IF($B$2=\"M\",\"F\"))","v":"T"},{"$f":"IF($B$2=\"S\",\"F\",IF($B$2=\"M\",\"S\"))","v":"F"},"S"]
[null,{"$f":"IF(B2=\"M\",(IF(DAY(DATE($O$2,$E$14,1)-WEEKDAY(DATE($O$2,$E$14,1))+2)=2,DATE($O$2,$E$14,1)-WEEKDAY(DATE($O$2,$E$14,1))-5,DATE($O$2,$E$14,1)-WEEKDAY(DATE($O$2,$E$14,1))+2)),IF(B2=\"S\",DATE($O$2,$E$14,1)-WEEKDAY(DATE($O$2,$E$14,1))+1))","v":"2021-04-25"},{"$f":"B17+1","v":"2021-04-26"},{"$f":"C17+1","v":"2021-04-27"},"2021-04-28","2021-04-29","2021-04-30","2021-05-01",null,{"$f":"IF(B2=\"M\",(IF(DAY(DATE($O$2,$M$14,1)-WEEKDAY(DATE($O$2,$M$14,1))+2)=2,DATE($O$2,$M$14,1)-WEEKDAY(DATE($O$2,$M$14,1))-5,DATE($O$2,$M$14,1)-WEEKDAY(DATE($O$2,$M$14,1))+2)),IF(B2=\"S\",DATE($O$2,$M$14,1)-WEEKDAY(DATE($O$2,$M$14,1))+1))","v":"2021-05-30"},{"$f":"J17+1","v":"2021-05-31"},{"$f":"K17+1","v":"2021-06-01"},"2021-06-02","2021-06-03","2021-06-04","2021-06-05",null,{"$f":"IF(B2=\"M\",(IF(DAY(DATE($O$2,$U$14,1)-WEEKDAY(DATE($O$2,$U$14,1))+2)=2,DATE($O$2,$U$14,1)-WEEKDAY(DATE($O$2,$U$14,1))-5,DATE($O$2,$U$14,1)-WEEKDAY(DATE($O$2,$U$14,1))+2)),IF(B2=\"S\",DATE($O$2,$U$14,1)-WEEKDAY(DATE($O$2,$U$14,1))+1))","v":"2021-06-27"},{"$f":"R17+1","v":"2021-06-28"},{"$f":"S17+1","v":"2021-06-29"},"2021-06-30","2021-07-01","2021-07-02","2021-07-03",null,{"$f":"IF(B2=\"M\",(IF(DAY(DATE($O$2,$AC$14,1)-WEEKDAY(DATE($O$2,$AC$14,1))+2)=2,DATE($O$2,$AC$14,1)-WEEKDAY(DATE($O$2,$AC$14,1))-5,DATE($O$2,$AC$14,1)-WEEKDAY(DATE($O$2,$AC$14,1))+2)),IF(B2=\"S\",DATE($O$2,$AC$14,1)-WEEKDAY(DATE($O$2,$AC$14,1))+1))","v":"2021-08-01"},{"$f":"Z17+1","v":"2021-08-02"},{"$f":"AA17+1","v":"2021-08-03"},"2021-08-04","2021-08-05","2021-08-06","2021-08-07"]
[null,{"$f":"B17+7","v":"2021-05-02"},{"$f":"C17+7","v":"2021-05-03"},{"$f":"D17+7","v":"2021-05-04"},{"$f":"E17+7","v":"2021-05-05"},{"$f":"F17+7","v":"2021-05-06"},{"$f":"G17+7","v":"2021-05-07"},{"$f":"H17+7","v":"2021-05-08"},null,{"$f":"J17+7","v":"2021-06-06"},{"$f":"K17+7","v":"2021-06-07"},{"$f":"L17+7","v":"2021-06-08"},{"$f":"M17+7","v":"2021-06-09"},{"$f":"N17+7","v":"2021-06-10"},{"$f":"O17+7","v":"2021-06-11"},{"$f":"P17+7","v":"2021-06-12"},null,{"$f":"R17+7","v":"2021-07-04"},{"$f":"S17+7","v":"2021-07-05"},{"$f":"T17+7","v":"2021-07-06"},{"$f":"U17+7","v":"2021-07-07"},{"$f":"V17+7","v":"2021-07-08"},{"$f":"W17+7","v":"2021-07-09"},{"$f":"X17+7","v":"2021-07-10"},null,{"$f":"Z17+7","v":"2021-08-08"},{"$f":"AA17+7","v":"2021-08-09"},{"$f":"AB17+7","v":"2021-08-10"},{"$f":"AC17+7","v":"2021-08-11"},{"$f":"AD17+7","v":"2021-08-12"},{"$f":"AE17+7","v":"2021-08-13"},{"$f":"AF17+7","v":"2021-08-14"}]
[null,{"$f":"B18+7","v":"2021-05-09"},"2021-05-10","2021-05-11","2021-05-12","2021-05-13","2021-05-14","2021-05-15",null,{"$f":"J18+7","v":"2021-06-13"},"2021-06-14","2021-06-15","2021-06-16","2021-06-17","2021-06-18","2021-06-19",null,{"$f":"R18+7","v":"2021-07-11"},"2021-07-12","2021-07-13","2021-07-14","2021-07-15","2021-07-16","2021-07-17",null,{"$f":"Z18+7","v":"2021-08-15"},"2021-08-16","2021-08-17","2021-08-18","2021-08-19","2021-08-20","2021-08-21"]
[null,{"$f":"B19+7","v":"2021-05-16"},"2021-05-17","2021-05-18","2021-05-19","2021-05-20","2021-05-21","2021-05-22",null,{"$f":"J19+7","v":"2021-06-20"},"2021-06-21","2021-06-22","2021-06-23","2021-06-24","2021-06-25","2021-06-26",null,{"$f":"R19+7","v":"2021-07-18"},"2021-07-19","2021-07-20","2021-07-21","2021-07-22","2021-07-23","2021-07-24",null,{"$f":"Z19+7","v":"2021-08-22"},"2021-08-23","2021-08-24","2021-08-25","2021-08-26","2021-08-27","2021-08-28"]
[null,{"$f":"B20+7","v":"2021-05-23"},"2021-05-24","2021-05-25","2021-05-26","2021-05-27","2021-05-28","2021-05-29",null,{"$f":"J20+7","v":"2021-06-27"},"2021-06-28","2021-06-29","2021-06-30","2021-07-01","2021-07-02","2021-07-03",null,{"$f":"R20+7","v":"2021-07-25"},"2021-07-26","2021-07-27","2021-07-28","2021-07-29","2021-07-30","2021-07-31",null,{"$f":"Z20+7","v":"2021-08-29"},"2021-08-30","2021-08-31","2021-09-01","2021-09-02","2021-09-03","2021-09-04"]
[null,{"$f":"B21+7","v":"2021-05-30"},"2021-05-31","2021-06-01","2021-06-02","2021-06-03","2021-06-04","2021-06-05",null,{"$f":"J21+7","v":"2021-07-04"},"2021-07-05","2021-07-06","2021-07-07","2021-07-08","2021-07-09","2021-07-10",null,{"$f":"R21+7","v":"2021-08-01"},"2021-08-02","2021-08-03","2021-08-04","2021-08-05","2021-08-06","2021-08-07",null,{"$f":"Z21+7","v":"2021-09-05"},"2021-09-06","2021-09-07","2021-09-08","2021-09-09","2021-09-10","2021-09-11"]
[]
[null,null,null,null,9,null,null,null,null,null,null,null,10,null,null,null,null,null,null,null,11,null,null,null,null,null,null,null,12]
[]
[null,{"$f":"IF($B$2=\"S\",\"S\",IF($B$2=\"M\",\"M\"))","v":"S"},{"$f":"IF($B$2=\"S\",\"M\",IF($B$2=\"M\",\"T\"))","v":"M"},{"$f":"IF($B$2=\"S\",\"T\",IF($B$2=\"M\",\"W\"))","v":"T"},{"$f":"IF($B$2=\"S\",\"W\",IF($B$2=\"M\",\"T\"))","v":"W"},{"$f":"IF($B$2=\"S\",\"T\",IF($B$2=\"M\",\"F\"))","v":"T"},{"$f":"IF($B$2=\"S\",\"F\",IF($B$2=\"M\",\"S\"))","v":"F"},"S",null,{"$f":"IF($B$2=\"S\",\"S\",IF($B$2=\"M\",\"M\"))","v":"S"},{"$f":"IF($B$2=\"S\",\"M\",IF($B$2=\"M\",\"T\"))","v":"M"},{"$f":"IF($B$2=\"S\",\"T\",IF($B$2=\"M\",\"W\"))","v":"T"},{"$f":"IF($B$2=\"S\",\"W\",IF($B$2=\"M\",\"T\"))","v":"W"},{"$f":"IF($B$2=\"S\",\"T\",IF($B$2=\"M\",\"F\"))","v":"T"},{"$f":"IF($B$2=\"S\",\"F\",IF($B$2=\"M\",\"S\"))","v":"F"},"S",null,{"$f":"IF($B$2=\"S\",\"S\",IF($B$2=\"M\",\"M\"))","v":"S"},{"$f":"IF($B$2=\"S\",\"M\",IF($B$2=\"M\",\"T\"))","v":"M"},{"$f":"IF($B$2=\"S\",\"T\",IF($B$2=\"M\",\"W\"))","v":"T"},{"$f":"IF($B$2=\"S\",\"W\",IF($B$2=\"M\",\"T\"))","v":"W"},{"$f":"IF($B$2=\"S\",\"T\",IF($B$2=\"M\",\"F\"))","v":"T"},{"$f":"IF($B$2=\"S\",\"F\",IF($B$2=\"M\",\"S\"))","v":"F"},"S",null,{"$f":"IF($B$2=\"S\",\"S\",IF($B$2=\"M\",\"M\"))","v":"S"},{"$f":"IF($B$2=\"S\",\"M\",IF($B$2=\"M\",\"T\"))","v":"M"},{"$f":"IF($B$2=\"S\",\"T\",IF($B$2=\"M\",\"W\"))","v":"T"},{"$f":"IF($B$2=\"S\",\"W\",IF($B$2=\"M\",\"T\"))","v":"W"},{"$f":"IF($B$2=\"S\",\"T\",IF($B$2=\"M\",\"F\"))","v":"T"},{"$f":"IF($B$2=\"S\",\"F\",IF($B$2=\"M\",\"S\"))","v":"F"},"S"]
[null,{"$f":"IF(B2=\"M\",(IF(DAY(DATE($O$2,$E$24,1)-WEEKDAY(DATE($O$2,$E$24,1))+2)=2,DATE($O$2,$E$24,1)-WEEKDAY(DATE($O$2,$E$24,1))-5,DATE($O$2,$E$24,1)-WEEKDAY(DATE($O$2,$E$24,1))+2)),IF(B2=\"S\",DATE($O$2,$E$24,1)-WEEKDAY(DATE($O$2,$E$24,1))+1))","v":"2021-08-29"},{"$f":"B27+1","v":"2021-08-30"},{"$f":"C27+1","v":"2021-08-31"},"2021-09-01","2021-09-02","2021-09-03","2021-09-04",null,{"$f":"IF(B2=\"M\",(IF(DAY(DATE($O$2,$M$24,1)-WEEKDAY(DATE($O$2,$M$24,1))+2)=2,DATE($O$2,$M$24,1)-WEEKDAY(DATE($O$2,$M$24,1))-5,DATE($O$2,$M$24,1)-WEEKDAY(DATE($O$2,$M$24,1))+2)),IF(B2=\"S\",DATE($O$2,$M$24,1)-WEEKDAY(DATE($O$2,$E$4,1))+1))","v":"2021-09-26"},{"$f":"J27+1","v":"2021-09-27"},{"$f":"K27+1","v":"2021-09-28"},"2021-09-29","2021-09-30","2021-10-01","2021-10-02",null,{"$f":"IF(B2=\"M\",(IF(DAY(DATE($O$2,$U$24,1)-WEEKDAY(DATE($O$2,$U$24,1))+2)=2,DATE($O$2,$U$24,1)-WEEKDAY(DATE($O$2,$U$24,1))-5,DATE($O$2,$U$24,1)-WEEKDAY(DATE($O$2,$U$24,1))+2)),IF(B2=\"S\",DATE($O$2,$U$24,1)-WEEKDAY(DATE($O$2,$U$24,1))+1))","v":"2021-10-31"},{"$f":"R27+1","v":"2021-11-01"},{"$f":"S27+1","v":"2021-11-02"},"2021-11-03","2021-11-04","2021-11-05","2021-11-06",null,{"$f":"IF(B2=\"M\",(IF(DAY(DATE($O$2,$AC$24,1)-WEEKDAY(DATE($O$2,$AC$24,1))+2)=2,DATE($O$2,$AC$24,1)-WEEKDAY(DATE($O$2,$AC$24,1))-5,DATE($O$2,$AC$24,1)-WEEKDAY(DATE($O$2,$AC$24,1))+2)),IF(B2=\"S\",DATE($O$2,$AC$24,1)-WEEKDAY(DATE($O$2,$AC$24,1))+1))","v":"2021-11-28"},{"$f":"Z27+1","v":"2021-11-29"},{"$f":"AA27+1","v":"2021-11-30"},"2021-12-01","2021-12-02","2021-12-03","2021-12-04"]
[null,{"$f":"B27+7","v":"2021-09-05"},{"$f":"C27+7","v":"2021-09-06"},{"$f":"D27+7","v":"2021-09-07"},{"$f":"E27+7","v":"2021-09-08"},{"$f":"F27+7","v":"2021-09-09"},{"$f":"G27+7","v":"2021-09-10"},{"$f":"H27+7","v":"2021-09-11"},null,{"$f":"J27+7","v":"2021-10-03"},{"$f":"K27+7","v":"2021-10-04"},{"$f":"L27+7","v":"2021-10-05"},{"$f":"M27+7","v":"2021-10-06"},{"$f":"N27+7","v":"2021-10-07"},{"$f":"O27+7","v":"2021-10-08"},{"$f":"P27+7","v":"2021-10-09"},null,{"$f":"R27+7","v":"2021-11-07"},{"$f":"S27+7","v":"2021-11-08"},{"$f":"T27+7","v":"2021-11-09"},{"$f":"U27+7","v":"2021-11-10"},{"$f":"V27+7","v":"2021-11-11"},{"$f":"W27+7","v":"2021-11-12"},{"$f":"X27+7","v":"2021-11-13"},null,{"$f":"Z27+7","v":"2021-12-05"},{"$f":"AA27+7","v":"2021-12-06"},{"$f":"AB27+7","v":"2021-12-07"},{"$f":"AC27+7","v":"2021-12-08"},{"$f":"AD27+7","v":"2021-12-09"},{"$f":"AE27+7","v":"2021-12-10"},{"$f":"AF27+7","v":"2021-12-11"}]
[null,{"$f":"B28+7","v":"2021-09-12"},"2021-09-13","2021-09-14","2021-09-15","2021-09-16","2021-09-17","2021-09-18",null,{"$f":"J28+7","v":"2021-10-10"},"2021-10-11","2021-10-12","2021-10-13","2021-10-14","2021-10-15","2021-10-16",null,{"$f":"R28+7","v":"2021-11-14"},"2021-11-15","2021-11-16","2021-11-17","2021-11-18","2021-11-19","2021-11-20",null,{"$f":"Z28+7","v":"2021-12-12"},"2021-12-13","2021-12-14","2021-12-15","2021-12-16","2021-12-17","2021-12-18"]
[null,{"$f":"B29+7","v":"2021-09-19"},"2021-09-20","2021-09-21","2021-09-22","2021-09-23","2021-09-24","2021-09-25",null,{"$f":"J29+7","v":"2021-10-17"},"2021-10-18","2021-10-19","2021-10-20","2021-10-21","2021-10-22","2021-10-23",null,{"$f":"R29+7","v":"2021-11-21"},"2021-11-22","2021-11-23","2021-11-24","2021-11-25","2021-11-26","2021-11-27",null,{"$f":"Z29+7","v":"2021-12-19"},"2021-12-20","2021-12-21","2021-12-22","2021-12-23","2021-12-24","2021-12-25"]
[null,{"$f":"B30+7","v":"2021-09-26"},"2021-09-27","2021-09-28","2021-09-29","2021-09-30","2021-10-01","2021-10-02",null,{"$f":"J30+7","v":"2021-10-24"},"2021-10-25","2021-10-26","2021-10-27","2021-10-28","2021-10-29","2021-10-30",null,{"$f":"R30+7","v":"2021-11-28"},"2021-11-29","2021-11-30","2021-12-01","2021-12-02","2021-12-03","2021-12-04",null,{"$f":"Z30+7","v":"2021-12-26"},"2021-12-27","2021-12-28","2021-12-29","2021-12-30","2021-12-31","2022-01-01"]
[null,{"$f":"B31+7","v":"2021-10-03"},"2021-10-04","2021-10-05","2021-10-06","2021-10-07","2021-10-08","2021-10-09",null,{"$f":"J31+7","v":"2021-10-31"},"2021-11-01","2021-11-02","2021-11-03","2021-11-04","2021-11-05","2021-11-06",null,{"$f":"R31+7","v":"2021-12-05"},"2021-12-06","2021-12-07","2021-12-08","2021-12-09","2021-12-10","2021-12-11",null,{"$f":"Z31+7","v":"2022-01-02"},"2022-01-03","2022-01-04","2022-01-05","2022-01-06","2022-01-07","2022-01-08"]

{"sheet":"1월","index":3,"n_rows":4948,"n_cols":19,"rows_kept":4948,"cut":false,"hidden":false,"merged":[[49,11,49,12],[49,13,49,14],[50,11,50,12],[50,13,50,14],[52,11,52,14],[34,13,34,14],[35,1,35,2],[35,3,35,4],[35,5,35,6],[35,7,35,8],[35,9,35,10],[35,11,35,12],[35,13,35,14],[34,1,34,2],[34,3,34,4],[34,5,34,6],[34,7,34,8],[34,9,34,10],[34,11,34,12],[41,1,41,2],[41,3,41,4],[41,5,41,6],[41,7,41,8],[41,9,41,10],[32,13,32,14],[33,1,33,2],[33,3,33,4],[33,5,33,6],[33,7,33,8],[33,9,33,10],[33,11,33,12],[33,13,33,14],[32,1,32,2],[32,3,32,4],[32,5,32,6],[32,7,32,8],[32,9,32,10],[32,11,32,12],[29,13,29,14],[31,1,31,2],[31,3,31,4],[31,5,31,6],[31,7,31,8],[31,9,31,10],[31,11,31,12],[31,13,31,14],[29,1,29,2],[29,3,29,4],[29,5,29,6],[29,7,29,8],[29,9,29,10],[29,11,29,12],[27,13,27,14],[28,1,28,2],[28,3,28,4],[28,5,28,6],[28,7,28,8],[28,9,28,10],[28,11,28,12],[28,13,28,14],[27,1,27,2],[27,3,27,4],[27,5,27,6],[27,7,27,8],[27,9,27,10],[27,11,27,12],[25,13,25,14],[26,1,26,2],[26,3,26,4],[26,5,26,6],[26,7,26,8],[26,9,26,10],[26,11,26,12],[26,13,26,14],[25,1,25,2],[25,3,25,4],[25,5,25,6],[25,7,25,8],[25,9,25,10],[25,11,25,12],[22,13,22,14],[23,1,23,2],[23,3,23,4],[23,5,23,6],[23,7,23,8],[23,9,23,10],[23,11,23,12],[23,13,23,14],[22,1,22,2],[22,3,22,4],[22,5,22,6],[22,7,22,8],[22,9,22,10],[22,11,22,12],[20,13,20,14],[21,1,21,2],[21,3,21,4],[21,5,21,6],[21,7,21,8],[21,9,21,10],[21,11,21,12],[21,13,21,14],[20,1,20,2],[20,3,20,4],[20,5,20,6],[20,7,20,8],[20,9,20,10],[20,11,20,12],[17,13,17,14],[19,1,19,2],[19,3,19,4],[19,5,19,6],[19,7,19,8],[19,9,19,10],[19,11,19,12],[19,13,19,14],[17,1,17,2],[17,3,17,4],[17,5,17,6],[17,7,17,8],[17,9,17,10],[17,11,17,12],[15,13,15,14],[16,1,16,2],[16,3,16,4],[16,5,16,6],[16,7,16,8],[16,9,16,10],[16,11,16,12],[16,13,16,14],[15,1,15,2],[15,3,15,4],[15,5,15,6],[15,7,15,8],[15,9,15,10],[15,11,15,12],[13,13,13,14],[14,1,14,2],[14,3,14,4],[14,5,14,6],[14,7,14,8],[14,9,14,10],[14,11,14,12],[14,13,14,14],[13,1,13,2],[13,3,13,4],[13,5,13,6],[13,7,13,8],[13,9,13,10],[13,11,13,12],[10,13,10,14],[11,1,11,2],[11,3,11,4],[11,5,11,6],[11,7,11,8],[11,9,11,10],[11,11,11,12],[11,13,11,14],[10,1,10,2],[10,3,10,4],[10,5,10,6],[10,7,10,8],[10,9,10,10],[10,11,10,12],[8,13,8,14],[9,1,9,2],[9,3,9,4],[9,5,9,6],[9,7,9,8],[9,9,9,10],[9,11,9,12],[9,13,9,14],[8,1,8,2],[8,3,8,4],[8,5,8,6],[8,7,8,8],[8,9,8,10],[8,11,8,12],[0,5,0,14],[1,5,1,14],[2,3,3,3],[2,5,2,14],[3,5,3,14],[7,1,7,2],[7,3,7,4],[7,5,7,6],[7,7,7,8],[7,9,7,10],[7,11,7,12],[7,13,7,14],[5,1,5,2],[5,3,5,4],[1,1,3,2],[5,11,5,12],[5,9,5,10],[5,13,5,14],[5,5,5,6],[5,7,5,8],[41,11,41,12],[41,13,41,14],[40,13,40,14],[39,13,39,14],[38,13,38,14],[37,13,37,14],[37,11,37,12],[38,11,38,12],[39,11,39,12],[40,11,40,12],[37,3,37,4],[38,3,38,4],[39,3,39,4],[40,3,40,4],[40,1,40,2],[39,1,39,2],[38,1,38,2],[37,1,37,2],[40,9,40,10],[39,9,39,10],[38,9,38,10],[37,9,37,10],[37,7,37,8],[38,7,38,8],[39,7,39,8],[40,7,40,8],[40,5,40,6],[39,5,39,6],[38,5,38,6],[37,5,37,6]]}
[]
[null,1,null,2021]
[null,null,null,{"$f":"TEXT(DATE(D2,B2,1),\"mmmm\")","v":"January"},null,null,null,null,null,null,null,null,null,null,null,null,null,null,"←클릭 전 주의해주세요!"]
[]
[]
[null,{"$f":"IF(연간!$B$2=\"S\",\"SUN\",IF(연간!$B$2=\"M\",\"MON\"))","v":"SUN"},null,{"$f":"IF(연간!$B$2=\"S\",\"MON\",IF(연간!$B$2=\"M\",\"TUE\"))","v":"MON"},null,{"$f":"IF(연간!$B$2=\"S\",\"TUE\",IF(연간!$B$2=\"M\",\"WED\"))","v":"TUE"},null,{"$f":"IF(연간!$B$2=\"S\",\"WED\",IF(연간!$B$2=\"M\",\"THU\"))","v":"WED"},null,{"$f":"IF(연간!$B$2=\"S\",\"THU\",IF(연간!$B$2=\"M\",\"FRI\"))","v":"THU"},null,{"$f":"IF(연간!$B$2=\"S\",\"FRI\",IF(연간!$B$2=\"M\",\"SAT\"))","v":"FRI"},null,{"$f":"IF(연간!$B$2=\"S\",\"SAT\",IF(연간!$B$2=\"M\",\"SUN\"))","v":"SAT"}]
[null,null,{"$f":"IF(연간!$B$2=\"M\",(IF(DAY(DATE($D$2,$B$2,1)-WEEKDAY(DATE($D$2,$B$2,1))+2)=2,DATE($D$2,$B$2,1)-WEEKDAY(DATE($D$2,$B$2,1))-5,DATE($D$2,$B$2,1)-WEEKDAY(DATE($D$2,$B$2,1))+2)),IF(연간!$B$2=\"S\",DATE($D$2,$B$2,1)-WEEKDAY(DATE($D$2,$B$2,1))+1))","v":"2020-12-27"},null,{"$f":"C7+1","v":"2020-12-28"},null,{"$f":"C7+2","v":"2020-12-29"},null,{"$f":"C7+3","v":"2020-12-30"},null,{"$f":"C7+4","v":"2020-12-31"},null,{"$f":"C7+5","v":"2021-01-01"},null,{"$f":"C7+6","v":"2021-01-02"},null,"개인일정"]
[null,null,null,null,null,null,null,null,null,null,null,null,null,null,null,null,"업무일정"]
[null,null,null,null,null,null,null,null,null,null,null,null,null,null,null,null,"중요일정"]
[null,null,null,null,null,null,null,null,null,null,null,null,null,null,null,null,"기념일"]
[]
[]
[null,null,{"$f":"C7+7","v":"2021-01-03"},null,{"$f":"C7+8","v":"2021-01-04"},null,{"$f":"C7+9","v":"2021-01-05"},null,{"$f":"C7+10","v":"2021-01-06"},null,{"$f":"C7+11","v":"2021-01-07"},null,{"$f":"C7+12","v":"2021-01-08"},null,{"$f":"C7+13","v":"2021-01-09"}]
[]
[]
[]
[]
[]
[null,null,{"$f":"C7+14","v":"2021-01-10"},null,{"$f":"C7+15","v":"2021-01-11"},null,{"$f":"C7+16","v":"2021-01-12"},null,{"$f":"C7+17","v":"2021-01-13"},null,{"$f":"C7+18","v":"2021-01-14"},null,{"$f":"C7+19","v":"2021-01-15"},null,{"$f":"C7+20","v":"2021-01-16"}]
[]
[]
[]
[]
[]
[null,null,{"$f":"C7+21","v":"2021-01-17"},null,{"$f":"C7+22","v":"2021-01-18"},null,{"$f":"C7+23","v":"2021-01-19"},null,{"$f":"C7+24","v":"2021-01-20"},null,{"$f":"C7+25","v":"2021-01-21"},null,{"$f":"C7+26","v":"2021-01-22"},null,{"$f":"C7+27","v":"2021-01-23"}]
[]
[]
[]
[]
[]
[null,null,{"$f":"C7+28","v":"2021-01-24"},null,{"$f":"C7+29","v":"2021-01-25"},null,{"$f":"C7+30","v":"2021-01-26"},null,{"$f":"C7+31","v":"2021-01-27"},null,{"$f":"C7+32","v":"2021-01-28"},null,{"$f":"C7+33","v":"2021-01-29"},null,{"$f":"C7+34","v":"2021-01-30"}]
[]
[]
[]
[]
[]
[null,null,{"$f":"C7+35","v":"2021-01-31"},null,{"$f":"C7+36","v":"2021-02-01"},null,{"$f":"C7+37","v":"2021-02-02"},null,{"$f":"C7+38","v":"2021-02-03"},null,{"$f":"C7+39","v":"2021-02-04"},null,{"$f":"C7+40","v":"2021-02-05"},null,{"$f":"C7+41","v":"2021-02-06"}]
[]
[]
[]
[]
[]
[1,null,null,null,null,false]
[2,false,null,false,null,false,null,false,null,false,null,false,null,false]
[3,false,null,false,null,false,null,false,null,false,null,false,null,false]
[4,false,null,false,null,false,null,false,null,false,null,false,null,false]
[5,false,null,false,null,false,null,false,null,false,null,false,null,false]
[6,false,null,false,null,false,null,false,null,false,null,false,null,false]
[]
[null,null,null,null,null,null,null,null,null,null,null,"달성률",null,{"$f":"COUNTIF(B43:N48,\"TRUE\")/TEXT(DATE($D$2,$B$2+1,1)-1,\"DD\")","v":0}]
[null,null,null,null,null,null,null,null,null,null,null,"목표 달성 여부",null,{"$f":"IF(N50>=0.8,\"달성\",\"미달성\")","v":"미달성"}]
[]
[null,null,null,null,null,null,null,null,null,null,null,"MADE BY 엠키(tabda.tistory.com)"]
[]
[]
[]
[]
[]
[]
[]
[]
[]
[]
[]
[]
[]
[]
[]
[]
[]
[]
[]
[]
[]
[]
[]
[]
[]
[]
[]
[]
[]
[]
[]
[]
[]
[]
[]
[]
[]
[]
[]
[]
[]
[]
[]
[]
[]
[]
[]
[]
[]
[]
[]
[]
[]
[]
[]
[]
[]
[]
[]
[]
[]
[]
[]
[]
[]
[]
[]
[]
[]
[]
[]
[]
[]
[]
[]
[]
[]
[]
[]
[]
[]
[]
[]
[]
[]
[]
[]
[]
[]
[]
[]
[]
[]
[]
[]
[]
[]
[]
[]
[]
[]
[]
[]
[]
[]
[]
[]
[]
[]
[]
[]
[]
[]
[]
[]
[]
[]
[]
[]
[]
[]
[]
[]
[]
[]
[]
[]
[]
[]
[]
[]
[]
[]
[]
[]
[]
[]
[]
[]
[]
[]
[]
[]
[]
[]
[]
[]
[]
[]
[]
[]
[]
[]
[]
[]
[]
[]
[]
[]
[]
[]
[]
[]
[]
[]
[]
[]
[]
[]
[]
[]
[]
[]
[]
[]
[]
[]
[]
[]
[]
[]
[]
[]
[]
[]
[]
[]
[]
[]
[]
[]
[]
[]
[]
[]
[]
[]
[]
[]
[]
[]
[]
[]
[]
[]
[]
[]
[]
[]
[]
[]
[]
[]
[]
[]
[]
[]
[]
[]
[]
[]
[]
[]
[]
[]
[]
[]
[]
[]
[]
[]
[]
[]
[]
[]
[]
[]
[]
[]
[]
[]
[]
[]
[]
[]
[]
[]
[]
[]
[]
[]
[]
[]
[]
[]
[]
[]
[]
[]
[]
[]
[]
[]
[]
[]
[]
[]
[]
[]
[]
[]
[]
[]
[]
[]
[]
[]
[]
[]
[]
[]
[]
[]
[]
[]
[]
[]
[]
[]
[]
[]
[]
[]
[]
[]
[]
[]
[]
[]
[]
[]
[]
[]
[]
[]
[]
[]
[]
[]
[]
[]
[]
[]
[]
[]
[]
[]
[]
[]
[]
[]
[]
[]
[]
[]
[]
[]
[]
[]
[]
[]
[]
[]
[]
[]
[]
[]
[]
[]
[]
[]
[]
[]
[]
[]
[]
[]
[]
[]
[]
[]
[]
[]
[]
[]
[]
[]
[]
[]
[]
[]
[]
[]
[]
[]
[]
[]
[]
[]
[]
[]
[]
[]
[]
[]
[]
[]
[]
[]
[]
[]
[]
[]
[]
[]
[]
[]
[]
[]
[]
[]
[]
[]
[]
[]
[]
[]
[]
[]
[]
[]
[]
[]
[]
[]
[]
[]
[]
[]
[]
[]
[]
[]
[]
[]
[]
[]
[]
[]
[]
[]
[]
[]
[]
[]
[]
[]
[]
[]
[]
[]
[]
[]
[]
[]
[]
[]
[]
[]
[]
[]
[]
[]
[]
[]
[]
[]
[]
[]
[]
[]
[]
[]
[]
[]
[]
[]
[]
[]
[]
[]
[]
[]
[]
[]
[]
[]
[]
[]
[]
[]
[]
[]
[]
[]
[]
[]
[]
[]
[]
[]
[]
[]
[]
[]
[]
[]
[]
[]
[]
[]
[]
[]
[]
[]
[]
[]
[]
[]
[]
[]
[]
[]
[]
[]
[]
[]
[]
[]
[]
[]
[]
[]
[]
[]
[]
[]
[]
[]
[]
[]
[]
[]
[]
[]
[]
[]
[]
[]
[]
[]
[]
[]
[]
[]
[]
[]
[]
[]
[]
[]
[]
[]
[]
[]
[]
[]
[]
[]
[]
[]
[]
[]
[]
[]
[]
[]
[]
[]
[]
[]
[]
[]
[]
[]
[]
[]
[]
[]
[]
[]
[]
[]
[]
[]
[]
[]
[]
[]
[]
[]
[]
[]
[]
[]
[]
[]
[]
[]
[]
[]
[]
[]
[]
[]
[]
[]
[]
[]
[]
[]
[]
[]
[]
[]
[]
[]
[]
[]
[]
[]
[]
[]
[]
[]
[]
[]
[]
[]
[]
[]
[]
[]
[]
[]
[]
[]
[]
[]
[]
[]
[]
[]
[]
[]
[]
[]
[]
[]
[]
[]
[]
[]
[]
[]
[]
[]
[]
[]
[]
[]
[]
[]
[]
[]
[]
[]
[]
[]
[]
[]
[]
[]
[]
[]
[]
[]
[]
[]
[]
[]
[]
[]
[]
[]
[]
[]
[]
[]
[]
[]
[]
[]
[]
[]
[]
[]
[]
[]
[]
[]
[]
[]
[]
[]
[]
[]
[]
[]
[]
[]
[]
[]
[]
[]
[]
[]
[]
[]
[]
[]
[]
[]
[]
[]
[]
[]
[]
[]
[]
[]
[]
[]
[]
[]
[]
[]
[]
[]
[]
[]
[]
[]
[]
[]
[]
[]
[]
[]
[]
[]
[]
[]
[]
[]
[]
[]
[]
[]
[]
[]
[]
[]
[]
[]
[]
[]
[]
[]
[]
[]
[]
[]
[]
[]
[]
[]
[]
[]
[]
[]
[]
[]
[]
[]
[]
[]
[]
[]
[]
[]
[]
[]
[]
[]
[]
[]
[]
[]
[]
[]
[]
[]
[]
[]
[]
[]
[]
[]
[]
[]
[]
[]
[]
[]
[]
[]
[]
[]
[]
[]
[]
[]
[]
[]
[]
[]
[]
[]
[]
[]
[]
[]
[]
[]
[]
[]
[]
[]
[]
[]
[]
[]
[]
[]
[]
[]
[]
[]
[]
[]
[]
[]
[]
[]
[]
[]
[]
[]
[]
[]
[]
[]
[]
[]
[]
[]
[]
[]
[]
[]
[]
[]
[]
[]
[]
[]
[]
[]
[]
[]
[]
[]
[]
[]
[]
[]
[]
[]
[]
[]
[]
[]
[]
[]
[]
[]
[]
[]
[]
[]
[]
[]
[]
[]
[]
[]
[]
[]
[]
[]
[]
[]
[]
[]
[]
[]
[]
[]
[]
[]
[]
[]
[]
[]
[]
[]
[]
[]
[]
[]
[]
[]
[]
[]
[]
[]
[]
[]
[]
[]
[]
[]
[]
[]
[]
[]
[]
[]
[]
[]
[]
[]
[]
[]
[]
[]
[]
[]
[]
[]
[]
[]
[]
[]
[]
[]
[]
[]
[]
[]
[]
[]
[]
[]
[]
[]
[]
[]
[]
[]
[]
[]
[]
[]
[]
[]
[]
[]
[]
[]
[]
[]
[]
[]
[]
[]
[]
[]
[]
[]
[]
[]
[]
[]
[]
[]
[]
[]
[]
[]
[]
[]
[]
[]
[]
[]
[]
[]
[]
[]
[]
[]
[]
[]
[]
[]
[]
[]
[]
[]
[]
[]
[]
[]
[]
[]
[]
[]
[]
[]
[]
[]
[]
[]
[]
[]
[]
[]
[]
[]
[]
[]
[]
[]
[]
[]
[]
[]
[]
[]
[]
[]
[]
[]
[]
[]
[]
[]
[]
[]
[]
[]
[]
[]
[]
[]
[]
[]
[]
[]
[]
[]
[]
[]
[]
[]
[]
[]
[]
[]
[]
[]
[]
[]
[]
[]
[]
[]
[]
[]
[]
[]
[]
[]
[]
[]
[]
[]
[]
[]
[]
[]
[]
[]
[]
[]
[]
[]
[]
[]
[]
[]
[]
[]
[]
[]
[]
[]
[]
[]
[]
[]
[]
[]
[]
[]
[]
[]
[]
[]
[]
[]
[]
[]
[]
[]
[]
[]
[]
[]
[]
[]
[]
[]
[]
[]
[]
[]
[]
[]
[]
[]
[]
[]
[]
[]
[]
[]
[]
[]
[]
[]
[]
[]
[]
[]
[]
[]
[]
[]
[]
[]
[]
[]
[]
[]
[]
[]
[]
[]
[]
[]
[]
[]
[]
[]
[]
[]
[]
[]
[]
[]
[]
[]
[]
[]
[]
[]
[]
[]
[]
[]
[]
[]
[]
[]
[]
[]
[]
[]
[]
[]
[]
[]
[]
[]
[]
[]
[]
[]
[]
[]
[]
[]
[]
[]
[]
[]
[]
[]
[]
[]
[]
[]
[]
[]
[]
[]
[]
[]
[]
[]
[]
[]
[]
[]
[]
[]
[]
[]
[]
[]
[]
[]
[]
[]
[]
[]
[]
[]
[]
[]
[]
[]
[]
[]
[]
[]
[]
[]
[]
[]
[]
[]
[]
[]
[]
[]
[]
[]
[]
[]
[]
[]
[]
[]
[]
[]
[]
[]
[]
[]
[]
[]
[]
[]
[]
[]
[]
[]
[]
[]
[]
[]
[]
[]
[]
[]
[]
[]
[]
[]
[]
[]
[]
[]
[]
[]
[]
[]
[]
[]
[]
[]
[]
[]
[]
[]
[]
[]
[]
[]
[]
[]
[]
[]
[]
[]
[]
[]
[]
[]
[]
[]
[]
[]
[]
[]
[]
[]
[]
[]
[]
[]
[]
[]
[]
[]
[]
[]
[]
[]
[]
[]
[]
[]
[]
[]
[]
[]
[]
[]
[]
[]
[]
[]
[]
[]
[]
[]
[]
[]
[]
[]
[]
[]
[]
[]
[]
[]
[]
[]
[]
[]
[]
[]
[]
[]
[]
[]
[]
[]
[]
[]
[]
[]
[]
[]
[]
[]
[]
[]
[]
[]
[]
[]
[]
[]
[]
[]
[]
[]
[]
[]
[]
[]
[]
[]
[]
[]
[]
[]
[]
[]
[]
[]
[]
[]
[]
[]
[]
[]
[]
[]
[]
[]
[]
[]
[]
[]
[]
[]
[]
[]
[]
[]
[]
[]
[]
[]
[]
[]
[]
[]
[]
[]
[]
[]
[]
[]
[]
[]
[]
[]
[]
[]
[]
[]
[]
[]
[]
[]
[]
[]
[]
[]
[]
[]
[]
[]
[]
[]
[]
[]
[]
[]
[]
[]
[]
[]
[]
[]
[]
[]
[]
[]
[]
[]
[]
[]
[]
[]
[]
[]
[]
[]
[]
[]
[]
[]
[]
[]
[]
[]
[]
[]
[]
[]
[]
[]
[]
[]
[]
[]
[]
[]
[]
[]
[]
[]
[]
[]
[]
[]
[]
[]
[]
[]
[]
[]
[]
[]
[]
[]
[]
[]
[]
[]
[]
[]
[]
[]
[]
[]
[]
[]
[]
[]
[]
[]
[]
[]
[]
[]
[]
[]
[]
[]
[]
[]
[]
[]
[]
[]
[]
[]
[]
[]
[]
[]
[]
[]
[]
[]
[]
[]
[]
[]
[]
[]
[]
[]
[]
[]
[]
[]
[]
[]
[]
[]
[]
[]
[]
[]
[]
[]
[]
[]
[]
[]
[]
[]
[]
[]
[]
[]
[]
[]
[]
[]
[]
[]
[]
[]
[]
[]
[]
[]
[]
[]
[]
[]
[]
[]
[]
[]
[]
[]
[]
[]
[]
[]
[]
[]
[]
[]
[]
[]
[]
[]
[]
[]
[]
[]
[]
[]
[]
[]
[]
[]
[]
[]
[]
[]
[]
[]
[]
[]
[]
[]
[]
[]
[]
[]
[]
[]
[]
[]
[]
[]
[]
[]
[]
[]
[]
[]
[]
[]
[]
[]
[]
[]
[]
[]
[]
[]
[]
[]
[]
[]
[]
[]
[]
[]
[]
[]
[]
[]
[]
[]
[]
[]
[]
[]
[]
[]
[]
[]
[]
[]
[]
[]
[]
[]
[]
[]
[]
[]
[]
[]
[]
[]
[]
[]
[]
[]
[]
[]
[]
[]
[]
[]
[]
[]
[]
[]
[]
[]
[]
[]
[]
[]
[]
[]
[]
[]
[]
[]
[]
[]
[]
[]
[]
[]
[]
[]
[]
[]
[]
[]
[]
[]
[]
[]
[]
[]
[]
[]
[]
[]
[]
[]
[]
[]
[]
[]
[]
[]
[]
[]
[]
[]
[]
[]
[]
[]
[]
[]
[]
[]
[]
[]
[]
[]
[]
[]
[]
[]
[]
[]
[]
[]
[]
[]
[]
[]
[]
[]
[]
[]
[]
[]
[]
[]
[]
[]
[]
[]
[]
[]
[]
[]
[]
[]
[]
[]
[]
[]
[]
[]
[]
[]
[]
[]
[]
[]
[]
[]
[]
[]
[]
[]
[]
[]
[]
[]
[]
[]
[]
[]
[]
[]
[]
[]
[]
[]
[]
[]
[]
[]
[]
[]
[]
[]
[]
[]
[]
[]
[]
[]
[]
[]
[]
[]
[]
[]
[]
[]
[]
[]
[]
[]
[]
[]
[]
[]
[]
[]
[]
[]
[]
[]
[]
[]
[]
[]
[]
[]
[]
[]
[]
[]
[]
[]
[]
[]
[]
[]
[]
[]
[]
[]
[]
[]
[]
[]
[]
[]
[]
[]
[]
[]
[]
[]
[]
[]
[]
[]
[]
[]
[]
[]
[]
[]
[]
[]
[]
[]
[]
[]
[]
[]
[]
[]
[]
[]
[]
[]
[]
[]
[]
[]
[]
[]
[]
[]
[]
[]
[]
[]
[]
[]
[]
[]
[]
[]
[]
[]
[]
[]
[]
[]
[]
[]
[]
[]
[]
[]
[]
[]
[]
[]
[]
[]
[]
[]
[]
[]
[]
[]
[]
[]
[]
[]
[]
[]
[]
[]
[]
[]
[]
[]
[]
[]
[]
[]
[]
[]
[]
[]
[]
[]
[]
[]
[]
[]
[]
[]
[]
[]
[]
[]
[]
[]
[]
[]
[]
[]
[]
[]
[]
[]
[]
[]
[]
[]
[]
[]
[]
[]
[]
[]
[]
[]
[]
[]
[]
[]
[]
[]
[]
[]
[]
[]
[]
[]
[]
[]
[]
[]
[]
[]
[]
[]
[]
[]
[]
[]
[]
[]
[]
[]
[]
[]
[]
[]
[]
[]
[]
[]
[]
[]
[]
[]
[]
[]
[]
[]
[]
[]
[]
[]
[]
[]
[]
[]
[]
[]
[]
[]
[]
[]
[]
[]
[]
[]
[]
[]
[]
[]
[]
[]
[]
[]
[]
[]
[]
[]
[]
[]
[]
[]
[]
[]
[]
[]
[]
[]
[]
[]
[]
[]
[]
[]
[]
[]
[]
[]
[]
[]
[]
[]
[]
[]
[]
[]
[]
[]
[]
[]
[]
[]
[]
[]
[]
[]
[]
[]
[]
[]
[]
[]
[]
[]
[]
[]
[]
[]
[]
[]
[]
[]
[]
[]
[]
[]
[]
[]
[]
[]
[]
[]
[]
[]
[]
[]
[]
[]
[]
[]
[]
[]
[]
[]
[]
[]
[]
[]
[]
[]
[]
[]
[]
[]
[]
[]
[]
[]
[]
[]
[]
[]
[]
[]
[]
[]
[]
[]
[]
[]
[]
[]
[]
[]
[]
[]
[]
[]
[]
[]
[]
[]
[]
[]
[]
[]
[]
[]
[]
[]
[]
[]
[]
[]
[]
[]
[]
[]
[]
[]
[]
[]
[]
[]
[]
[]
[]
[]
[]
[]
[]
[]
[]
[]
[]
[]
[]
[]
[]
[]
[]
[]
[]
[]
[]
[]
[]
[]
[]
[]
[]
[]
[]
[]
[]
[]
[]
[]
[]
[]
[]
[]
[]
[]
[]
[]
[]
[]
[]
[]
[]
[]
[]
[]
[]
[]
[]
[]
[]
[]
[]
[]
[]
[]
[]
[]
[]
[]
[]
[]
[]
[]
[]
[]
[]
[]
[]
[]
[]
[]
[]
[]
[]
[]
[]
[]
[]
[]
[]
[]
[]
[]
[]
[]
[]
[]
[]
[]
[]
[]
[]
[]
[]
[]
[]
[]
[]
[]
[]
[]
[]
[]
[]
[]
[]
[]
[]
[]
[]
[]
[]
[]
[]
[]
[]
[]
[]
[]
[]
[]
[]
[]
[]
[]
[]
[]
[]
[]
[]
[]
[]
[]
[]
[]
[]
[]
[]
[]
[]
[]
[]
[]
[]
[]
[]
[]
[]
[]
[]
[]
[]
[]
[]
[]
[]
[]
[]
[]
[]
[]
[]
[]
[]
[]
[]
[]
[]
[]
[]
[]
[]
[]
[]
[]
[]
[]
[]
[]
[]
[]
[]
[]
[]
[]
[]
[]
[]
[]
[]
[]
[]
[]
[]
[]
[]
[]
[]
[]
[]
[]
[]
[]
[]
[]
[]
[]
[]
[]
[]
[]
[]
[]
[]
[]
[]
[]
[]
[]
[]
[]
[]
[]
[]
[]
[]
[]
[]
[]
[]
[]
[]
[]
[]
[]
[]
[]
[]
[]
[]
[]
[]
[]
[]
[]
[]
[]
[]
[]
[]
[]
[]
[]
[]
[]
[]
[]
[]
[]
[]
[]
[]
[]
[]
[]
[]
[]
[]
[]
[]
[]
[]
[]
[]
[]
[]
[]
[]
[]
[]
[]
[]
[]
[]
[]
[]
[]
[]
[]
[]
[]
[]
[]
[]
[]
[]
[]
[]
[]
[]
[]
[]
[]
[]
[]
[]
[]
[]
[]
[]
[]
[]
[]
[]
[]
[]
[]
[]
[]
[]
[]
[]
[]
[]
[]
[]
[]
[]
[]
[]
[]
[]
[]
[]
[]
[]
[]
[]
[]
[]
[]
[]
[]
[]
[]
[]
[]
[]
[]
[]
[]
[]
[]
[]
[]
[]
[]
[]
[]
[]
[]
[]
[]
[]
[]
[]
[]
[]
[]
[]
[]
[]
[]
[]
[]
[]
[]
[]
[]
[]
[]
[]
[]
[]
[]
[]
[]
[]
[]
[]
[]
[]
[]
[]
[]
[]
[]
[]
[]
[]
[]
[]
[]
[]
[]
[]
[]
[]
[]
[]
[]
[]
[]
[]
[]
[]
[]
[]
[]
[]
[]
[]
[]
[]
[]
[]
[]
[]
[]
[]
[]
[]
[]
[]
[]
[]
[]
[]
[]
[]
[]
[]
[]
[]
[]
[]
[]
[]
[]
[]
[]
[]
[]
[]
[]
[]
[]
[]
[]
[]
[]
[]
[]
[]
[]
[]
[]
[]
[]
[]
[]
[]
[]
[]
[]
[]
[]
[]
[]
[]
[]
[]
[]
[]
[]
[]
[]
[]
[]
[]
[]
[]
[]
[]
[]
[]
[]
[]
[]
[]
[]
[]
[]
[]
[]
[]
[]
[]
[]
[]
[]
[]
[]
[]
[]
[]
[]
[]
[]
[]
[]
[]
[]
[]
[]
[]
[]
[]
[]
[]
[]
[]
[]
[]
[]
[]
[]
[]
[]
[]
[]
[]
[]
[]
[]
[]
[]
[]
[]
[]
[]
[]
[]
[]
[]
[]
[]
[]
[]
[]
[]
[]
[]
[]
[]
[]
[]
[]
[]
[]
[]
[]
[]
[]
[]
[]
[]
[]
[]
[]
[]
[]
[]
[]
[]
[]
[]
[]
[]
[]
[]
[]
[]
[]
[]
[]
[]
[]
[]
[]
[]
[]
[]
[]
[]
[]
[]
[]
[]
[]
[]
[]
[]
[]
[]
[]
[]
[]
[]
[]
[]
[]
[]
[]
[]
[]
[]
[]
[]
[]
[]
[]
[]
[]
[]
[]
[]
[]
[]
[]
[]
[]
[]
[]
[]
[]
[]
[]
[]
[]
[]
[]
[]
[]
[]
[]
[]
[]
[]
[]
[]
[]
[]
[]
[]
[]
[]
[]
[]
[]
[]
[]
[]
[]
[]
[]
[]
[]
[]
[]
[]
[]
[]
[]
[]
[]
[]
[]
[]
[]
[]
[]
[]
[]
[]
[]
[]
[]
[]
[]
[]
[]
[]
[]
[]
[]
[]
[]
[]
[]
[]
[]
[]
[]
[]
[]
[]
[]
[]
[]
[]
[]
[]
[]
[]
[]
[]
[]
[]
[]
[]
[]
[]
[]
[]
[]
[]
[]
[]
[]
[]
[]
[]
[]
[]
[]
[]
[]
[]
[]
[]
[]
[]
[]
[]
[]
[]
[]
[]
[]
[]
[]
[]
[]
[]
[]
[]
[]
[]
[]
[]
[]
[]
[]
[]
[]
[]
[]
[]
[]
[]
[]
[]
[]
[]
[]
[]
[]
[]
[]
[]
[]
[]
[]
[]
[]
[]
[]
[]
[]
[]
[]
[]
[]
[]
[]
[]
[]
[]
[]
[]
[]
[]
[]
[]
[]
[]
[]
[]
[]
[]
[]
[]
[]
[]
[]
[]
[]
[]
[]
[]
[]
[]
[]
[]
[]
[]
[]
[]
[]
[]
[]
[]
[]
[]
[]
[]
[]
[]
[]
[]
[]
[]
[]
[]
[]
[]
[]
[]
[]
[]
[]
[]
[]
[]
[]
[]
[]
[]
[]
[]
[]
[]
[]
[]
[]
[]
[]
[]
[]
[]
[]
[]
[]
[]
[]
[]
[]
[]
[]
[]
[]
[]
[]
[]
[]
[]
[]
[]
[]
[]
[]
[]
[]
[]
[]
[]
[]
[]
[]
[]
[]
[]
[]
[]
[]
[]
[]
[]
[]
[]
[]
[]
[]
[]
[]
[]
[]
[]
[]
[]
[]
[]
[]
[]
[]
[]
[]
[]
[]
[]
[]
[]
[]
[]
[]
[]
[]
[]
[]
[]
[]
[]
[]
[]
[]
[]
[]
[]
[]
[]
[]
[]
[]
[]
[]
[]
[]
[]
[]
[]
[]
[]
[]
[]
[]
[]
[]
[]
[]
[]
[]
[]
[]
[]
[]
[]
[]
[]
[]
[]
[]
[]
[]
[]
[]
[]
[]
[]
[]
[]
[]
[]
[]
[]
[]
[]
[]
[]
[]
[]
[]
[]
[]
[]
[]
[]
[]
[]
[]
[]
[]
[]
[]
[]
[]
[]
[]
[]
[]
[]
[]
[]
[]
[]
[]
[]
[]
[]
[]
[]
[]
[]
[]
[]
[]
[]
[]
[]
[]
[]
[]
[]
[]
[]
[]
[]
[]
[]
[]
[]
[]
[]
[]
[]
[]
[]
[]
[]
[]
[]
[]
[]
[]
[]
[]
[]
[]
[]
[]
[]
[]
[]
[]
[]
[]
[]
[]
[]
[]
[]
[]
[]
[]
[]
[]
[]
[]
[]
[]
[]
[]
[]
[]
[]
[]
[]
[]
[]
[]
[]
[]
[]
[]
[]
[]
[]
[]
[]
[]
[]
[]
[]
[]
[]
[]
[]
[]
[]
[]
[]
[]
[]
[]
[]
[]
[]
[]
[]
[]
[]
[]
[]
[]
[]
[]
[]
[]
[]
[]
[]
[]
[]
[]
[]
[]
[]
[]
[]
[]
[]
[]
[]
[]
[]
[]
[]
[]
[]
[]
[]
[]
[]
[]
[]
[]
[]
[]
[]
[]
[]
[]
[]
[]
[]
[]
[]
[]
[]
[]
[]
[]
[]
[]
[]
[]
[]
[]
[]
[]
[]
[]
[]
[]
[]
[]
[]
[]
[]
[]
[]
[]
[]
[]
[]
[]
[]
[]
[]
[]
[]
[]
[]
[]
[]
[]
[]
[]
[]
[]
[]
[]
[]
[]
[]
[]
[]
[]
[]
[]
[]
[]
[]
[]
[]
[]
[]
[]
[]
[]
[]
[]
[]
[]
[]
[]
[]
[]
[]
[]
[]
[]
[]
[]
[]
[]
[]
[]
[]
[]
[]
[]
[]
[]
[]
[]
[]
[]
[]
[]
[]
[]
[]
[]
[]
[]
[]
[]
[]
[]
[]
[]
[]
[]
[]
[]
[]
[]
[]
[]
[]
[]
[]
[]
[]
[]
[]
[]
[]
[]
[]
[]
[]
[]
[]
[]
[]
[]
[]
[]
[]
[]
[]
[]
[]
[]
[]
[]
[]
[]
[]
[]
[]
[]
[]
[]
[]
[]
[]
[]
[]
[]
[]
[]
[]
[]
[]
[]
[]
[]
[]
[]
[]
[]
[]
[]
[]
[]
[]
[]
[]
[]
[]
[]
[]
[]
[]
[]
[]
[]
[]
[]
[]
[]
[]
[]
[]
[]
[]
[]
[]
[]
[]
[]
[]
[]
[]
[]
[]
[]
[]
[]
[]
[]
[]
[]
[]
[]
[]
[]
[]
[]
[]
[]
[]
[]
[]
[]
[]
[]
[]
[]
[]
[]
[]
[]
[]
[]
[]
[]
[]
[]
[]
[]
[]
[]
[]
[]
[]
[]
[]
[]
[]
[]
[]
[]
[]
[]
[]
[]
[]
[]
[]
[]
[]
[]
[]
[]
[]
[]
[]
[]
[]
[]
[]
[]
[]
[]
[]
[]
[]
[]
[]
[]
[]
[]
[]
[]
[]
[]
[]
[]
[]
[]
[]
[]
[]
[]
[]
[]
[]
[]
[]
[]
[]
[]
[]
[]
[]
[]
[]
[]
[]
[]
[]
[]
[]
[]
[]
[]
[]
[]
[]
[]
[]
[]
[]
[]
[]
[]
[]
[]
[]
[]
[]
[]
[]
[]
[]
[]
[]
[]
[]
[]
[]
[]
[]
[]
[]
[]
[]
[]
[]
[]
[]
[]
[]
[]
[]
[]
[]
[]
[]
[]
[]
[]
[]
[]
[]
[]
[]
[]
[]
[]
[]
[]
[]
[]
[]
[]
[]
[]
[]
[]
[]
[]
[]
[]
[]
[]
[]
[]
[]
[]
[]
[]
[]
[]
[]
[]
[]
[]
[]
[]
[]
[]
[]
[]
[]
[]
[]
[]
[]
[]
[]
[]
[]
[]
[]
[]
[]
[]
[]
[]
[]
[]
[]
[]
[]
[]
[]
[]
[]
[]
[]
[]
[]
[]
[]
[]
[]
[]
[]
[]
[]
[]
[]
[]
[]
[]
[]
[]
[]
[]
[]
[]
[]
[]
[]
[]
[]
[]
[]
[]
[]
[]
[]
[]
[]
[]
[]
[]
[]
[]
[]
[]
[]
[]
[]
[]
[]
[]
[]
[]
[]
[]
[]
[]
[]
[]
[]
[]
[]
[]
[]
[]
[]
[]
[]
[]
[]
[]
[]
[]
[]
[]
[]
[]
[]
[]
[]
[]
[]
[]
[]
[]
[]
[]
[]
[]
[]
[]
[]
[]
[]
[]
[]
[]
[]
[]
[]
[]
[]
[]
[]
[]
[]
[]
[]
[]
[]
[]
[]
[]
[]
[]
[]
[]
[]
[]
[]
[]
[]
[]
[]
[]
[]
[]
[]
[]
[]
[]
[]
[]
[]
[]
[]
[]
[]
[]
[]
[]
[]
[]
[]
[]
[]
[]
[]
[]
[]
[]
[]
[]
[]
[]
[]
[]
[]
[]
[]
[]
[]
[]
[]
[]
[]
[]
[]
[]
[]
[]
[]
[]
[]
[]
[]
[]
[]
[]
[]
[]
[]
[]
[]
[]
[]
[]
[]
[]
[]
[]
[]
[]
[]
[]
[]
[]
[]
[]
[]
[]
[]
[]
[]
[]
[]
[]
[]
[]
[]
[]
[]
[]
[]
[]
[]
[]
[]
[]
[]
[]
[]
[]
[]
[]
[]
[]
[]
[]
[]
[]
[]
[]
[]
[]
[]
[]
[]
[]
[]
[]
[]
[]
[]
[]
[]
[]
[]
[]
[]
[]
[]
[]
[]
[]
[]
[]
[]
[]
[]
[]
[]
[]
[]
[]
[]
[]
[]
[]
[]
[]
[]
[]
[]
[]
[]
[]
[]
[]
[]
[]
[]
[]
[]
[]
[]
[]
[]
[]
[]
[]
[]
[]
[]
[]
[]
[]
[]
[]
[]
[]
[]
[]
[]
[]
[]
[]
[]
[]
[]
[]
[]
[]
[]
[]
[]
[]
[]
[]
[]
[]
[]
[]
[]
[]
[]
[]
[]
[]
[]
[]
[]
[]
[]
[]
[]
[]
[]
[]
[]
[]
[]
[]
[]
[]
[]
[]
[]
[]
[]
[]
[]
[]
[]
[]
[]
[]
[]
[]
[]
[]
[]
[]
[]
[]
[]
[]
[]
[]
[]
[]
[]
[]
[]
[]
[]
[]
[]
[]
[]
[]
[]
[]
[]
[]
[]
[]
[]
[]
[]
[]
[]
[]
[]
[]
[]
[]
[]
[]
[]
[]
[]
[]
[]
[]
[]
[]
[]
[]
[]
[]
[]
[]
[]
[]
[]
[]
[]
[]
[]
[]
[]
[]
[]
[]
[]
[]
[]
[]
[]
[]
[]
[]
[]
[]
[]
[]
[]
[]
[]
[]
[]
[]
[]
[]
[]
[]
[]
[]
[]
[]
[]
[]
[]
[]
[]
[]
[]
[]
[]
[]
[]
[]
[]
[]
[]
[]
[]
[]
[]
[]
[]
[]
[]
[]
[]
[]
[]
[]
[]
[]
[]
[]
[]
[]
[]
[]
[]
[]
[]
[]
[]
[]
[]
[]
[]
[]
[]
[]
[]
[]
[]
[]
[]
[]
[]
[]
[]
[]
[]
[]
[]
[]
[]
[]
[]
[]
[]
[]
[]
[]
[]
[]
[]
[]
[]
[]
[]
[]
[]
[]
[]
[]
[]
[]
[]
[]
[]
[]
[]
[]
[]
[]
[]
[]
[]
[]
[]
[]
[]
[]
[]
[]
[]
[]
[]
[]
[]
[]
[]
[]
[]
[]
[]
[]
[]
[]
[]
[]
[]
[]
[]
[]
[]
[]
[]
[]
[]
[]
[]
[]
[]
[]
[]
[]
[]
[]
[]
[]
[]
[]
[]
[]
[]
[]
[]
[]
[]
[]
[]
[]
[]
[]
[]
[]
[]
[]
[]
[]
[]
[]
[]
[]
[]
[]
[]
[]
[]
[]
[]
[]
[]
[]
[]
[]
[]
[]
[]
[]
[]
[]
[]
[]
[]
[]
[]
[]
[]
[]
[]
[]
[]
[]
[]
[]
[]
[]
[]
[]
[]
[]
[]
[]
[]
[]
[]
[]
[]
[]
[]
[]
[]
[]
[]
[]
[]
[]
[]
[]
[]
[]
[]
[]
[]
[]
[]
[]
[]
[]
[]
[]
[]
[]
[]
[]
[]
[]
[]
[]
[]
[]
[]
[]
[]
[]
[]
[]
[]
[]
[]
[]
[]
[]
[]
[]
[]
[]
[]
[]
[]
[]
[]
[]
[]
[]
[]
[]
[]
[]
[]
[]
[]
[]
[]
[]
[]
[]
[]
[]
[]
[]
[]
[]
[]
[]
[]
[]
[]
[]
[]
[]
[]
[]
[]
[]
[]
[]
[]
[]
[]
[]
[]
[]
[]
[]
[]
[]
[]
[]
[]
[]
[]
[]
[]
[]
[]
[]
[]
[]
[]
[]
[]
[]
[]
[]
[]
[]
[]
[]
[]
[]
[]
[]
[]
[]
[]
[]
[]
[]
[]
[]
[]
[]
[]
[]
[]
[]
[]
[]
[]
[]
[]
[]
[]
[]
[]
[]
[]
[]
[]
[]
[]
[]
[]
[]
[]
[]
[]
[]
[]
[]
[]
[]
[]
[]
[]
[]
[]
[]
[]
[]
[]
[]
[]
[]
[]
[]
[]
[]
[]
[]
[]
[]
[]
[]
[]
[]
[]
[]
[]
[]
[]
[]
[]
[]
[]
[]
[]
[]
[]
[]
[]
[]
[]
[]
[]
[]
[]
[]
[]
[]
[]
[]
[]
[]
[]
[]
[]
[]
[]
[]
[]
[]
[]
[]
[]
[]
[]
[]
[]
[]
[]
[]
[]
[]
[]
[]
[]
[]
[]
[]
[]
[]
[]
[]
[]
[]
[]
[]
[]
[]
[]
[]
[]
[]
[]
[]
[]
[]
[]
[]
[]
[]
[]
[]
[]
[]
[]
[]
[]
[]
[]
[]
[]
[]
[]
[]
[]
[]
[]
[]
[]
[]
[]
[]
[]
[]
[]
[]
[]
[]
[]
[]
[]
[]
[]
[]
[]
[]
[]
[]
[]
[]
[]
[]
[]
[]
[]
[]
[]
[]
[]
[]
[]
[]
[]
[]
[]
[]
[]
[]
[]
[]
[]
[]
[]
[]
[]
[]
[]
[]
[]
[]
[]
[]
[]
[]
[]
[]
[]
[]
[]
[]
[null,null,null,null,null,null,null,null,null,null,null,null,null,false]

{"sheet":"이름지정","index":4,"n_rows":637,"n_cols":5,"rows_kept":637,"cut":false,"hidden":true,"merged":[]}
["년도","월","연도","날짜","휴일명"]
[2010,1,{"$f":"YEAR(D2)","v":2010},"2010-02-13","설날"]
[2011,2,{"$f":"YEAR(D3)","v":2010},"2010-02-14","설날"]
[2012,3,2010,"2010-02-15","설날"]
[2013,4,2010,"2010-05-21","석가탄신일"]
[2014,5,2010,"2010-09-21","추석"]
[2015,6,2010,"2010-09-22","추석"]
[2016,7,2010,"2010-09-23","추석"]
[2017,8,2011,"2011-02-02","설날"]
[2018,9,2011,"2011-02-03","설날"]
[2019,10,2011,"2011-02-04","설날"]
[2020,11,2011,"2011-05-10","석가탄신일"]
[2021,12,2011,"2011-09-11","추석"]
[2022,null,2011,"2011-09-12","추석"]
[2023,null,2011,"2011-09-13","추석"]
[2024,null,2012,"2012-01-22","설날"]
[2025,null,2012,"2012-01-23","설날"]
[2026,null,2012,"2012-01-24","설날"]
[2027,null,2012,"2012-05-28","석가탄신일"]
[2028,null,2012,"2012-09-29","추석"]
[2029,null,2012,"2012-09-30","추석"]
[2030,null,2012,"2012-10-01","추석"]
[2031,null,2013,"2013-02-09","설날"]
[2032,null,2013,"2013-02-10","설날"]
[2033,null,2013,"2013-02-11","설날"]
[2034,null,2013,"2013-05-17","석가탄신일"]
[2035,null,2013,"2013-09-18","추석"]
[2036,null,2013,"2013-09-19","추석"]
[2037,null,2013,"2013-09-20","추석"]
[2038,null,2014,"2014-01-30","설날"]
[2039,null,2014,"2014-01-31","설날"]
[2040,null,2014,"2014-02-01","설날"]
[2041,null,2014,"2014-05-06","석가탄신일"]
[2042,null,2014,"2014-09-07","추석"]
[2043,null,2014,"2014-09-08","추석"]
[2044,null,2014,"2014-09-09","추석"]
[2045,null,2015,"2015-02-18","설날"]
[2046,null,2015,"2015-02-19","설날"]
[2047,null,2015,"2015-02-20","설날"]
[2048,null,2015,"2015-05-25","석가탄신일"]
[2049,null,2015,"2015-09-26","추석"]
[2050,null,2015,"2015-09-27","추석"]
[2051,null,2015,"2015-09-28","추석"]
[2052,null,2016,"2016-02-08","설날"]
[2053,null,2016,"2016-02-09","설날"]
[2054,null,2016,"2016-02-10","설날"]
[2055,null,2016,"2016-05-14","석가탄신일"]
[2056,null,2016,"2016-09-14","추석"]
[2057,null,2016,"2016-09-15","추석"]
[2058,null,2016,"2016-09-16","추석"]
[2059,null,2017,"2017-01-27","설날"]
[2060,null,2017,"2017-01-28","설날"]
[2061,null,2017,"2017-01-29","설날"]
[2062,null,2017,"2017-05-03","석가탄신일"]
[2063,null,2017,"2017-10-03","추석"]
[2064,null,2017,"2017-10-04","추석"]
[2065,null,2017,"2017-10-05","추석"]
[2066,null,2018,"2018-02-15","설날"]
[2067,null,2018,"2018-02-16","설날"]
[2068,null,2018,"2018-02-17","설날"]
[2069,null,2018,"2018-05-22","석가탄신일"]
[2070,null,2018,"2018-09-23","추석"]
[2071,null,2018,"2018-09-24","추석"]
[2072,null,2018,"2018-09-25","추석"]
[2073,null,2019,"2019-02-04","설날"]
[2074,null,2019,"2019-02-05","설날"]
[2075,null,{"$f":"YEAR(D67)","v":2019},"2019-02-06","설날"]
[2076,null,2019,"2019-05-12","석가탄신일"]
[2077,null,2019,"2019-09-12","추석"]
[2078,null,2019,"2019-09-13","추석"]
[2079,null,2019,"2019-09-14","추석"]
[2080,null,2020,"2020-01-24","설날"]
[2081,null,2020,"2020-01-25","설날"]
[2082,null,2020,"2020-01-26","설날"]
[2083,null,2020,"2020-04-30","석가탄신일"]
[2084,null,2020,"2020-09-30","추석"]
[2085,null,2020,"2020-10-01","추석"]
[2086,null,2020,"2020-10-02","추석"]
[2087,null,2021,"2021-02-11","설날"]
[2088,null,2021,"2021-02-12","설날"]
[2089,null,2021,"2021-02-13","설날"]
[2090,null,2021,"2021-05-19","석가탄신일"]
[2091,null,2021,"2021-09-20","추석"]
[2092,null,2021,"2021-09-21","추석"]
[2093,null,2021,"2021-09-22","추석"]
[2094,null,2022,"2022-01-31","설날"]
[2095,null,2022,"2022-02-01","설날"]
[2096,null,2022,"2022-02-02","설날"]
[2097,null,2022,"2022-05-08","석가탄신일"]
[2098,null,2022,"2022-09-09","추석"]
[2099,null,2022,"2022-09-10","추석"]
[2100,null,2022,"2022-09-11","추석"]
[null,null,2023,"2023-01-21","설날"]
[null,null,2023,"2023-01-22","설날"]
[null,null,2023,"2023-01-23","설날"]
[null,null,2023,"2023-05-27","석가탄신일"]
[null,null,2023,"2023-09-28","추석"]
[null,null,2023,"2023-09-29","추석"]
[null,null,2023,"2023-09-30","추석"]
[null,null,2024,"2024-02-09","설날"]
[null,null,2024,"2024-02-10","설날"]
[null,null,2024,"2024-02-11","설날"]
[null,null,2024,"2024-05-15","석가탄신일"]
[null,null,2024,"2024-09-16","추석"]
[null,null,2024,"2024-09-17","추석"]
[null,null,2024,"2024-09-18","추석"]
[null,null,2025,"2025-01-28","설날"]
[null,null,2025,"2025-01-29","설날"]
[null,null,2025,"2025-01-30","설날"]
[null,null,2025,"2025-05-05","석가탄신일"]
[null,null,2025,"2025-10-05","추석"]
[null,null,2025,"2025-10-06","추석"]
[null,null,2025,"2025-10-07","추석"]
[null,null,2026,"2026-02-16","설날"]
[null,null,2026,"2026-02-17","설날"]
[null,null,2026,"2026-02-18","설날"]
[null,null,2026,"2026-05-24","석가탄신일"]
[null,null,2026,"2026-09-24","추석"]
[null,null,2026,"2026-09-25","추석"]
[null,null,2026,"2026-09-26","추석"]
[null,null,2027,"2027-02-06","설날"]
[null,null,2027,"2027-02-07","설날"]
[null,null,2027,"2027-02-08","설날"]
[null,null,2027,"2027-05-13","석가탄신일"]
[null,null,2027,"2027-09-14","추석"]
[null,null,2027,"2027-09-15","추석"]
[null,null,2027,"2027-09-16","추석"]
[null,null,2028,"2028-01-26","설날"]
[null,null,2028,"2028-01-27","설날"]
[null,null,2028,"2028-01-28","설날"]
[null,null,{"$f":"YEAR(D131)","v":2028},"2028-05-02","석가탄신일"]
[null,null,2028,"2028-10-02","추석"]
[null,null,2028,"2028-10-03","추석"]
[null,null,2028,"2028-10-04","추석"]
[null,null,2029,"2029-02-12","설날"]
[null,null,2029,"2029-02-13","설날"]
[null,null,2029,"2029-02-14","설날"]
[null,null,2029,"2029-05-20","석가탄신일"]
[null,null,2029,"2029-09-21","추석"]
[null,null,2029,"2029-09-22","추석"]
[null,null,2029,"2029-09-23","추석"]
[null,null,2030,"2030-02-02","설날"]
[null,null,2030,"2030-02-03","설날"]
[null,null,2030,"2030-02-04","설날"]
[null,null,2030,"2030-05-09","석가탄신일"]
[null,null,2030,"2030-09-11","추석"]
[null,null,2030,"2030-09-12","추석"]
[null,null,2030,"2030-09-13","추석"]
[null,null,2031,"2031-01-22","설날"]
[null,null,2031,"2031-01-23","설날"]
[null,null,2031,"2031-01-24","설날"]
[null,null,2031,"2031-05-28","석가탄신일"]
[null,null,2031,"2031-09-30","추석"]
[null,null,2031,"2031-10-01","추석"]
[null,null,2031,"2031-10-02","추석"]
[null,null,2032,"2032-02-10","설날"]
[null,null,2032,"2032-02-11","설날"]
[null,null,2032,"2032-02-12","설날"]
[null,null,2032,"2032-05-16","석가탄신일"]
[null,null,2032,"2032-09-18","추석"]
[null,null,2032,"2032-09-19","추석"]
[null,null,2032,"2032-09-20","추석"]
[null,null,2033,"2033-01-30","설날"]
[null,null,2033,"2033-01-31","설날"]
[null,null,2033,"2033-02-01","설날"]
[null,null,2033,"2033-05-06","석가탄신일"]
[null,null,2033,"2033-10-06","추석"]
[null,null,2033,"2033-10-07","추석"]
[null,null,2033,"2033-10-08","추석"]
[null,null,2034,"2034-02-18","설날"]
[null,null,2034,"2034-02-19","설날"]
[null,null,2034,"2034-02-20","설날"]
[null,null,2034,"2034-05-25","석가탄신일"]
[null,null,2034,"2034-09-26","추석"]
[null,null,2034,"2034-09-27","추석"]
[null,null,2034,"2034-09-28","추석"]
[null,null,2035,"2035-02-07","설날"]
[null,null,2035,"2035-02-08","설날"]
[null,null,2035,"2035-02-09","설날"]
[null,null,2035,"2035-05-15","석가탄신일"]
[null,null,2035,"2035-09-15","추석"]
[null,null,2035,"2035-09-16","추석"]
[null,null,2035,"2035-09-17","추석"]
[null,null,2036,"2036-01-27","설날"]
[null,null,2036,"2036-01-28","설날"]
[null,null,2036,"2036-01-29","설날"]
[null,null,2036,"2036-05-03","석가탄신일"]
[null,null,2036,"2036-10-03","추석"]
[null,null,2036,"2036-10-04","추석"]
[null,null,2036,"2036-10-05","추석"]
[null,null,2037,"2037-02-14","설날"]
[null,null,2037,"2037-02-15","설날"]
[null,null,2037,"2037-02-16","설날"]
[null,null,2037,"2037-05-22","석가탄신일"]
[null,null,{"$f":"YEAR(D195)","v":2037},"2037-09-23","추석"]
[null,null,2037,"2037-09-24","추석"]
[null,null,2037,"2037-09-25","추석"]
[null,null,2038,"2038-02-03","설날"]
[null,null,2038,"2038-02-04","설날"]
[null,null,2038,"2038-02-05","설날"]
[null,null,2038,"2038-05-11","석가탄신일"]
[null,null,2038,"2038-09-12","추석"]
[null,null,2038,"2038-09-13","추석"]
[null,null,2038,"2038-09-14","추석"]
[null,null,2039,"2039-01-23","설날"]
[null,null,2039,"2039-01-24","설날"]
[null,null,2039,"2039-01-25","설날"]
[null,null,2039,"2039-04-30","석가탄신일"]
[null,null,2039,"2039-10-01","추석"]
[null,null,2039,"2039-10-02","추석"]
[null,null,2039,"2039-10-03","추석"]
[null,null,2040,"2040-02-11","설날"]
[null,null,2040,"2040-02-12","설날"]
[null,null,2040,"2040-02-13","설날"]
[null,null,2040,"2040-05-18","석가탄신일"]
[null,null,2040,"2040-09-20","추석"]
[null,null,2040,"2040-09-21","추석"]
[null,null,2040,"2040-09-22","추석"]
[null,null,2041,"2041-01-31","설날"]
[null,null,2041,"2041-02-01","설날"]
[null,null,2041,"2041-02-02","설날"]
[null,null,2041,"2041-05-07","석가탄신일"]
[null,null,2041,"2041-09-09","추석"]
[null,null,2041,"2041-09-10","추석"]
[null,null,2041,"2041-09-11","추석"]
[null,null,2042,"2042-01-21","설날"]
[null,null,2042,"2042-01-22","설날"]
[null,null,2042,"2042-01-23","설날"]
[null,null,2042,"2042-05-26","석가탄신일"]
[null,null,2042,"2042-09-27","추석"]
[null,null,2042,"2042-09-28","추석"]
[null,null,2042,"2042-09-29","추석"]
[null,null,2043,"2043-02-09","설날"]
[null,null,2043,"2043-02-10","설날"]
[null,null,2043,"2043-02-11","설날"]
[null,null,2043,"2043-05-16","석가탄신일"]
[null,null,2043,"2043-09-16","추석"]
[null,null,2043,"2043-09-17","추석"]
[null,null,2043,"2043-09-18","추석"]
[null,null,2044,"2044-01-29","설날"]
[null,null,2044,"2044-01-30","설날"]
[null,null,2044,"2044-01-31","설날"]
[null,null,2044,"2044-05-05","석가탄신일"]
[null,null,2044,"2044-10-04","추석"]
[null,null,2044,"2044-10-05","추석"]
[null,null,2044,"2044-10-06","추석"]
[null,null,2045,"2045-02-16","설날"]
[null,null,2045,"2045-02-17","설날"]
[null,null,2045,"2045-02-18","설날"]
[null,null,2045,"2045-05-24","석가탄신일"]
[null,null,2045,"2045-09-24","추석"]
[null,null,2045,"2045-09-25","추석"]
[null,null,2045,"2045-09-26","추석"]
[null,null,2046,"2046-02-05","설날"]
[null,null,2046,"2046-02-06","설날"]
[null,null,2046,"2046-02-07","설날"]
[null,null,2046,"2046-05-13","석가탄신일"]
[null,null,2046,"2046-09-14","추석"]
[null,null,{"$f":"YEAR(D259)","v":2046},"2046-09-15","추석"]
[null,null,2046,"2046-09-16","추석"]
[null,null,2047,"2047-01-25","설날"]
[null,null,2047,"2047-01-26","설날"]
[null,null,2047,"2047-01-27","설날"]
[null,null,2047,"2047-05-02","석가탄신일"]
[null,null,2047,"2047-10-04","추석"]
[null,null,2047,"2047-10-05","추석"]
[null,null,2048,"2048-02-13","설날"]
[null,null,2048,"2048-02-14","설날"]
[null,null,2048,"2048-02-15","설날"]
[null,null,2048,"2048-05-20","석가탄신일"]
[null,null,2048,"2048-09-21","추석"]
[null,null,2048,"2048-09-22","추석"]
[null,null,2048,"2048-09-23","추석"]
[null,null,2049,"2049-02-01","설날"]
[null,null,2049,"2049-02-02","설날"]
[null,null,2049,"2049-02-03","설날"]
[null,null,2049,"2049-05-09","석가탄신일"]
[null,null,2049,"2049-09-10","추석"]
[null,null,2049,"2049-09-11","추석"]
[null,null,2049,"2049-09-12","추석"]
[null,null,2050,"2050-01-22","설날"]
[null,null,2050,"2050-01-23","설날"]
[null,null,2050,"2050-01-24","설날"]
[null,null,2050,"2050-05-28","석가탄신일"]
[null,null,2050,"2050-09-29","추석"]
[null,null,2050,"2050-09-30","추석"]
[null,null,2050,"2050-10-01","추석"]
[null,null,2051,"2051-02-10","설날"]
[null,null,2051,"2051-02-11","설날"]
[null,null,2051,"2051-02-12","설날"]
[null,null,2051,"2051-05-17","석가탄신일"]
[null,null,2051,"2051-09-18","추석"]
[null,null,2051,"2051-09-19","추석"]
[null,null,2051,"2051-09-20","추석"]
[null,null,2052,"2052-01-31","설날"]
[null,null,2052,"2052-02-01","설날"]
[null,null,2052,"2052-02-02","설날"]
[null,null,2052,"2052-05-06","석가탄신일"]
[null,null,2052,"2052-09-06","추석"]
[null,null,2052,"2052-09-07","추석"]
[null,null,2052,"2052-09-08","추석"]
[null,null,2053,"2053-02-18","설날"]
[null,null,2053,"2053-02-19","설날"]
[null,null,2053,"2053-02-20","설날"]
[null,null,2053,"2053-05-25","석가탄신일"]
[null,null,2053,"2053-09-25","추석"]
[null,null,2053,"2053-09-26","추석"]
[null,null,2053,"2053-09-27","추석"]
[null,null,2054,"2054-02-07","설날"]
[null,null,2054,"2054-02-08","설날"]
[null,null,2054,"2054-02-09","설날"]
[null,null,2054,"2054-05-15","석가탄신일"]
[null,null,2054,"2054-09-15","추석"]
[null,null,2054,"2054-09-16","추석"]
[null,null,2054,"2054-09-17","추석"]
[null,null,2055,"2055-01-27","설날"]
[null,null,2055,"2055-01-28","설날"]
[null,null,2055,"2055-01-29","설날"]
[null,null,2055,"2055-05-04","석가탄신일"]
[null,null,2055,"2055-10-04","추석"]
[null,null,2055,"2055-10-05","추석"]
[null,null,2055,"2055-10-06","추석"]
[null,null,{"$f":"YEAR(D323)","v":2056},"2056-02-14","설날"]
[null,null,2056,"2056-02-15","설날"]
[null,null,2056,"2056-02-16","설날"]
[null,null,2056,"2056-05-22","석가탄신일"]
[null,null,2056,"2056-09-23","추석"]
[null,null,2056,"2056-09-24","추석"]
[null,null,2056,"2056-09-25","추석"]
[null,null,2057,"2057-02-03","설날"]
[null,null,2057,"2057-02-04","설날"]
[null,null,2057,"2057-02-05","설날"]
[null,null,2057,"2057-05-11","석가탄신일"]
[null,null,2057,"2057-09-12","추석"]
[null,null,2057,"2057-09-13","추석"]
[null,null,2057,"2057-09-14","추석"]
[null,null,2058,"2058-01-23","설날"]
[null,null,2058,"2058-01-24","설날"]
[null,null,2058,"2058-01-25","설날"]
[null,null,2058,"2058-04-30","석가탄신일"]
[null,null,2058,"2058-10-01","추석"]
[null,null,2058,"2058-10-02","추석"]
[null,null,2058,"2058-10-03","추석"]
[null,null,2059,"2059-02-11","설날"]
[null,null,2059,"2059-02-12","설날"]
[null,null,2059,"2059-02-13","설날"]
[null,null,2059,"2059-05-19","석가탄신일"]
[null,null,2059,"2059-09-20","추석"]
[null,null,2059,"2059-09-21","추석"]
[null,null,2059,"2059-09-22","추석"]
[null,null,2060,"2060-02-01","설날"]
[null,null,2060,"2060-02-02","설날"]
[null,null,2060,"2060-02-03","설날"]
[null,null,2060,"2060-05-07","석가탄신일"]
[null,null,2060,"2060-09-08","추석"]
[null,null,2060,"2060-09-09","추석"]
[null,null,2060,"2060-09-10","추석"]
[null,null,2061,"2061-01-21","설날"]
[null,null,2061,"2061-01-22","설날"]
[null,null,2061,"2061-01-23","설날"]
[null,null,2061,"2061-05-26","석가탄신일"]
[null,null,2061,"2061-09-27","추석"]
[null,null,2061,"2061-09-28","추석"]
[null,null,2061,"2061-09-29","추석"]
[null,null,2062,"2062-02-08","설날"]
[null,null,2062,"2062-02-09","설날"]
[null,null,2062,"2062-02-10","설날"]
[null,null,2062,"2062-05-16","석가탄신일"]
[null,null,2062,"2062-09-16","추석"]
[null,null,2062,"2062-09-17","추석"]
[null,null,2062,"2062-09-18","추석"]
[null,null,2063,"2063-01-28","설날"]
[null,null,2063,"2063-01-29","설날"]
[null,null,2063,"2063-01-30","설날"]
[null,null,2063,"2063-05-06","석가탄신일"]
[null,null,2063,"2063-10-05","추석"]
[null,null,2063,"2063-10-06","추석"]
[null,null,2063,"2063-10-07","추석"]
[null,null,2064,"2064-02-16","설날"]
[null,null,2064,"2064-02-17","설날"]
[null,null,2064,"2064-02-18","설날"]
[null,null,2064,"2064-05-23","석가탄신일"]
[null,null,2064,"2064-09-24","추석"]
[null,null,2064,"2064-09-25","추석"]
[null,null,2064,"2064-09-26","추석"]
[null,null,2065,"2065-02-04","설날"]
[null,null,{"$f":"YEAR(D387)","v":2065},"2065-02-05","설날"]
[null,null,2065,"2065-02-06","설날"]
[null,null,2065,"2065-05-12","석가탄신일"]
[null,null,2065,"2065-09-14","추석"]
[null,null,2065,"2065-09-15","추석"]
[null,null,2065,"2065-09-16","추석"]
[null,null,2066,"2066-01-25","설날"]
[null,null,2066,"2066-01-26","설날"]
[null,null,2066,"2066-01-27","설날"]
[null,null,2066,"2066-05-01","석가탄신일"]
[null,null,2066,"2066-10-02","추석"]
[null,null,2066,"2066-10-03","추석"]
[null,null,2066,"2066-10-04","추석"]
[null,null,2067,"2067-02-13","설날"]
[null,null,2067,"2067-02-14","설날"]
[null,null,2067,"2067-02-15","설날"]
[null,null,2067,"2067-05-20","석가탄신일"]
[null,null,2067,"2067-09-22","추석"]
[null,null,2067,"2067-09-23","추석"]
[null,null,2067,"2067-09-24","추석"]
[null,null,2068,"2068-02-02","설날"]
[null,null,2068,"2068-02-03","설날"]
[null,null,2068,"2068-02-04","설날"]
[null,null,2068,"2068-05-09","석가탄신일"]
[null,null,2068,"2068-09-10","추석"]
[null,null,2068,"2068-09-11","추석"]
[null,null,2068,"2068-09-12","추석"]
[null,null,2069,"2069-01-22","설날"]
[null,null,2069,"2069-01-23","설날"]
[null,null,2069,"2069-01-24","설날"]
[null,null,2069,"2069-04-28","석가탄신일"]
[null,null,2069,"2069-09-28","추석"]
[null,null,2069,"2069-09-29","추석"]
[null,null,2069,"2069-09-30","추석"]
[null,null,2070,"2070-02-10","설날"]
[null,null,2070,"2070-02-11","설날"]
[null,null,2070,"2070-02-12","설날"]
[null,null,2070,"2070-05-17","석가탄신일"]
[null,null,2070,"2070-09-18","추석"]
[null,null,2070,"2070-09-19","추석"]
[null,null,2070,"2070-09-20","추석"]
[null,null,2071,"2071-01-30","설날"]
[null,null,2071,"2071-01-31","설날"]
[null,null,2071,"2071-02-01","설날"]
[null,null,2071,"2071-05-07","석가탄신일"]
[null,null,2071,"2071-09-07","추석"]
[null,null,2071,"2071-09-08","추석"]
[null,null,2071,"2071-09-09","추석"]
[null,null,2072,"2072-02-18","설날"]
[null,null,2072,"2072-02-19","설날"]
[null,null,2072,"2072-02-20","설날"]
[null,null,2072,"2072-05-25","석가탄신일"]
[null,null,2072,"2072-09-25","추석"]
[null,null,2072,"2072-09-26","추석"]
[null,null,2072,"2072-09-27","추석"]
[null,null,2073,"2073-02-06","설날"]
[null,null,2073,"2073-02-07","설날"]
[null,null,2073,"2073-02-08","설날"]
[null,null,2073,"2073-05-14","석가탄신일"]
[null,null,2073,"2073-09-15","추석"]
[null,null,2073,"2073-09-16","추석"]
[null,null,2073,"2073-09-17","추석"]
[null,null,2074,"2074-01-26","설날"]
[null,null,2074,"2074-01-27","설날"]
[null,null,{"$f":"YEAR(D451)","v":2074},"2074-01-28","설날"]
[null,null,2074,"2074-05-03","석가탄신일"]
[null,null,2074,"2074-10-04","추석"]
[null,null,2074,"2074-10-05","추석"]
[null,null,2074,"2074-10-06","추석"]
[null,null,2075,"2075-02-14","설날"]
[null,null,2075,"2075-02-15","설날"]
[null,null,2075,"2075-02-16","설날"]
[null,null,2075,"2075-05-22","석가탄신일"]
[null,null,2075,"2075-09-23","추석"]
[null,null,2075,"2075-09-24","추석"]
[null,null,2075,"2075-09-25","추석"]
[null,null,2076,"2076-02-04","설날"]
[null,null,2076,"2076-02-05","설날"]
[null,null,2076,"2076-02-06","설날"]
[null,null,2076,"2076-05-10","석가탄신일"]
[null,null,2076,"2076-09-11","추석"]
[null,null,2076,"2076-09-12","추석"]
[null,null,2076,"2076-09-13","추석"]
[null,null,2077,"2077-01-23","설날"]
[null,null,2077,"2077-01-24","설날"]
[null,null,2077,"2077-01-25","설날"]
[null,null,2077,"2077-04-30","석가탄신일"]
[null,null,2077,"2077-09-30","추석"]
[null,null,2077,"2077-10-01","추석"]
[null,null,2077,"2077-10-02","추석"]
[null,null,2078,"2078-02-11","설날"]
[null,null,2078,"2078-02-12","설날"]
[null,null,2078,"2078-02-13","설날"]
[null,null,2078,"2078-05-19","석가탄신일"]
[null,null,2078,"2078-09-19","추석"]
[null,null,2078,"2078-09-20","추석"]
[null,null,2078,"2078-09-21","추석"]
[null,null,2079,"2079-02-01","설날"]
[null,null,2079,"2079-02-02","설날"]
[null,null,2079,"2079-02-03","설날"]
[null,null,2079,"2079-05-08","석가탄신일"]
[null,null,2079,"2079-09-09","추석"]
[null,null,2079,"2079-09-10","추석"]
[null,null,2079,"2079-09-11","추석"]
[null,null,2080,"2080-01-21","설날"]
[null,null,2080,"2080-01-22","설날"]
[null,null,2080,"2080-01-23","설날"]
[null,null,2080,"2080-05-26","석가탄신일"]
[null,null,2080,"2080-09-27","추석"]
[null,null,2080,"2080-09-28","추석"]
[null,null,2080,"2080-09-29","추석"]
[null,null,2081,"2081-02-08","설날"]
[null,null,2081,"2081-02-09","설날"]
[null,null,2081,"2081-02-10","설날"]
[null,null,2081,"2081-05-16","석가탄신일"]
[null,null,2081,"2081-09-16","추석"]
[null,null,2081,"2081-09-17","추석"]
[null,null,2081,"2081-09-18","추석"]
[null,null,2082,"2082-01-28","설날"]
[null,null,2082,"2082-01-29","설날"]
[null,null,2082,"2082-01-30","설날"]
[null,null,2082,"2082-05-05","석가탄신일"]
[null,null,2082,"2082-10-05","추석"]
[null,null,2082,"2082-10-06","추석"]
[null,null,2082,"2082-10-07","추석"]
[null,null,2083,"2083-02-16","설날"]
[null,null,2083,"2083-02-17","설날"]
[null,null,2083,"2083-02-18","설날"]
[null,null,{"$f":"YEAR(D515)","v":2083},"2083-05-24","석가탄신일"]
[null,null,2083,"2083-09-25","추석"]
[null,null,2083,"2083-09-26","추석"]
[null,null,2083,"2083-09-27","추석"]
[null,null,2084,"2084-02-05","설날"]
[null,null,2084,"2084-02-06","설날"]
[null,null,2084,"2084-02-07","설날"]
[null,null,2084,"2084-05-12","석가탄신일"]
[null,null,2084,"2084-09-13","추석"]
[null,null,2084,"2084-09-14","추석"]
[null,null,2084,"2084-09-15","추석"]
[null,null,2085,"2085-01-25","설날"]
[null,null,2085,"2085-01-26","설날"]
[null,null,2085,"2085-01-27","설날"]
[null,null,2085,"2085-05-01","석가탄신일"]
[null,null,2085,"2085-10-02","추석"]
[null,null,2085,"2085-10-03","추석"]
[null,null,2085,"2085-10-04","추석"]
[null,null,2086,"2086-02-13","설날"]
[null,null,2086,"2086-02-14","설날"]
[null,null,2086,"2086-02-15","설날"]
[null,null,2086,"2086-05-20","석가탄신일"]
[null,null,2086,"2086-09-21","추석"]
[null,null,2086,"2086-09-22","추석"]
[null,null,2086,"2086-09-23","추석"]
[null,null,2087,"2087-02-02","설날"]
[null,null,2087,"2087-02-03","설날"]
[null,null,2087,"2087-02-04","설날"]
[null,null,2087,"2087-05-10","석가탄신일"]
[null,null,2087,"2087-09-10","추석"]
[null,null,2087,"2087-09-11","추석"]
[null,null,2087,"2087-09-12","추석"]
[null,null,2088,"2088-01-23","설날"]
[null,null,2088,"2088-01-24","설날"]
[null,null,2088,"2088-01-25","설날"]
[null,null,2088,"2088-04-28","석가탄신일"]
[null,null,2088,"2088-09-28","추석"]
[null,null,2088,"2088-09-29","추석"]
[null,null,2088,"2088-09-30","추석"]
[null,null,2089,"2089-02-10","설날"]
[null,null,2089,"2089-02-11","설날"]
[null,null,2089,"2089-02-12","설날"]
[null,null,2089,"2089-05-17","석가탄신일"]
[null,null,2089,"2089-09-18","추석"]
[null,null,2089,"2089-09-19","추석"]
[null,null,2089,"2089-09-20","추석"]
[null,null,2090,"2090-01-29","설날"]
[null,null,2090,"2090-01-30","설날"]
[null,null,2090,"2090-01-31","설날"]
[null,null,2090,"2090-05-07","석가탄신일"]
[null,null,2090,"2090-09-07","추석"]
[null,null,2090,"2090-09-08","추석"]
[null,null,2090,"2090-09-09","추석"]
[null,null,2091,"2091-02-17","설날"]
[null,null,2091,"2091-02-18","설날"]
[null,null,2091,"2091-02-19","설날"]
[null,null,2091,"2091-05-25","석가탄신일"]
[null,null,2091,"2091-09-26","추석"]
[null,null,2091,"2091-09-27","추석"]
[null,null,2091,"2091-09-28","추석"]
[null,null,2092,"2092-02-06","설날"]
[null,null,2092,"2092-02-07","설날"]
[null,null,2092,"2092-02-08","설날"]
[null,null,2092,"2092-05-13","석가탄신일"]
[null,null,{"$f":"YEAR(D579)","v":2092},"2092-09-15","추석"]
[null,null,2092,"2092-09-16","추석"]
[null,null,2092,"2092-09-17","추석"]
[null,null,2093,"2093-01-26","설날"]
[null,null,2093,"2093-01-27","설날"]
[null,null,2093,"2093-01-28","설날"]
[null,null,2093,"2093-05-03","석가탄신일"]
[null,null,2093,"2093-10-04","추석"]
[null,null,2093,"2093-10-05","추석"]
[null,null,2093,"2093-10-06","추석"]
[null,null,2094,"2094-02-14","설날"]
[null,null,2094,"2094-02-15","설날"]
[null,null,2094,"2094-02-16","설날"]
[null,null,2094,"2094-05-21","석가탄신일"]
[null,null,2094,"2094-09-23","추석"]
[null,null,2094,"2094-09-24","추석"]
[null,null,2094,"2094-09-25","추석"]
[null,null,2095,"2095-02-04","설날"]
[null,null,2095,"2095-02-05","설날"]
[null,null,2095,"2095-02-06","설날"]
[null,null,2095,"2095-05-11","석가탄신일"]
[null,null,2095,"2095-09-12","추석"]
[null,null,2095,"2095-09-13","추석"]
[null,null,2095,"2095-09-14","추석"]
[null,null,2096,"2096-01-24","설날"]
[null,null,2096,"2096-01-25","설날"]
[null,null,2096,"2096-01-26","설날"]
[null,null,2096,"2096-04-30","석가탄신일"]
[null,null,2096,"2096-09-30","추석"]
[null,null,2096,"2096-10-01","추석"]
[null,null,2096,"2096-10-02","추석"]
[null,null,2097,"2097-02-11","설날"]
[null,null,2097,"2097-02-12","설날"]
[null,null,2097,"2097-02-13","설날"]
[null,null,2097,"2097-05-19","석가탄신일"]
[null,null,2097,"2097-09-19","추석"]
[null,null,2097,"2097-09-20","추석"]
[null,null,2097,"2097-09-21","추석"]
[null,null,2098,"2098-01-31","설날"]
[null,null,2098,"2098-02-01","설날"]
[null,null,2098,"2098-02-02","설날"]
[null,null,2098,"2098-05-08","석가탄신일"]
[null,null,2098,"2098-09-09","추석"]
[null,null,2098,"2098-09-10","추석"]
[null,null,2098,"2098-09-11","추석"]
[null,null,2099,"2099-01-20","설날"]
[null,null,2099,"2099-01-21","설날"]
[null,null,2099,"2099-01-22","설날"]
[null,null,2099,"2099-05-27","석가탄신일"]
[null,null,2099,"2099-09-28","추석"]
[null,null,2099,"2099-09-29","추석"]
[null,null,2099,"2099-09-30","추석"]
[null,null,2100,"2100-02-08","설날"]
[null,null,2100,"2100-02-09","설날"]
[null,null,2100,"2100-02-10","설날"]
[null,null,2100,"2100-05-16","석가탄신일"]
[null,null,2100,"2100-09-17","추석"]
[null,null,2100,"2100-09-18","추석"]
[null,null,2100,"2100-09-19","추석"]