{"text_format":"1","workbook":"xlsx","n_sheets":8,"sheets":["학생배정결과","시간표data","메인","학생시간표","교사시간표","tempData","studentData","도움말"],"not_rendered":{"charts":0,"images":5,"macros":1,"external_links":0,"defined_names":2,"comments":0,"pivot_tables":0},"unopened":[],"bounds":{"document_bytes":16777216,"sheet_cells":100000,"rows_first":2000,"rows_last":500,"rows_between":2000,"halvings":0,"cell_chars":16384,"cell_head_chars":4096},"cells_cut":0,"cells_raw":0,"read":"whole","date_system":"1900"}

{"sheet":"학생배정결과","index":0,"n_rows":117,"n_cols":17,"rows_kept":117,"cut":false,"hidden":true,"merged":[]}
["순번","학년","반","번호","이름","고전 읽기","과목부스","동아시아사","물리학Ⅱ","미적분","생명과학Ⅱ","영어권 문화","윤리와 사상","정치와 법","지구과학Ⅱ","한국지리","화학Ⅱ"]
[1,2,1,1,"남궁연","D","F","B",null,"A",null,"E",null,null,null,"C"]
[2,2,1,2,"남궁연",null,"E",null,null,"F",null,"C","A","B",null,"D"]
[3,2,1,3,"남궁연","E","C","A",null,"B",null,"D","F"]
[4,2,1,4,"남궁연","F","D","B",null,"A",null,"C",null,null,null,"E"]
[5,2,1,5,"남궁연",null,"D",null,"B",null,"C",null,"F","E",null,null,"A"]
[6,2,1,7,"남궁연","D","C",null,"B","F",null,"E","A"]
[7,2,1,8,"남궁연",null,"D","E","B",null,"C",null,"A","F"]
[8,2,1,9,"남궁연","E","A",null,null,null,null,"B","F",null,"D","C"]
[9,2,1,10,"남궁연","E","C","F",null,"B",null,"D","A"]
[10,2,1,11,"남궁연",null,"D",null,"B","A","C",null,"F","E"]
[11,2,1,12,"남궁연","D","A","F",null,null,null,"B",null,null,"E","C"]
[12,2,1,13,"남궁연",null,"F","A",null,"B",null,"E",null,"C",null,"D"]
[13,2,1,14,"남궁연","F","B",null,null,null,null,"E","A",null,"D","C"]
[14,2,1,15,"남궁연",null,"E",null,"B",null,null,"D","F","C",null,null,"A"]
[15,2,1,16,"남궁연","F","D","B",null,"A",null,"C",null,null,null,"E"]
[16,2,1,17,"남궁연",null,"E",null,"B",null,"C",null,"A","F",null,"D"]
[17,2,1,18,"남궁연","D","A",null,null,"B",null,"C","F",null,"E"]
[18,2,1,19,"남궁연","E","C","A",null,"F",null,"B",null,null,null,"D"]
[19,2,1,20,"남궁연","D","C","F",null,"A",null,null,null,"B",null,"E"]
[20,2,1,21,"남궁연",null,"B","A",null,"F",null,"C",null,null,"E","D"]
[21,2,1,22,"남궁연","F","A",null,null,"B",null,"E",null,null,"D","C"]
[22,2,1,23,"남궁연",null,"E","F","B",null,null,"D","A","C"]
[23,2,1,24,"남궁연",null,"A","B",null,"F",null,"C",null,null,"E","D"]
[24,2,2,1,"남궁연","D","C","B",null,null,null,"E","F",null,null,null,"A"]
[25,2,2,2,"남궁연","F","C",null,null,"A",null,"D",null,"B",null,"E"]
[26,2,2,3,"남궁연","E","A","F",null,"B",null,null,null,null,"D","C"]
[27,2,2,4,"남궁연","D","B","A",null,"F",null,"C",null,null,null,"E"]
[28,2,2,5,"남궁연",null,"B","F",null,"A",null,"C",null,null,"E","D"]
[29,2,2,6,"남궁연",null,"B","A",null,null,"C","D",null,"F",null,"E"]
[30,2,2,7,"남궁연","F","E","B",null,null,null,null,null,"C",null,"D","A"]
[31,2,2,8,"남궁연",null,"D",null,"B",null,"C",null,"F","E",null,null,"A"]
[32,2,2,9,"남궁연","E","A","F",null,null,null,null,null,"B","D","C"]
[33,2,2,10,"남궁연","D","A","F",null,"B",null,"C",null,null,null,"E"]
[34,2,2,12,"남궁연","D","A","B",null,null,null,"E",null,"F",null,"C"]
[35,2,2,13,"남궁연",null,"A",null,"B","F","C","D",null,null,null,"E"]
[36,2,2,14,"남궁연","F","C","B",null,"A",null,"D",null,null,null,"E"]
[37,2,2,15,"남궁연",null,"B","A",null,"F",null,"E",null,null,"D","C"]
[38,2,2,16,"남궁연","F","B","A",null,null,null,"C",null,null,"E","D"]
[39,2,2,17,"남궁연","E","A","F",null,"B",null,"D",null,null,null,"C"]
[40,2,2,18,"남궁연","E","F","A",null,null,null,"B",null,null,"D","C"]
[41,2,2,19,"남궁연","D","A","F",null,null,null,"C",null,"B","E"]
[42,2,2,20,"남궁연","F","C","B",null,"A",null,"D",null,null,null,"E"]
[43,2,2,21,"남궁연",null,"B","A",null,"F",null,"C",null,null,"D","E"]
[44,2,2,23,"남궁연","D","E",null,"B",null,"C",null,"F",null,null,null,"A"]
[45,2,2,24,"남궁연",null,"A","F",null,"B",null,"C",null,null,"E","D"]
[46,2,2,30,"남궁연",null,"B","A",null,"F",null,"D",null,"C",null,"E"]
[47,2,2,30,"남궁연","E","F","B",null,"A",null,"C",null,null,null,"D"]
[48,2,3,1,"남궁연",null,"D","F","B",null,null,"E","A","C"]
[49,2,3,2,"남궁연","F","D","A",null,"B",null,"E",null,null,null,"C"]
[50,2,3,3,"남궁연",null,"D",null,"B",null,"C","E","A","F"]
[51,2,3,4,"남궁연",null,"E",null,"B",null,"C",null,"A","F",null,"D"]
[52,2,3,5,"남궁연",null,"A",null,null,"F",null,"C",null,"B","D","E"]
[53,2,3,6,"남궁연","D","C","B",null,"A",null,"E","F"]
[54,2,3,7,"남궁연",null,"A","F",null,"B",null,"E",null,"C",null,"D"]
[55,2,3,8,"남궁연","E","B","A",null,"F",null,"D",null,null,null,"C"]
[56,2,3,9,"남궁연",null,"C","F",null,null,null,"D","A","B",null,"E"]
[57,2,3,10,"남궁연","F","D","B",null,null,null,"E",null,null,null,"C","A"]
[58,2,3,11,"남궁연","D","A","F",null,null,null,"B",null,null,"E","C"]
[59,2,3,12,"남궁연","E","D","F",null,"B",null,null,null,"C",null,null,"A"]
[60,2,3,13,"남궁연",null,"C","F",null,"A",null,"E",null,"B",null,"D"]
[61,2,3,14,"남궁연","F","E",null,null,"B","C","D",null,null,null,null,"A"]
[62,2,3,15,"남궁연",null,"D",null,"B",null,"C",null,"F","E",null,null,"A"]
[63,2,3,16,"남궁연","D","C","B",null,"F",null,null,"A",null,null,"E"]
[64,2,3,17,"남궁연","E","F","A",null,null,"C","B",null,null,null,"D"]
[65,2,3,18,"남궁연","F","C","B",null,"A",null,"D",null,null,null,"E"]
[66,2,3,19,"남궁연",null,"A",null,null,"F",null,"C",null,"B","D","E"]
[67,2,3,21,"남궁연",null,"F","B",null,"A",null,"D",null,null,"E","C"]
[68,2,3,22,"남궁연",null,"D",null,"B",null,"C","E","A","F"]
[69,2,3,23,"남궁연",null,"C","A",null,"B",null,"E",null,"F",null,"D"]
[70,2,3,24,"남궁연",null,"A",null,null,"F","C","E",null,"B",null,"D"]
[71,2,4,1,"남궁연","E","F",null,null,"A",null,null,null,"B","D","C"]
[72,2,4,2,"남궁연",null,"E","A",null,"B",null,"D",null,"F",null,"C"]
[73,2,4,3,"남궁연","D","C","A",null,"F",null,null,null,"B",null,"E"]
[74,2,4,4,"남궁연","F","D","B",null,"A",null,"C",null,null,"E"]
[75,2,4,5,"남궁연","D","B","F",null,null,null,null,"A","C",null,"E"]
[76,2,4,6,"남궁연",null,"D","E",null,"A",null,null,"F","B",null,"C"]
[77,2,4,7,"남궁연",null,"E",null,null,null,"C","D","F","B",null,null,"A"]
[78,2,4,8,"남궁연",null,"D","A",null,"B","C","E",null,"F"]
[79,2,4,9,"남궁연",null,"B",null,null,"F",null,null,"A","C","D","E"]
[80,2,4,10,"남궁연",null,"D",null,"B",null,"C",null,"F","E",null,null,"A"]
[81,2,4,11,"남궁연",null,"A","B",null,null,"C","E",null,"F",null,"D"]
[82,2,4,12,"남궁연","E","A","F",null,"B",null,"D",null,null,null,"C"]
[83,2,4,13,"남궁연",null,"D",null,"B",null,"C",null,"F","E",null,null,"A"]
[84,2,4,14,"남궁연","F","E","B",null,"A",null,"C",null,null,null,"D"]
[85,2,4,15,"남궁연","D","A",null,null,"F",null,"B",null,"C",null,"E"]
[86,2,4,16,"남궁연","D","B","A",null,null,null,"C",null,"F","E"]
[87,2,4,17,"남궁연",null,"E",null,"B",null,"C","D","A","F"]
[88,2,4,18,"남궁연",null,"F",null,null,"A","C","B",null,null,"D","E"]
[89,2,4,20,"남궁연",null,"E",null,"B",null,"C",null,"A","F",null,"D"]
[90,2,4,21,"남궁연",null,"D","E","B",null,"C",null,"A","F"]
[91,2,4,22,"남궁연",null,"D",null,null,"B",null,null,"F","C",null,"E","A"]
[92,2,4,23,"남궁연","D","C","E","B","F",null,null,null,null,null,null,"A"]
[93,2,4,24,"남궁연",null,"B","F",null,"A",null,"D",null,null,"E","C"]
[94,2,5,1,"남궁연",null,"D",null,"B","F",null,"E","A","C"]
[95,2,5,2,"남궁연","E","D","F",null,"A",null,"C",null,"B"]
[96,2,5,3,"남궁연",null,"A","F",null,"B",null,"E",null,"C","D"]
[97,2,5,4,"남궁연","E","F","A",null,"B",null,"C",null,null,null,"D"]
[98,2,5,5,"남궁연",null,"D","A",null,"F",null,null,null,"B","E","C"]
[99,2,5,6,"남궁연",null,"D","E","B",null,"C",null,"F",null,null,null,"A"]
[100,2,5,7,"남궁연","F","E","B",null,"A",null,"C",null,null,null,"D"]
[101,2,5,8,"남궁연","D","B","F",null,null,null,null,null,"C",null,"E","A"]
[102,2,5,9,"남궁연",null,"E",null,"B",null,"C","D","F",null,null,null,"A"]
[103,2,5,10,"남궁연",null,"E","B",null,null,null,null,"F",null,"D","C","A"]
[104,2,5,11,"남궁연",null,"C","F",null,null,null,"E","A","B",null,"D"]
[105,2,5,12,"남궁연",null,"F","B",null,null,null,"D","A","C",null,"E"]
[106,2,5,13,"남궁연",null,"F","A",null,"B",null,"D",null,null,"E","C"]
[107,2,5,15,"남궁연","E","C","B",null,null,null,null,null,"F","D",null,"A"]
[108,2,5,16,"남궁연",null,"D",null,"B","F",null,"E","A","C"]
[109,2,5,17,"남궁연","F","E",null,null,"B",null,"C",null,null,null,"D","A"]
[110,2,5,18,"남궁연",null,"D","E","B","A","C",null,"F"]
[111,2,5,19,"남궁연","D","B",null,null,"F",null,"C",null,null,"E",null,"A"]
[112,2,5,20,"남궁연","E","B","F",null,null,null,"D","A",null,null,"C"]
[113,2,5,21,"남궁연","F","D","B",null,"A",null,"C",null,null,null,"E"]
[114,2,5,22,"남궁연","E","F",null,null,"B",null,"C",null,null,"D",null,"A"]
[115,2,5,23,"남궁연","D","B","A",null,null,null,"C","F",null,null,"E"]
[116,2,5,24,"남궁연","F","C","B",null,"A",null,"E",null,null,null,"D"]

{"sheet":"시간표data","index":1,"n_rows":0,"n_cols":0,"rows_kept":0,"cut":false,"hidden":true,"merged":[]}

{"sheet":"메인","index":2,"n_rows":38,"n_cols":16,"rows_kept":38,"cut":false,"hidden":false,"merged":[]}
[]
[]
[]
[null,"교과명","반","인원수","수업교실","교사","축약-교과명",null,null,null,"/","가","나","다","라","마"]
[null,"고전 읽기","D",{"$f":"COUNTIFS(tempData!C:C,\"고전 읽기\",tempData!D:D,\"D\")","v":22},201,"남궁",null,null,null,null,1,"A"]
[null,"고전 읽기","E",{"$f":"COUNTIFS(tempData!C:C,\"고전 읽기\",tempData!D:D,\"E\")","v":19},201,"남궁",null,null,null,null,2,"B"]
[null,"고전 읽기","F",{"$f":"COUNTIFS(tempData!C:C,\"고전 읽기\",tempData!D:D,\"F\")","v":19},201,"남궁",null,null,null,null,3,"C"]
[null,"과목부스","A",{"$f":"COUNTIFS(tempData!C:C,\"과목부스\",tempData!D:D,\"A\")","v":22},"후동회의실","남궁",null,null,null,null,4,"D"]
[null,"과목부스","B",{"$f":"COUNTIFS(tempData!C:C,\"과목부스\",tempData!D:D,\"B\")","v":18},"후동회의실","남궁",null,null,null,null,5,"F"]
[null,"과목부스","C",{"$f":"COUNTIFS(tempData!C:C,\"과목부스\",tempData!D:D,\"C\")","v":20},"후동회의실","남궁",null,null,null,null,6,"E"]
[null,"과목부스","D",{"$f":"COUNTIFS(tempData!C:C,\"과목부스\",tempData!D:D,\"D\")","v":27},"후동회의실","남궁",null,null,null,null,7]
[null,"과목부스","E",{"$f":"COUNTIFS(tempData!C:C,\"과목부스\",tempData!D:D,\"E\")","v":17},"후동회의실","남궁",null,null,null,null,8]
[null,"과목부스","F",{"$f":"COUNTIFS(tempData!C:C,\"과목부스\",tempData!D:D,\"F\")","v":12},"후동회의실","남궁",null,null,null,null,9]
[null,"동아시아사","A",{"$f":"COUNTIFS(tempData!C:C,\"동아시아사\",tempData!D:D,\"A\")","v":23},"영어전용교실","남궁",null,null,null,null,10]
[null,"동아시아사","B",{"$f":"COUNTIFS(tempData!C:C,\"동아시아사\",tempData!D:D,\"B\")","v":24},"영어전용교실","남궁"]
[null,"동아시아사","E",{"$f":"COUNTIFS(tempData!C:C,\"동아시아사\",tempData!D:D,\"E\")","v":6},"영어전용교실","남궁"]
[null,"동아시아사","F",{"$f":"COUNTIFS(tempData!C:C,\"동아시아사\",tempData!D:D,\"F\")","v":25},"영어전용교실","남궁"]
[null,"물리학Ⅱ","B",{"$f":"COUNTIFS(tempData!C:C,\"물리학Ⅱ\",tempData!D:D,\"B\")","v":26},"컴퓨터실","남궁"]
[null,"미적분","A",{"$f":"COUNTIFS(tempData!C:C,\"미적분\",tempData!D:D,\"A\")","v":25},202,"남궁"]
[null,"미적분","B",{"$f":"COUNTIFS(tempData!C:C,\"미적분\",tempData!D:D,\"B\")","v":23},202,"남궁"]
[null,"미적분","F",{"$f":"COUNTIFS(tempData!C:C,\"미적분\",tempData!D:D,\"F\")","v":23},202,"남궁"]
[null,"생명과학Ⅱ","C",{"$f":"COUNTIFS(tempData!C:C,\"생명과학Ⅱ\",tempData!D:D,\"C\")","v":27},"물리실","남궁"]
[null,"영어권 문화","B",{"$f":"COUNTIFS(tempData!C:C,\"영어권 문화\",tempData!D:D,\"B\")","v":8},203,"남궁"]
[null,"영어권 문화","C",{"$f":"COUNTIFS(tempData!C:C,\"영어권 문화\",tempData!D:D,\"C\")","v":27},203,"남궁"]
[null,"영어권 문화","D",{"$f":"COUNTIFS(tempData!C:C,\"영어권 문화\",tempData!D:D,\"D\")","v":25},203,"남궁"]
[null,"영어권 문화","E",{"$f":"COUNTIFS(tempData!C:C,\"영어권 문화\",tempData!D:D,\"E\")","v":25},203,"남궁"]
[null,"윤리와 사상","A",{"$f":"COUNTIFS(tempData!C:C,\"윤리와 사상\",tempData!D:D,\"A\")","v":23},"학생자치실","남궁"]
[null,"윤리와 사상","F",{"$f":"COUNTIFS(tempData!C:C,\"윤리와 사상\",tempData!D:D,\"F\")","v":21},"학생자치실","남궁"]
[null,"정치와 법","B",{"$f":"COUNTIFS(tempData!C:C,\"정치와 법\",tempData!D:D,\"B\")","v":17},205,"남궁"]
[null,"정치와 법","C",{"$f":"COUNTIFS(tempData!C:C,\"정치와 법\",tempData!D:D,\"C\")","v":17},205,"남궁"]
[null,"정치와 법","E",{"$f":"COUNTIFS(tempData!C:C,\"정치와 법\",tempData!D:D,\"E\")","v":6},205,"남궁"]
[null,"정치와 법","F",{"$f":"COUNTIFS(tempData!C:C,\"정치와 법\",tempData!D:D,\"F\")","v":16},205,"남궁"]
[null,"지구과학Ⅱ","D",{"$f":"COUNTIFS(tempData!C:C,\"지구과학Ⅱ\",tempData!D:D,\"D\")","v":17},"역사관","남궁"]
[null,"지구과학Ⅱ","E",{"$f":"COUNTIFS(tempData!C:C,\"지구과학Ⅱ\",tempData!D:D,\"E\")","v":16},"역사관","남궁"]
[null,"한국지리","C",{"$f":"COUNTIFS(tempData!C:C,\"한국지리\",tempData!D:D,\"C\")","v":25},204,"남궁"]
[null,"한국지리","D",{"$f":"COUNTIFS(tempData!C:C,\"한국지리\",tempData!D:D,\"D\")","v":25},204,"남궁"]
[null,"한국지리","E",{"$f":"COUNTIFS(tempData!C:C,\"한국지리\",tempData!D:D,\"E\")","v":27},204,"남궁"]
[null,"화학Ⅱ","A",{"$f":"COUNTIFS(tempData!C:C,\"화학Ⅱ\",tempData!D:D,\"A\")","v":23},"온라인학습실","남궁"]

{"sheet":"학생시간표","index":3,"n_rows":31,"n_cols":12,"rows_kept":31,"cut":false,"hidden":false,"merged":[[1,8,6,10]]}
[]
[null,0,1,2,3,4]
[null,null,null,null,null,null,null,null,null,null,null,1]
[null,"1. 이름으로 학생 검색"]
[]
[]
[]
[null,2,"학년",1,"반",2,"번"]
[]
[]
[]
[null,"*1행과 1열에 표시될 내용은 수정가능합니다",null,null,null,null,{"$f":"INDEX(tempData!B:B,MATCH(B8*10000+D8*100+F8,tempData!A:A,0))","v":"남궁연"}]
[null,null,"7월14일","자유롭게","1행은","수정해도됩니다"]
[null,"8시50분","A.윤리와 사상","*별표로 시작한 글은"]
[null,"~9시10분","남궁(학생자치실)","*고정되어 표시됩니다"]
[null,"09시20분","B.정치와 법"]
[null,"~09시40분","남궁(205)"]
[null,"09시50분","C.영어권 문화"]
[null,"~10시10분","남궁(203)"]
[null,"10시20분","D.한국지리"]
[null,"~10시40분","남궁(204)",null,null,null,null,"    "]
[null,"10시50분","F.미적분"]
[null,"~11시10분","남궁(202)"]
[null,"11시20분","E.과목부스"]
[null,"~11시40분","남궁(후동회의실)"]
[null,"1열도","*고교학점제OT"]
[null,"수정가능합니다","*교육과정부장"]
[null,"5교시","*선배와의 만남"]
[null,"13:40~14:30"]
[null,"6교시","*선배와의 만남"]
[null,"14:40~15:30"]

{"sheet":"교사시간표","index":4,"n_rows":27,"n_cols":7,"rows_kept":27,"cut":false,"hidden":true,"merged":[[1,1,1,2]]}
[2,null,null,null,3,4]
[null,"교사명 입력",null,"남궁연"]
[]
[null,null,0,1,2,3,4]
[null,null,"월","화","수","목","금"]
[null,1]
[null,2]
[null,3]
[null,4]
[null,5]
[null,6]
[null,7]
[null,8]
[]
[]
[]
[]
[]
[]
[]
[]
[]
[]
[]
[]
[]
[null,null,null,null,"                "]

{"sheet":"tempData","index":5,"n_rows":697,"n_cols":5,"rows_kept":697,"cut":false,"hidden":true,"merged":[]}
["학번"]
[20101,"남궁연","고전 읽기","D","고전 읽기-D"]
[20101,"남궁연","과목부스","F","과목부스-F"]
[20101,"남궁연","동아시아사","B","동아시아사-B"]
[20101,"남궁연","미적분","A","미적분-A"]
[20101,"남궁연","영어권 문화","E","영어권 문화-E"]
[20101,"남궁연","한국지리","C","한국지리-C"]
[20102,"남궁연","과목부스","E","과목부스-E"]
[20102,"남궁연","미적분","F","미적분-F"]
[20102,"남궁연","영어권 문화","C","영어권 문화-C"]
[20102,"남궁연","윤리와 사상","A","윤리와 사상-A"]
[20102,"남궁연","정치와 법","B","정치와 법-B"]
[20102,"남궁연","한국지리","D","한국지리-D"]
[20103,"남궁연","고전 읽기","E","고전 읽기-E"]
[20103,"남궁연","과목부스","C","과목부스-C"]
[20103,"남궁연","동아시아사","A","동아시아사-A"]
[20103,"남궁연","미적분","B","미적분-B"]
[20103,"남궁연","영어권 문화","D","영어권 문화-D"]
[20103,"남궁연","윤리와 사상","F","윤리와 사상-F"]
[20104,"남궁연","고전 읽기","F","고전 읽기-F"]
[20104,"남궁연","과목부스","D","과목부스-D"]
[20104,"남궁연","동아시아사","B","동아시아사-B"]
[20104,"남궁연","미적분","A","미적분-A"]
[20104,"남궁연","영어권 문화","C","영어권 문화-C"]
[20104,"남궁연","한국지리","E","한국지리-E"]
[20105,"남궁연","과목부스","D","과목부스-D"]
[20105,"남궁연","물리학Ⅱ","B","물리학Ⅱ-B"]
[20105,"남궁연","생명과학Ⅱ","C","생명과학Ⅱ-C"]
[20105,"남궁연","윤리와 사상","F","윤리와 사상-F"]
[20105,"남궁연","정치와 법","E","정치와 법-E"]
[20105,"남궁연","화학Ⅱ","A","화학Ⅱ-A"]
[20107,"남궁연","고전 읽기","D","고전 읽기-D"]
[20107,"남궁연","과목부스","C","과목부스-C"]
[20107,"남궁연","물리학Ⅱ","B","물리학Ⅱ-B"]
[20107,"남궁연","미적분","F","미적분-F"]
[20107,"남궁연","영어권 문화","E","영어권 문화-E"]
[20107,"남궁연","윤리와 사상","A","윤리와 사상-A"]
[20108,"남궁연","과목부스","D","과목부스-D"]
[20108,"남궁연","동아시아사","E","동아시아사-E"]
[20108,"남궁연","물리학Ⅱ","B","물리학Ⅱ-B"]
[20108,"남궁연","생명과학Ⅱ","C","생명과학Ⅱ-C"]
[20108,"남궁연","윤리와 사상","A","윤리와 사상-A"]
[20108,"남궁연","정치와 법","F","정치와 법-F"]
[20109,"남궁연","고전 읽기","E","고전 읽기-E"]
[20109,"남궁연","과목부스","A","과목부스-A"]
[20109,"남궁연","영어권 문화","B","영어권 문화-B"]
[20109,"남궁연","윤리와 사상","F","윤리와 사상-F"]
[20109,"남궁연","지구과학Ⅱ","D","지구과학Ⅱ-D"]
[20109,"남궁연","한국지리","C","한국지리-C"]
[20110,"남궁연","고전 읽기","E","고전 읽기-E"]
[20110,"남궁연","과목부스","C","과목부스-C"]
[20110,"남궁연","동아시아사","F","동아시아사-F"]
[20110,"남궁연","미적분","B","미적분-B"]
[20110,"남궁연","영어권 문화","D","영어권 문화-D"]
[20110,"남궁연","윤리와 사상","A","윤리와 사상-A"]
[20111,"남궁연","과목부스","D","과목부스-D"]
[20111,"남궁연","물리학Ⅱ","B","물리학Ⅱ-B"]
[20111,"남궁연","미적분","A","미적분-A"]
[20111,"남궁연","생명과학Ⅱ","C","생명과학Ⅱ-C"]
[20111,"남궁연","윤리와 사상","F","윤리와 사상-F"]
[20111,"남궁연","정치와 법","E","정치와 법-E"]
[20112,"남궁연","고전 읽기","D","고전 읽기-D"]
[20112,"남궁연","과목부스","A","과목부스-A"]
[20112,"남궁연","동아시아사","F","동아시아사-F"]
[20112,"남궁연","영어권 문화","B","영어권 문화-B"]
[20112,"남궁연","지구과학Ⅱ","E","지구과학Ⅱ-E"]
[20112,"남궁연","한국지리","C","한국지리-C"]
[20113,"남궁연","과목부스","F","과목부스-F"]
[20113,"남궁연","동아시아사","A","동아시아사-A"]
[20113,"남궁연","미적분","B","미적분-B"]
[20113,"남궁연","영어권 문화","E","영어권 문화-E"]
[20113,"남궁연","정치와 법","C","정치와 법-C"]
[20113,"남궁연","한국지리","D","한국지리-D"]
[20114,"남궁연","고전 읽기","F","고전 읽기-F"]
[20114,"남궁연","과목부스","B","과목부스-B"]
[20114,"남궁연","영어권 문화","E","영어권 문화-E"]
[20114,"남궁연","윤리와 사상","A","윤리와 사상-A"]
[20114,"남궁연","지구과학Ⅱ","D","지구과학Ⅱ-D"]
[20114,"남궁연","한국지리","C","한국지리-C"]
[20115,"남궁연","과목부스","E","과목부스-E"]
[20115,"남궁연","물리학Ⅱ","B","물리학Ⅱ-B"]
[20115,"남궁연","영어권 문화","D","영어권 문화-D"]
[20115,"남궁연","윤리와 사상","F","윤리와 사상-F"]
[20115,"남궁연","정치와 법","C","정치와 법-C"]
[20115,"남궁연","화학Ⅱ","A","화학Ⅱ-A"]
[20116,"남궁연","고전 읽기","F","고전 읽기-F"]
[20116,"남궁연","과목부스","D","과목부스-D"]
[20116,"남궁연","동아시아사","B","동아시아사-B"]
[20116,"남궁연","미적분","A","미적분-A"]
[20116,"남궁연","영어권 문화","C","영어권 문화-C"]
[20116,"남궁연","한국지리","E","한국지리-E"]
[20117,"남궁연","과목부스","E","과목부스-E"]
[20117,"남궁연","물리학Ⅱ","B","물리학Ⅱ-B"]
[20117,"남궁연","생명과학Ⅱ","C","생명과학Ⅱ-C"]
[20117,"남궁연","윤리와 사상","A","윤리와 사상-A"]
[20117,"남궁연","정치와 법","F","정치와 법-F"]
[20117,"남궁연","한국지리","D","한국지리-D"]
[20118,"남궁연","고전 읽기","D","고전 읽기-D"]
[20118,"남궁연","과목부스","A","과목부스-A"]
[20118,"남궁연","미적분","B","미적분-B"]
[20118,"남궁연","영어권 문화","C","영어권 문화-C"]
[20118,"남궁연","윤리와 사상","F","윤리와 사상-F"]
[20118,"남궁연","지구과학Ⅱ","E","지구과학Ⅱ-E"]
[20119,"남궁연","고전 읽기","E","고전 읽기-E"]
[20119,"남궁연","과목부스","C","과목부스-C"]
[20119,"남궁연","동아시아사","A","동아시아사-A"]
[20119,"남궁연","미적분","F","미적분-F"]
[20119,"남궁연","영어권 문화","B","영어권 문화-B"]
[20119,"남궁연","한국지리","D","한국지리-D"]
[20120,"남궁연","고전 읽기","D","고전 읽기-D"]
[20120,"남궁연","과목부스","C","과목부스-C"]
[20120,"남궁연","동아시아사","F","동아시아사-F"]
[20120,"남궁연","미적분","A","미적분-A"]
[20120,"남궁연","정치와 법","B","정치와 법-B"]
[20120,"남궁연","한국지리","E","한국지리-E"]
[20121,"남궁연","과목부스","B","과목부스-B"]
[20121,"남궁연","동아시아사","A","동아시아사-A"]
[20121,"남궁연","미적분","F","미적분-F"]
[20121,"남궁연","영어권 문화","C","영어권 문화-C"]
[20121,"남궁연","지구과학Ⅱ","E","지구과학Ⅱ-E"]
[20121,"남궁연","한국지리","D","한국지리-D"]
[20122,"남궁연","고전 읽기","F","고전 읽기-F"]
[20122,"남궁연","과목부스","A","과목부스-A"]
[20122,"남궁연","미적분","B","미적분-B"]
[20122,"남궁연","영어권 문화","E","영어권 문화-E"]
[20122,"남궁연","지구과학Ⅱ","D","지구과학Ⅱ-D"]
[20122,"남궁연","한국지리","C","한국지리-C"]
[20123,"남궁연","과목부스","E","과목부스-E"]
[20123,"남궁연","동아시아사","F","동아시아사-F"]
[20123,"남궁연","물리학Ⅱ","B","물리학Ⅱ-B"]
[20123,"남궁연","영어권 문화","D","영어권 문화-D"]
[20123,"남궁연","윤리와 사상","A","윤리와 사상-A"]
[20123,"남궁연","정치와 법","C","정치와 법-C"]
[20124,"남궁연","과목부스","A","과목부스-A"]
[20124,"남궁연","동아시아사","B","동아시아사-B"]
[20124,"남궁연","미적분","F","미적분-F"]
[20124,"남궁연","영어권 문화","C","영어권 문화-C"]
[20124,"남궁연","지구과학Ⅱ","E","지구과학Ⅱ-E"]
[20124,"남궁연","한국지리","D","한국지리-D"]
[20201,"남궁연","고전 읽기","D","고전 읽기-D"]
[20201,"남궁연","과목부스","C","과목부스-C"]
[20201,"남궁연","동아시아사","B","동아시아사-B"]
[20201,"남궁연","영어권 문화","E","영어권 문화-E"]
[20201,"남궁연","윤리와 사상","F","윤리와 사상-F"]
[20201,"남궁연","화학Ⅱ","A","화학Ⅱ-A"]
[20202,"남궁연","고전 읽기","F","고전 읽기-F"]
[20202,"남궁연","과목부스","C","과목부스-C"]
[20202,"남궁연","미적분","A","미적분-A"]
[20202,"남궁연","영어권 문화","D","영어권 문화-D"]
[20202,"남궁연","정치와 법","B","정치와 법-B"]
[20202,"남궁연","한국지리","E","한국지리-E"]
[20203,"남궁연","고전 읽기","E","고전 읽기-E"]
[20203,"남궁연","과목부스","A","과목부스-A"]
[20203,"남궁연","동아시아사","F","동아시아사-F"]
[20203,"남궁연","미적분","B","미적분-B"]
[20203,"남궁연","지구과학Ⅱ","D","지구과학Ⅱ-D"]
[20203,"남궁연","한국지리","C","한국지리-C"]
[20204,"남궁연","고전 읽기","D","고전 읽기-D"]
[20204,"남궁연","과목부스","B","과목부스-B"]
[20204,"남궁연","동아시아사","A","동아시아사-A"]
[20204,"남궁연","미적분","F","미적분-F"]
[20204,"남궁연","영어권 문화","C","영어권 문화-C"]
[20204,"남궁연","한국지리","E","한국지리-E"]
[20205,"남궁연","과목부스","B","과목부스-B"]
[20205,"남궁연","동아시아사","F","동아시아사-F"]
[20205,"남궁연","미적분","A","미적분-A"]
[20205,"남궁연","영어권 문화","C","영어권 문화-C"]
[20205,"남궁연","지구과학Ⅱ","E","지구과학Ⅱ-E"]
[20205,"남궁연","한국지리","D","한국지리-D"]
[20206,"남궁연","과목부스","B","과목부스-B"]
[20206,"남궁연","동아시아사","A","동아시아사-A"]
[20206,"남궁연","생명과학Ⅱ","C","생명과학Ⅱ-C"]
[20206,"남궁연","영어권 문화","D","영어권 문화-D"]
[20206,"남궁연","정치와 법","F","정치와 법-F"]
[20206,"남궁연","한국지리","E","한국지리-E"]
[20207,"남궁연","고전 읽기","F","고전 읽기-F"]
[20207,"남궁연","과목부스","E","과목부스-E"]
[20207,"남궁연","동아시아사","B","동아시아사-B"]
[20207,"남궁연","정치와 법","C","정치와 법-C"]
[20207,"남궁연","한국지리","D","한국지리-D"]
[20207,"남궁연","화학Ⅱ","A","화학Ⅱ-A"]
[20208,"남궁연","과목부스","D","과목부스-D"]
[20208,"남궁연","물리학Ⅱ","B","물리학Ⅱ-B"]
[20208,"남궁연","생명과학Ⅱ","C","생명과학Ⅱ-C"]
[20208,"남궁연","윤리와 사상","F","윤리와 사상-F"]
[20208,"남궁연","정치와 법","E","정치와 법-E"]
[20208,"남궁연","화학Ⅱ","A","화학Ⅱ-A"]
[20209,"남궁연","고전 읽기","E","고전 읽기-E"]
[20209,"남궁연","과목부스","A","과목부스-A"]
[20209,"남궁연","동아시아사","F","동아시아사-F"]
[20209,"남궁연","정치와 법","B","정치와 법-B"]
[20209,"남궁연","지구과학Ⅱ","D","지구과학Ⅱ-D"]
[20209,"남궁연","한국지리","C","한국지리-C"]
[20210,"남궁연","고전 읽기","D","고전 읽기-D"]
[20210,"남궁연","과목부스","A","과목부스-A"]
[20210,"남궁연","동아시아사","F","동아시아사-F"]
[20210,"남궁연","미적분","B","미적분-B"]
[20210,"남궁연","영어권 문화","C","영어권 문화-C"]
[20210,"남궁연","한국지리","E","한국지리-E"]
[20212,"남궁연","고전 읽기","D","고전 읽기-D"]
{"$rows_left_out":498}
{"sheet":"studentData","index":6,"n_rows":0,"n_cols":0,"rows_kept":0,"cut":false,"hidden":true,"merged":[]}

{"sheet":"도움말","index":7,"n_rows":89,"n_cols":2,"rows_kept":89,"cut":false,"hidden":false,"merged":[[3,1,3,11],[31,1,31,15]]}
[null,"남궁연 만듦 (속초고, 2023)"]
[null,"*학교 행사시 학생별 개인시간표가 필요한 경우가 있어 위해 예전에 만든 파일을 조금 수정해서 만들었습니다."]
[null,"학생배정결과 파일등록 "]
[null,"그림과 같이 고교학점제 수강사이트의 \n시간표관리 - 이동수업 시간배정 - 시간 배정 최적화 - 미배정 조정 메뉴에서 [엑셀] 버튼을 누르면 학생배정정보 파일을 다운로드 받을 수 있습니다."]
[]
[]
[]
[]
[]
[]
[]
[]
[]
[]
[]
[]
[]
[null,"[참고] 고교학점제 수강 프로그램을 사용하지 않더라고 아래와 같은 양식의 엑셀 파일이면 사용가능합니다."]
[]
[]
[]
[]
[]
[]
[]
[]
[null,"2. 파일등록 버튼을 누른 후 위 파일을 등록합니다."]
[]
[]
[]
[]
[]
[]
[]
[]
[]
[]
[]
[]
[]
[]
[]
[]
[]
[]
[]
[]
[]
[]
[]
[]
[]
[]
[]
[]
[]
[null,"3. 이동수업정보 입력"]
[]
[null,"아래 표와 같이 선택반이 배정될 위치를 입력합니다. "]
[null,"선택반 시간 배정할 때, 동시간에 운영되는 반이 있으면 E,F 와 같이 콤마(,)로 구분하여 입력하면 됩니다 "]
[]
[]
[]
[]
[]
[]
[]
[]
[]
[]
[]
[]
[]
[]
[]
[]
[]
[]
[]
[]
[]
[]
[]
[]
[]
[]
[null,"4. 끝"]
[null,"학생시간표 시트에서 학년, 반, 번호를 수정하면 자동으로 개인 시간표가 표시 됩니다"]
[null,"인쇄하여 나눠주면 됩니다^^"]