{"text_format":"1","workbook":"xlsx","n_sheets":8,"sheets":["노임DB","개인DATA","근로계약서","출력현황표","일용노무비명세서(김반장)","일용노무비지급명세서(마이스터)","출역일보(00)","출역일보(01)"],"not_rendered":{"charts":0,"images":1,"macros":1,"external_links":0,"defined_names":29,"comments":3,"pivot_tables":0},"unopened":[],"bounds":{"document_bytes":16777216,"sheet_cells":100000,"rows_first":2000,"rows_last":500,"rows_between":2000,"halvings":0,"cell_chars":16384,"cell_head_chars":4096},"cells_cut":0,"cells_raw":0,"read":"whole","date_system":"1900"}

{"sheet":"노임DB","index":0,"n_rows":877,"n_cols":57,"rows_kept":877,"cut":false,"hidden":false,"merged":[[16,46,17,47],[14,46,15,47],[6,46,7,47],[16,44,17,45],[12,44,13,45],[8,44,9,45],[14,44,15,45],[10,46,11,47],[8,46,9,47],[12,46,13,47],[10,44,11,45],[14,54,15,55],[10,52,11,53],[14,52,15,53],[6,44,7,45],[14,48,15,49],[10,48,11,49],[8,48,9,49],[12,48,13,49],[0,20,1,23],[0,24,1,35],[2,36,5,36],[2,35,5,35],[10,54,11,55],[2,0,5,0],[2,1,5,1],[0,2,1,2],[0,16,1,19],[0,0,1,1],[0,4,1,7],[0,8,1,11],[0,12,1,15],[16,48,17,49],[6,56,7,57],[8,50,9,51],[8,52,9,53],[8,54,9,55],[8,56,9,57],[10,56,11,57],[12,56,13,57],[14,56,15,57],[6,54,7,55],[6,48,7,49],[6,50,7,51],[6,52,7,53],[14,50,15,51],[12,52,13,53],[12,54,13,55],[3,61,3,64],[0,61,0,64],[1,61,1,64],[2,61,2,64],[12,50,13,51],[10,50,11,51]]}
[2023,null,1,"일정","입력일자",null,null,null,{"$f":"TODAY()-8","v":"2023-01-09"},null,null,null,"출역인원합계",null,null,null,{"$f":"SUMPRODUCT((출역현황2>0)*($E$5:$AI$5=$I$1))","v":0},null,null,null," 현장명"]
[null,null,null,"공수"]
["직종","직종코드",null,"요일",{"$f":"E5","v":44927},{"$f":"F5","v":44928},44929,44930,44931,44932,44933,44934,44935,44936,44937,44938,{"$f":"Q5","v":44939},44940,44941,44942,44943,44944,44945,44946,44947,44948,44949,44950,44951,44952,44953,44954,44955,44956,44957,"합계",null,1]
[null,null,"시작일자","월",{"$f":"E5","v":"2023-01-01"},{"$f":"F5","v":"2023-01-02"},"2023-01-03","2023-01-04","2023-01-05","2023-01-06","2023-01-07","2023-01-08","2023-01-09","2023-01-10","2023-01-11","2023-01-12","2023-01-13","2023-01-14","2023-01-15","2023-01-16","2023-01-17","2023-01-18","2023-01-19","2023-01-20","2023-01-21","2023-01-22","2023-01-23","2023-01-24","2023-01-25","2023-01-26","2023-01-27","2023-01-28","2023-01-29","2023-01-30","2023-01-31"]
[null,null,1,"일",{"$f":"DATE($A$1,$C$1,C5)","v":"2023-01-01"},{"$f":"E5+1","v":"2023-01-02"},{"$f":"F5+1","v":"2023-01-03"},"2023-01-04",{"$f":"H5+1","v":"2023-01-05"},"2023-01-06","2023-01-07","2023-01-08","2023-01-09","2023-01-10","2023-01-11","2023-01-12","2023-01-13","2023-01-14","2023-01-15","2023-01-16","2023-01-17","2023-01-18","2023-01-19","2023-01-20","2023-01-21","2023-01-22","2023-01-23","2023-01-24","2023-01-25","2023-01-26","2023-01-27","2023-01-28","2023-01-29","2023-01-30","2023-01-31"]
[null,null,"성   명","일당",{"$f":"DAY(E5)","v":1},2,3,4,5,6,7,8,9,10,11,12,13,14,15,16,17,18,19,20,21,22,23,24,25,26,27,28,29,30,31]
{"$rows_left_out":872}
{"sheet":"개인DATA","index":1,"n_rows":120,"n_cols":22,"rows_kept":120,"cut":false,"hidden":false,"merged":[]}
["팀명","성명","주민등록번호","주  소","직종코드","단가","직종","나이","검증","은행","계좌번호","예금주","연락처","영문명","근로계약일","체류자격","국적",null,null,"직종코드","직종","코드"]
["관리","홍길동","000101-1000000",null,{"$f":"IF(B2=\"\",\"\",IFERROR(VLOOKUP(A2,직종코드1,2,0),\"직종코드없음\"))","v":1000},null,"현장소장",{"$f":"IFERROR(TEXT((TODAY()-DATE(1900+LEFT(C2,2),MID(C2,3,2),MID(C2,5,2))),\"yy\")*1,\"\")","v":23},{"$f":"IF(C2=\"\",\"\",CHKNO(C2))","v":"ERROR"},null,null,null,null,null,"2023-01-01",null,null,null,null,1000,"관리",{"$f":"T2","v":1000}]
[null,null,null,null,"",null,null,"",{"$f":"IF(C3=\"\",\"\",CHKNO(C3))","v":""},null,null,null,null,null,null,null,null,null,null,1001,null,{"$f":"T3","v":1001}]
[null,null,null,null,"",null,null,"",{"$f":"IF(C4=\"\",\"\",CHKNO(C4))","v":""},null,null,null,null,null,null,null,null,null,null,1002,null,1002]
[null,null,null,null,"",null,null,"",{"$f":"IF(C5=\"\",\"\",CHKNO(C5))","v":""},null,null,null,null,null,null,null,null,null,null,1003,null,1003]
[null,null,null,null,"",null,null,"",{"$f":"IF(C6=\"\",\"\",CHKNO(C6))","v":""}]
{"$rows_left_out":115}
{"sheet":"근로계약서","index":2,"n_rows":47,"n_cols":13,"rows_kept":47,"cut":false,"hidden":false,"merged":[[2,11,2,12],[3,1,3,3],[3,4,3,8],[3,9,3,10],[3,11,3,12],[0,3,0,9],[2,0,3,0],[2,1,2,3],[2,4,2,8],[2,9,2,10],[9,9,9,12],[4,0,6,0],[4,1,4,3],[4,4,4,8],[4,9,4,10],[4,11,4,12],[5,1,5,3],[5,4,5,8],[5,9,5,10],[5,11,5,12],[6,1,6,3],[10,0,14,0],[10,2,10,12],[11,2,11,12],[12,2,12,12],[13,2,13,12],[14,2,14,12],[15,0,23,0],[15,2,15,12],[16,2,16,4],[17,8,17,9],[18,10,18,11],[19,8,19,9],[19,10,19,12],[21,3,21,4],[22,2,22,12],[23,2,23,12],[26,2,26,12],[27,1,27,12],[31,0,32,0],[31,1,31,12],[32,1,32,12],[28,0,29,0],[28,2,28,12],[29,2,29,12],[24,0,26,0],[24,2,24,12],[25,2,25,12],[33,0,38,0],[33,2,33,12],[34,2,34,12],[35,2,35,12],[36,2,36,12],[37,2,37,12],[39,0,40,0],[39,2,39,12],[40,2,40,12],[41,0,41,12],[42,9,42,12],[46,9,46,12],[6,8,6,9],[43,2,43,4],[43,9,43,11],[44,2,44,6],[44,9,44,12],[45,2,45,5],[45,9,45,12],[38,2,38,12],[30,1,30,12],[6,4,6,6],[6,11,6,12],[7,0,7,12],[8,0,8,12],[9,1,9,6],[9,7,9,8]]}
[null,null,null,"일   용   근   로   계   약   서   "]
[]
["( 甲 ) 사 용 자","상        호",null,null,null,null,null,null,null,"성        명 "]
[null,"주        소",null,null,null,null,null,null,null,"전         화"]
["( 乙 ) 근 로 자","성        명",null,null,"홍길동",null,null,null,null,"주민등록번호",null,{"$f":"IFERROR(VLOOKUP(E5,출역인원,2,0),\"\")","v":"000101-1000000"}]
[null,"주        소",null,null,null,null,null,null,null,"핸드폰 번호",null,{"$f":"IFERROR(VLOOKUP(E5,출역인원,12,0),\"\")","v":0}]
{"$rows_left_out":42}
{"sheet":"출력현황표","index":3,"n_rows":34,"n_cols":35,"rows_kept":34,"cut":false,"hidden":false,"merged":[[0,0,0,32]]}
[{"$f":"노임DB!A1&\"년 \"& 노임DB!C1&\"월 출력현황\"","v":"2023년 1월 출력현황"}]
[{"$f":"\"현장명 : \"&노임DB!Y1","v":"현장명 : "}]
["구분",{"$f":"DAY(노임DB!E5)","v":1},{"$f":"DAY(노임DB!F5)","v":2},{"$f":"DAY(노임DB!G5)","v":3},{"$f":"DAY(노임DB!H5)","v":4},{"$f":"DAY(노임DB!I5)","v":5},{"$f":"DAY(노임DB!J5)","v":6},{"$f":"DAY(노임DB!K5)","v":7},{"$f":"DAY(노임DB!L5)","v":8},{"$f":"DAY(노임DB!M5)","v":9},{"$f":"DAY(노임DB!N5)","v":10},{"$f":"DAY(노임DB!O5)","v":11},{"$f":"DAY(노임DB!P5)","v":12},{"$f":"DAY(노임DB!Q5)","v":13},{"$f":"DAY(노임DB!R5)","v":14},{"$f":"DAY(노임DB!S5)","v":15},{"$f":"DAY(노임DB!T5)","v":16},{"$f":"DAY(노임DB!U5)","v":17},{"$f":"DAY(노임DB!V5)","v":18},{"$f":"DAY(노임DB!W5)","v":19},{"$f":"DAY(노임DB!X5)","v":20},{"$f":"DAY(노임DB!Y5)","v":21},{"$f":"DAY(노임DB!Z5)","v":22},{"$f":"DAY(노임DB!AA5)","v":23},{"$f":"DAY(노임DB!AB5)","v":24},{"$f":"DAY(노임DB!AC5)","v":25},{"$f":"DAY(노임DB!AD5)","v":26},{"$f":"DAY(노임DB!AE5)","v":27},{"$f":"DAY(노임DB!AF5)","v":28},{"$f":"DAY(노임DB!AG5)","v":29},{"$f":"DAY(노임DB!AH5)","v":30},{"$f":"DAY(노임DB!AI5)","v":31},"합계","단가","금액"]
["관리",{"$f":"IFERROR(VLOOKUP($A4,INDIRECT(\"'출역일보(\"&TEXT(COLUMN()-1,\"00\")&\")'!$l:$p\"),5,0),\"\")","v":1},{"$f":"IFERROR(VLOOKUP($A4,INDIRECT(\"'출역일보(\"&TEXT(COLUMN()-1,\"00\")&\")'!$l:$p\"),5,0),\"\")","v":""},"","","","","","","","","","","","","","","","","","","","","","","","","","","","","",{"$f":"SUM(B4:AF4)","v":1}]
[null,{"$f":"IFERROR(VLOOKUP($A5,INDIRECT(\"'출역일보(\"&TEXT(COLUMN()-1,\"00\")&\")'!$l:$p\"),5,0),\"\")","v":""},"","","","","","","","","","","","","","","","","","","","","","","","","","","","","","",0]
[null,"","","","","","","","","","","","","","","","","","","","","","","","","","","","","","","",0]
{"$rows_left_out":29}
{"sheet":"일용노무비명세서(김반장)","index":4,"n_rows":23,"n_cols":41,"rows_kept":23,"cut":false,"hidden":false,"merged":[[5,31,6,31],[5,32,6,33],[5,34,6,34],[7,31,8,31],[7,32,8,33],[7,34,8,34],[9,31,10,31],[9,32,10,33],[9,34,10,34],[11,31,12,31],[11,32,12,33],[11,34,12,34],[13,31,14,31],[13,32,14,33],[13,34,14,34],[15,31,16,31],[15,32,16,33],[15,34,16,34],[17,31,18,31],[17,32,18,33],[17,34,18,34],[19,31,20,31],[19,32,20,33],[19,34,20,34],[0,0,1,1],[21,23,22,23],[21,24,22,24],[21,25,22,25],[21,26,22,26],[21,27,22,27],[21,0,22,0],[21,1,22,1],[21,2,22,2],[21,21,22,21],[21,22,22,22],[19,0,20,0],[19,1,20,1],[19,2,20,2],[19,21,20,21],[19,22,20,22],[19,23,20,23],[19,24,20,24],[19,25,20,25],[19,26,20,26],[17,0,18,0],[17,1,18,1],[17,2,18,2],[17,21,18,21],[17,22,18,22],[17,23,18,23],[17,24,18,24],[17,25,18,25],[17,26,18,26],[15,0,16,0],[15,1,16,1],[15,2,16,2],[15,21,16,21],[15,22,16,22],[15,23,16,23],[15,24,16,24],[15,25,16,25],[15,26,16,26],[13,0,14,0],[13,1,14,1],[13,2,14,2],[13,21,14,21],[13,22,14,22],[13,23,14,23],[13,24,14,24],[13,25,14,25],[13,26,14,26],[11,0,12,0],[11,1,12,1],[11,2,12,2],[11,21,12,21],[11,22,12,22],[11,23,12,23],[11,24,12,24],[11,25,12,25],[11,26,12,26],[9,0,10,0],[9,1,10,1],[9,2,10,2],[9,21,10,21],[9,22,10,22],[9,23,10,23],[9,24,10,24],[9,25,10,25],[9,26,10,26],[5,25,6,25],[5,26,6,26],[7,0,8,0],[7,1,8,1],[7,2,8,2],[7,21,8,21],[7,22,8,22],[7,23,8,23],[7,24,8,24],[7,25,8,25],[7,26,8,26],[2,27,4,27],[2,28,3,28],[2,29,3,29],[2,30,3,30],[2,31,2,32],[5,0,6,0],[5,1,6,1],[5,2,6,2],[5,21,6,21],[5,22,6,22],[2,21,4,21],[2,22,4,22],[2,23,4,23],[2,24,4,24],[2,25,4,25],[2,26,4,26],[2,0,4,0],[2,1,4,1],[2,2,4,2],[2,3,4,3],[2,4,4,4],[2,5,2,20],[5,23,6,23],[5,24,6,24],[0,2,1,3],[0,4,1,13],[0,14,1,14],[0,15,0,21],[0,36,0,38],[0,39,0,40],[1,15,1,21],[1,26,1,27],[1,28,1,30],[1,31,1,32],[0,22,1,22],[0,23,1,24],[0,25,1,25],[0,26,0,27],[0,28,0,30],[0,31,0,32]]}
["상 호",null,null,null,{"$f":"P1","v":"2023-01-01"},null,null,null,null,null,null,null,null,null,"기간",{"$f":"노임DB!E5","v":"2023-01-01"},null,null,null,null,null,null,"현장명",{"$f":"노임DB!Y1","v":0},null,"고용관리책임자","성명",null,null,null,null,"팀장",null,"세율",null,150000,"4대보험 미신고자 일괄공제",null,null,"국민연금(2022상)"]
[null,null,null,null,null,null,null,null,null,null,null,null,null,null,null,{"$f":"DATE(YEAR(P1),MONTH(P1)+1,DAY(P1))-1","v":"2023-01-31"},null,null,null,null,null,null,null,null,null,null,"주민등록번호",null,null,null,null,"홍길동",null,"갑근세","국민연금","고용보험","갑근세","국민연금","고용보험","최저",330000]
["신고여부","공종명","성  명","주민등록번호\n전화번호","주        소\n직        종","공 수",null,null,null,null,null,null,null,null,null,null,null,null,null,null,null,"총공수","노무비         단  가","노무비            총   액","공  제 총  액","차   감         지급액","영수인","고용보험","소득세","건강보험","적용제외",{"$f":"MATCH(AF2,노임DB!C:C,0)","v":7},null,"주민세","건강보험","장기요양","주민세","건강보험","장기요양","최고",5240000]
[null,null,null,null,null,{"$f":"P1","v":"2023-01-01"},{"$f":"F4+1","v":"2023-01-02"},{"$f":"G4+1","v":"2023-01-03"},"2023-01-04","2023-01-05","2023-01-06","2023-01-07","2023-01-08","2023-01-09","2023-01-10","2023-01-11","2023-01-12","2023-01-13","2023-01-14","2023-01-15",null,null,null,null,null,null,null,null,null,null,null,null,null,2.7E-2,4.4999999999999998E-2,8.0000000000000002E-3,3.3000000000000002E-2,0,0]
[null,null,null,null,null,{"$f":"T4+1","v":"2023-01-16"},{"$f":"F5+1","v":"2023-01-17"},"2023-01-18","2023-01-19","2023-01-20","2023-01-21","2023-01-22","2023-01-23",{"$f":"M5+1","v":"2023-01-24"},"2023-01-25","2023-01-26","2023-01-27","2023-01-28","2023-01-29","2023-01-30","2023-01-31",null,null,null,null,null,null,null,"지방소득세","국민연금","적용제외",null,null,2.7000000000000001E-3,3.4950000000000002E-2,0.1227,0,0,0]
["신고",{"$f":"IF(C6=\"\",\"\",IFERROR(VLOOKUP(C6,출역인원,6,0),\"노무DATA없음\"))","v":"현장소장"},{"$f":"IF(OFFSET(INDIRECT(\"노임DB!$C$\"&$AF$3),INT((ROW()-5)/2),0)=\"\",\"\",(OFFSET(INDIRECT(\"노임DB!$C$\"&$AF$3),INT((ROW()-5)/2),0)))","v":"홍길동"},{"$f":"IF(C6=\"\",\"\",IFERROR(VLOOKUP(C6,출역인원,2,0),\"노무DATA없음\"))","v":"000101-1000000"},{"$f":"IF(C6=\"\",\"\",IFERROR(VLOOKUP(C6,출역인원,3,0),\"노무DATA없음\"))","v":0},{"$f":"IF(OR(OFFSET(INDIRECT(\"노임DB!$E$\"&$AF$3),INT((ROW()-6)/2),COLUMN()-6)=\"\",OFFSET(INDIRECT(\"노임DB!$E$\"&$AF$3),INT((ROW()-6)/2),COLUMN()-6)*1=0),0,OFFSET(INDIRECT(\"노임DB!$E$\"&$AF$3),INT((ROW()-6)/2),COLUMN()-6)*1)","v":1},0,0,0,0,0,0,0,0,0,0,0,0,0,0,null,{"$f":"SUM(F6:U7)","v":1},250000,{"$f":"V6*W6","v":250000},{"$f":"SUM(AB6:AD7)","v":2970},{"$f":"X6-Y6","v":247030},null,{"$f":"IF(LEN(D6)<>14,0,IF(INT(TEXT($P$1,\"yyyy.mmdd\")-TEXT(TEXT(LEFT(D6,6),\"1900-00-00\"),\"yyyy.mmdd\"))>=65,\"65세이상\",TRUNC(X6*$AJ$4+0.5,-1)))","v":"65세이상"},{"$f":"IF(AG6=\"Y\",TRUNC(X6*$AH$4,-1),SUM(IF(F6:U7*W6>$AJ$1,TRUNC((F6:U7*W6-$AJ$1)*$AH$4,-1))))","v":2700},{"$f":"IF(AE6<>\"NO\",0,IF(LEN(D6)<>14,0,IF(OR(V6<20,X6=0),0,IF(X6<$AO$2,SUM(TRUNC($AO$2*$AI$5,-1),TRUNC(TRUNC($AO$2*$AI$5,-1)*$AJ$5,-1)),SUM(TRUNC(X6*$AI$5,-1),TRUNC((TRUNC(X6*$AI$5,-1)*$AJ$5),-1))))))","v":0},"NO",{"$f":"IF(C6=\"\",\"\",VLOOKUP(C6,출역인원,9,0))","v":0},{"$f":"IF(C6=\"\",\"\",VLOOKUP(C6,출역인원,10,0))","v":0},null,{"$f":"IF(C6=\"\",\"\",VLOOKUP(C6,출역인원,11,0))","v":0}]
{"$rows_left_out":18}
{"sheet":"일용노무비지급명세서(마이스터)","index":5,"n_rows":26,"n_cols":42,"rows_kept":26,"cut":false,"hidden":false,"merged":[[22,25,23,25],[22,30,23,30],[16,33,17,33],[16,34,17,35],[16,36,17,36],[18,33,19,33],[18,34,19,35],[18,36,19,36],[20,33,21,33],[20,34,21,35],[20,36,21,36],[22,33,23,33],[22,34,23,35],[22,36,23,36],[22,32,23,32],[16,30,17,30],[16,32,17,32],[20,25,21,25],[20,30,21,30],[20,32,21,32],[3,34,3,35],[4,33,5,33],[4,34,5,35],[4,36,5,36],[6,33,7,33],[6,34,7,35],[6,36,7,36],[8,33,9,33],[8,34,9,35],[8,36,9,36],[10,33,11,33],[10,34,11,35],[10,36,11,36],[12,33,13,33],[12,34,13,35],[12,36,13,36],[14,33,15,33],[14,34,15,35],[14,36,15,36],[20,0,21,0],[20,1,21,1],[20,2,21,2],[20,3,21,3],[20,5,20,6],[10,30,11,30],[10,32,11,32],[11,4,11,6],[14,5,14,6],[12,0,13,0],[16,0,17,0],[16,1,17,1],[16,2,17,2],[16,3,17,3],[16,5,16,6],[17,4,17,6],[18,32,19,32],[18,0,19,0],[18,1,19,1],[18,2,19,2],[18,3,19,3],[18,5,18,6],[19,4,19,6],[21,4,21,6],[0,6,0,7],[0,24,0,25],[0,29,0,31],[1,27,1,28],[2,1,3,1],[2,3,3,3],[2,5,2,6],[0,2,0,3],[4,25,5,25],[4,30,5,30],[5,4,5,6],[4,23,5,23],[4,24,5,24],[1,25,3,25],[1,30,3,30],[6,1,7,1],[6,2,7,2],[8,25,9,25],[8,30,9,30],[6,25,7,25],[6,30,7,30],[14,2,15,2],[14,3,15,3],[12,1,13,1],[12,2,13,2],[12,3,13,3],[12,5,12,6],[12,23,13,23],[12,24,13,24],[12,25,13,25],[6,24,7,24],[8,24,9,24],[14,23,15,23],[14,24,15,24],[15,4,15,6],[12,30,13,30],[14,25,15,25],[14,30,15,30],[22,0,23,0],[22,1,23,1],[22,2,23,2],[22,3,23,3],[22,5,22,6],[23,4,23,6],[0,40,0,41],[1,34,2,35],[24,32,25,32],[14,32,15,32],[24,30,25,30],[24,31,25,31],[0,0,0,1],[4,32,5,32],[6,32,7,32],[1,32,1,33],[2,32,2,33],[1,23,3,23],[1,0,1,3],[0,19,0,20],[0,21,0,22],[1,7,1,22],[0,8,0,18],[1,24,3,24],[24,1,25,6],[24,23,25,23],[24,25,25,25],[1,36,2,36],[13,4,13,6],[14,0,15,0],[10,23,11,23],[10,24,11,24],[16,23,17,23],[16,24,17,24],[18,23,19,23],[18,24,19,24],[18,25,19,25],[18,30,19,30],[24,24,25,24],[22,23,23,23],[22,24,23,24],[6,0,7,0],[12,32,13,32],[8,32,9,32],[8,0,9,0],[8,1,9,1],[8,2,9,2],[8,3,9,3],[0,34,0,35],[10,0,11,0],[10,1,11,1],[10,2,11,2],[10,3,11,3],[10,5,10,6],[14,1,15,1],[20,23,21,23],[20,24,21,24],[10,25,11,25],[16,25,17,25],[0,32,0,33],[8,5,8,6],[4,0,5,0],[4,1,5,1],[4,2,5,2],[4,3,5,3],[4,5,4,6],[6,3,7,3],[6,5,6,6],[6,23,7,23],[9,4,9,6],[7,4,7,6],[8,23,9,23]]}
["회사명",null,null,null,"귀속",{"$f":"노임DB!A1","v":2023},{"$f":"노임DB!C1","v":1},null,"일 용 노 무 비 지 급 명 세 서",null,null,null,null,null,null,null,null,null,null,{"$f":"노임DB!E5","v":"2023-01-01"},null,{"$f":"DATE(YEAR(T1),MONTH(T1)+1,DAY(T1))-1","v":"2023-01-31"},null,"관리자",null,null,"연락처",null,"현장명",{"$f":"노임DB!Y1","v":0},null,null,"팀장",null,"세율",null,150000,"소득세","국민연금","건강보험","국민연금(2023상)"]
["일용근로자인적사항",null,null,null,null,"직종/주소(입력)",null,"출          력          현          황",null,null,null,null,null,null,null,null,null,null,null,null,null,null,null,"근무\n일수","일일\n단가","보수\n총액",null,"공제금액",null,null,"차감\n지급액",null,"홍길동",null,"4대보험 미신고자 일괄공제",null,0.03,"주민세","고용보험","요양보험","최저",350000]
["일련","성명","주민(외국인)","국적","직종","핸드폰번호",null,{"$f":"T1","v":"2023-01-01"},{"$f":"H3+1","v":"2023-01-02"},{"$f":"I3+1","v":"2023-01-03"},"2023-01-04","2023-01-05","2023-01-06","2023-01-07","2023-01-08","2023-01-09","2023-01-10","2023-01-11","2023-01-12","2023-01-13","2023-01-14","2023-01-15",null,null,null,null,"소득세","국민연금","건강보험","가불입력",null,"팀명",{"$f":"MATCH(AG2,노임DB!C:C,0)","v":7},null,null,null,null,2.7E-2,4.4999999999999998E-2,3.5450000000000002E-2,"최고",5530000]
["번호",null,"등록번호",null,"시.군","구,동,번지,아파트","동,호수",{"$f":"V3+1","v":"2023-01-16"},{"$f":"H4+1","v":"2023-01-17"},{"$f":"I4+1","v":"2023-01-18"},"2023-01-19","2023-01-20","2023-01-21","2023-01-22","2023-01-23","2023-01-24","2023-01-25","2023-01-26","2023-01-27","2023-01-28","2023-01-29","2023-01-30","2023-01-31",null,null,null,"주민세","고용보험","요양보험","공제총액",null,"신고여부","적용제외","은행","계좌번호",null,"예금주",2.7000000000000001E-3,8.9999999999999993E-3,0.12809999999999999]
["1",{"$f":"IF(OFFSET(INDIRECT(\"노임DB!$C$\"&$AG$3),INT((ROW()-5)/2),0)=\"\",\"\",(OFFSET(INDIRECT(\"노임DB!$C$\"&$AG$3),INT((ROW()-5)/2),0)))","v":"홍길동"},{"$f":"IF(B5=\"\",\"\",IFERROR(VLOOKUP(B5,출역인원,2,0),\"노무DATA없음\"))","v":"000101-1000000"},{"$f":"IF(B5=\"\",\"\",IFERROR(VLOOKUP(B5,출역인원,16,0),\"노무DATA없음\"))","v":0},{"$f":"IF(B5=\"\",\"\",IFERROR(VLOOKUP(B5,출역인원,6,0),\"노무DATA없음\"))","v":"현장소장"},{"$f":"IF(B5=\"\",\"\",IFERROR(VLOOKUP(B5,출역인원,12,0),\"노무DATA없음\"))","v":0},null,{"$f":"IF(OR(OFFSET(INDIRECT(\"노임DB!$E$\"&$AG$3),INT((ROW()-5)/2),COLUMN()-8)=\"\",OFFSET(INDIRECT(\"노임DB!$E$\"&$AG$3),INT((ROW()-5)/2),COLUMN()-8)*1=0),0,OFFSET(INDIRECT(\"노임DB!$E$\"&$AG$3),INT((ROW()-5)/2),COLUMN()-8)*1)","v":1},{"$f":"IF(OR(OFFSET(INDIRECT(\"노임DB!$E$\"&$AG$3),INT((ROW()-5)/2),COLUMN()-8)=\"\",OFFSET(INDIRECT(\"노임DB!$E$\"&$AG$3),INT((ROW()-5)/2),COLUMN()-8)*1=0),0,OFFSET(INDIRECT(\"노임DB!$E$\"&$AG$3),INT((ROW()-5)/2),COLUMN()-8)*1)","v":0},0,0,0,0,0,0,0,0,0,0,0,0,0,null,{"$f":"SUM(H5:W6)","v":1},250000,{"$f":"X5*Y5","v":250000},{"$f":"IF(AG5=\"Y\",TRUNC(Z5*$AK$2,-1),IF(TRUNC(SUM(IF(H5:W6*Y5>$AK$1,(H5:W6*Y5-$AK$1))*$AL$3),-1)<1000,0,TRUNC(SUM(IF(H5:W6*Y5>$AK$1,(H5:W6*Y5-$AK$1))*$AL$3),-1)))","v":2700},{"$f":"IF(AG5=\"Y\",0,IF(LEN(C5)<>14,0,IF(MID(C5,8,1)<\"3\",IF(INT(TEXT($T$1,\"yyyy.mmdd\")-TEXT(TEXT(LEFT(C5,6),\"1900-00-00\"),\"yyyy.mmdd\"))>=60,\"60세이상\",IF(OR(X5<8,Z5=0),0,IF(Z5<$AP$2,TRUNC($AP$2*$AM$3,-1),IF(Z5>$AP$3,TRUNC($AP$3*$AM$3,-1),+TRUNC(Z5*$AM$3,-1))))),IF(INT(TEXT($T$1,\"yyyy.mmdd\")-TEXT(TEXT(LEFT(C5,6),\"00-00-00\"),\"yyyy.mmdd\"))>=60,\"60세이상\",IF(OR(X5<8,Z5=0),0,IF(Z5<$AP$2,TRUNC($AP$2*$AM$3,-1),IF(Z5>$AP$3,TRUNC($AP$3*$AM$3,-1),+TRUNC(Z5*$AM$3,-1))))))))","v":"60세이상"},{"$f":"IF(AG5=\"Y\",0,IF(LEN(C5)<>14,0,IF(OR(X5<8,X5=0),0,IF(Z5<$AP$2,TRUNC($AP$2*$AN$3,-1),SUM(TRUNC(Z5*$AN$3,-1))))))","v":0},null,{"$f":"Z5-AD6","v":247030},null,null,{"$f":"IF(B5=\"\",\"\",VLOOKUP(B5,출역인원,9,0))","v":0},{"$f":"IF(B5=\"\",\"\",VLOOKUP(B5,출역인원,10,0))","v":0},null,{"$f":"IF(B5=\"\",\"\",VLOOKUP(B5,출역인원,11,0))","v":0}]
[null,null,null,null,{"$f":"IF(B5=\"\",\"\",IFERROR(VLOOKUP(B5,출역인원,3,0),\"노무DATA없음\"))","v":0},null,null,{"$f":"IF(OR(OFFSET(INDIRECT(\"노임DB!$E$\"&$AG$3),INT((ROW()-6)/2),COLUMN()+7)=0,OFFSET(INDIRECT(\"노임DB!$E$\"&$AG$3),INT((ROW()-6)/2),COLUMN()+7)=\"\"),0,OFFSET(INDIRECT(\"노임DB!$E$\"&$AG$3),INT((ROW()-6)/2),COLUMN()+7))","v":0},{"$f":"IF(OR(OFFSET(INDIRECT(\"노임DB!$E$\"&$AG$3),INT((ROW()-6)/2),COLUMN()+7)=0,OFFSET(INDIRECT(\"노임DB!$E$\"&$AG$3),INT((ROW()-6)/2),COLUMN()+7)=\"\"),0,OFFSET(INDIRECT(\"노임DB!$E$\"&$AG$3),INT((ROW()-6)/2),COLUMN()+7))","v":0},0,0,0,0,0,0,0,0,0,0,0,0,0,0,null,null,null,{"$f":"TRUNC(AA5*10%,-1)","v":270},{"$f":"IF(AG5=\"Y\",0,IF(LEN(C5)<>14,0,IF(INT(TEXT($T$1,\"yyyy.mmdd\")-TEXT(TEXT(LEFT(C5,6),\"1900-00-00\"),\"yyyy.mmdd\"))>=65,\"65세이상\",TRUNC(Z5*$AM$4+0.5,-1))))","v":"65세이상"},{"$f":"IF(AG5=\"Y\",0,IF(LEN(C5)<>14,0,IF(OR(X5<8,X5=0),0,IF(Z5<$AP$2,TRUNC($AP$2*$AN$3*$AN$4,-1),SUM(TRUNC(Z5*$AN$3*$AN$4,-1))))))","v":0},{"$f":"SUM(AA5:AC6,AD5)","v":2970}]
{"$rows_left_out":21}
{"sheet":"출역일보(00)","index":6,"n_rows":56,"n_cols":19,"rows_kept":56,"cut":false,"hidden":false,"merged":[[24,4,24,10],[24,11,24,18],[35,4,35,10],[44,4,44,10],[45,11,45,12],[34,4,34,5],[43,4,43,5],[44,11,44,12],[36,11,36,12],[37,11,37,12],[39,11,39,12],[40,11,40,12],[41,11,41,12],[42,11,42,12],[43,11,43,12],[35,11,35,12],[49,4,49,5],[49,11,49,12],[48,4,48,5],[48,11,48,12],[53,4,55,5],[50,4,50,5],[50,11,50,12],[51,4,51,5],[51,11,51,12],[52,4,52,5],[52,11,52,12],[47,4,47,5],[47,11,47,12],[46,4,46,5],[46,11,46,12],[25,11,25,12],[26,11,26,12],[27,11,27,12],[28,11,28,12],[45,4,45,5],[29,11,29,12],[30,11,30,12],[31,11,31,12],[38,11,38,12],[34,11,34,12],[32,11,32,12],[33,11,33,12],[5,0,5,2],[0,4,0,18],[3,5,3,8],[4,5,4,11],[4,12,4,18]]}
[null,null,null,null,"공     사     일     보"]
[]
[null,null,null,null,"공 사 명",{"$f":"노임DB!$Y$1","v":0}]
[{"$f":"MID(REPLACE(CELL(\"FILENAME\",A1),1,FIND(\"]\",CELL(\"FILENAME\",A1)),\"\"),6,2)*1","v":0},null,null,null,"일     자",{"$f":"DATE(노임DB!A1,노임DB!C1,A4)","v":"2022-12-31"},null,null,null,"날   씨","맑음"]
[">0",null,null,null,"공종","금 일 작 업 사 항",null,null,null,null,null,null,"명 일 작 업 사 항"]
[]
{"$rows_left_out":51}
{"sheet":"출역일보(01)","index":7,"n_rows":507,"n_cols":50,"rows_kept":507,"cut":false,"hidden":false,"merged":[[46,4,46,5],[47,4,47,5],[48,4,48,5],[49,4,49,5],[53,4,55,5],[50,4,50,5],[51,4,51,5],[52,4,52,5],[51,11,51,12],[52,11,52,12],[43,11,43,12],[44,11,44,12],[45,11,45,12],[46,11,46,12],[47,11,47,12],[48,11,48,12],[49,11,49,12],[50,11,50,12],[35,4,35,10],[44,4,44,10],[45,4,45,5],[34,4,34,5],[34,11,34,12],[39,11,39,12],[40,11,40,12],[41,11,41,12],[42,11,42,12],[36,11,36,12],[37,11,37,12],[43,4,43,5],[38,11,38,12],[25,11,25,12],[33,11,33,12],[32,11,32,12],[35,11,35,12],[31,11,31,12],[26,11,26,12],[27,11,27,12],[28,11,28,12],[29,11,29,12],[30,11,30,12],[4,47,4,49],[3,22,3,24],[3,25,3,26],[3,27,3,29],[3,32,3,34],[3,35,3,36],[3,37,3,39],[3,47,3,49],[5,0,5,2],[4,20,4,21],[4,5,4,11],[4,12,4,18],[4,45,4,46],[3,20,3,21],[3,30,3,31],[3,40,3,41],[3,42,3,44],[3,45,3,46],[24,11,24,18],[24,4,24,10],[0,4,0,18],[3,5,3,8],[4,42,4,44],[4,22,4,24],[4,30,4,31],[4,40,4,41],[4,37,4,39],[4,25,4,26],[4,27,4,29],[4,32,4,34],[4,35,4,36],[0,20,2,29],[0,30,2,39],[0,40,2,49]]}
[null,null,null,null,"공     사     일     보",null,null,null,null,null,null,null,null,null,null,null,null,null,null,null,"출 역 일 보",null,null,null,null,null,null,null,null,null,"출 역 일 보",null,null,null,null,null,null,null,null,null,"출 역 일 보"]
[]
[null,null,null,null,"공 사 명",{"$f":"노임DB!$Y$1","v":0}]
[{"$f":"DAY(F4)","v":1},{"$f":"MID(REPLACE(CELL(\"FILENAME\",A1),1,FIND(\"]\",CELL(\"FILENAME\",A1)),\"\"),6,2)*1","v":1},null,null,"일     자",{"$f":"DATE(노임DB!A1,노임DB!C1,MID(REPLACE(CELL(\"FILENAME\",A1),1,FIND(\"]\",CELL(\"FILENAME\",A1)),\"\"),6,2)*1+노임DB!C5-1)","v":"2023-01-01"},null,null,null,"날   씨","맑음",null,null,null,null,null,null,null,null,null,"공 사 명",null,{"$f":"$F$3","v":0},null,null,"업 체 명",null,null,null,null,"공 사 명",null,{"$f":"$F$3","v":0},null,null,"업 체 명",null,{"$f":"$AB$4","v":0},null,null,"공 사 명",null,{"$f":"$F$3","v":0},null,null,"업 체 명",null,{"$f":"$AB$4","v":0}]
[">0",null,null,null,"공종","금 일 작 업 사 항",null,null,null,null,null,null,"명 일 작 업 사 항",null,null,null,null,null,null,null,"일     자",null,{"$f":"$F$4","v":"2023-01-01"},null,null,"날     씨",null,{"$f":"$K$4","v":"맑음"},null,null,"일     자",null,{"$f":"$F$4","v":"2023-01-01"},null,null,"날     씨",null,{"$f":"$K$4","v":"맑음"},null,null,"일     자",null,{"$f":"$F$4","v":"2023-01-01"},null,null,"날     씨",null,{"$f":"$K$4","v":"맑음"}]
[null,null,null,null,null,null,null,null,null,null,null,null,null,null,null,null,null,null,null,null,"NO","직종","성명","공수","작업내용","NO","직종","성명","공수","작업내용","NO","직종","성명","공수","작업내용","NO","직종","성명","공수","작업내용","NO","직종","성명","공수","작업내용","NO","직종","성명","공수","작업내용"]
{"$rows_left_out":501}