{"text_format":"1","workbook":"xlsx","n_sheets":14,"sheets":["총정리","급여명세서","일용직근로정보","급여명세서(양식)","순서","급여테이블","사원명단","추가근로정보","시간외수당 계산","지급정보","4대보험 정보","공제정보","근로소득간이세액표","메모"],"not_rendered":{"charts":0,"images":1,"macros":1,"external_links":0,"defined_names":1,"comments":7,"pivot_tables":0},"unopened":[],"bounds":{"document_bytes":16777216,"sheet_cells":100000,"rows_first":2000,"rows_last":500,"rows_between":2000,"halvings":0,"cell_chars":16384,"cell_head_chars":4096},"cells_cut":0,"cells_raw":0,"read":"whole","date_system":"1900"}

{"sheet":"총정리","index":0,"n_rows":11,"n_cols":23,"rows_kept":11,"cut":false,"hidden":false,"merged":[]}
[2023,"년",11,"월","급여대장"]
[]
[]
[null,null,null,null,"지급정보",null,null,null,null,null,null,null,"공제정보"]
["순번","성명","사번","호봉","기본급","기술수당","식대","자가운전보조금","연장/휴일/야간","총과세합산금액","총비과세금액","지급총액","국민연금","국민건강보험","장기요양보험","고용보험","소득세","지방세","공제총액","실지급액","은행명","계좌번호","계좌주"]
[1,"경경경",23001,1,2806900,null,170000,null,21440,2828340,170000,5826680,158890,126930,16250,25450,25840,2584,355944,5470736,"우리","1002-111-1111111","경경경"]
[2,"민민민",23002,"1(기)",1800000,200000,200000,200000,165800,2165800,400000,4731600,110920,88620,11350,19490,24660,2466,257506,4474094,"국민","320012-100-1200","민민민"]
[3,"홍길동",23003,3,2000000,null,200000,200000,207460,2207460,400000,4814920,73930,59080,7560,19860,25950,2595,188975,4625945,"카카오","3333-12-0000051","홍길동"]
[4,"김김김",23005,8,null,null,null,null,0,0,0,0,0,0,0,0,null,null,0,0,"신한","110-10-100000","김김김"]
[5,"길길길",23007,"4(기)",2100000,200000,200000,200000,0,2300000,400000,5000000,132750,106350,13620,20700,29160,2916,305496,4694504,"수협","123-11-111100","길길길"]
[6,"이박",23009,"일용직",1,null,1,1,0,1,2,4,null,null,0,0,null,null,0,4,"카카오","3333-18-1055550","이박"]

{"sheet":"급여명세서","index":1,"n_rows":38,"n_cols":10,"rows_kept":38,"cut":false,"hidden":false,"merged":[[1,0,1,3],[2,0,2,3],[9,0,9,1],[9,2,9,3]]}
[]
[" 급 여 지 급 명 세 서",null,null,null,null,"조회 사번",23001]
[{"$f":"\"(\"&총정리!C1&\"월 지급분)\"","v":"(11월 지급분)"},null,null,null,null,"급여지급일",{"$f":"\"2023-\"&총정리!C1&\"-25\"","v":"2023-11-25"}]
[null,null,null,null,null,null,null,null,"↓ 아래 빈칸에 검색가능"]
[null,null,"[출력일]",{"$f":"NOW()","v":"2023-11-20T14:25:56.580"},null,null,null,null,"이름검색","홍길동"]
["성명","경경경","지급일",{"$f":"G3","v":"2023-11-25"},null,null,null,null,"사번검색"]
["사번",23001,"호봉",1]
["※ 계좌정보","우리","1002-111-1111111","(경경경)"]
[]
["지급항목",null,"공제항목"]
["기본급",2806900,"국민연금",158890]
["식대",170000,"국민건강보험",126930]
["연장/휴일/야간",21440,"장기요양보험",16250]
[null,null,"고용보험",25450]
["[과세분 합계]",2828340,"소득세",25840]
["[비과세분 합계]",170000,"지방세",2584]
["지급합계",2998340,"공제합계",355944]
["급여 외 과세합산금",0,"실지급액",2642396]
[null,0,0,0]
["근로일수","연장근로시간","야간근로시간","휴일근로시간"]
[30,1,0,0]
[]
[]
["지급항목","산출방법","공제항목","산출방법"]
["연장근로수당","연장근로시간*단가*1.5배","국민연금","소득월액*0.45%"]
["야간근로수당","야간근로시간*단가*1.5배","건강보험","보수월액*3.545%"]
["휴일근로수당","휴일근로시간*단가*1.5배","장기요양보험","건강보험료*12.81%"]
["식대","월 정액","고용보험","과세분합계*0.9%"]
["중도퇴사시","수당*근로일수/월일수","근로소득세","근로소득간이지급명세서"]
[null,null,"지방소득세","소득세*10%"]
[]
["※ 귀하의 노고에 감사드립니다."]
[]
[]
[]
[null,"업체명 :","UJUNI.COM","(인)"]
[]
[null,"대표자 : ","UJUNI","(인)"]

{"sheet":"일용직근로정보","index":2,"n_rows":3,"n_cols":3,"rows_kept":3,"cut":false,"hidden":true,"merged":[]}
[]
[]
["순번","성명","사번"]

{"sheet":"급여명세서(양식)","index":3,"n_rows":37,"n_cols":7,"rows_kept":37,"cut":false,"hidden":true,"merged":[[1,0,1,3],[2,0,2,3],[8,0,8,1],[8,2,8,3]]}
[]
[" 급 여 지 급 명 세 서",null,null,null,null,"조회 사번",23001]
[{"$f":"\"(\"&총정리!C1&\"월 지급분)\"","v":"(11월 지급분)"},null,null,null,null,"급여지급일",{"$f":"\"2023-\"&총정리!C1&\"-25\"","v":"2023-11-25"}]
[]
[null,null,"[출력일]",{"$f":"NOW()","v":"2023-11-20T14:25:56.580"}]
["성명",null,"지급일",{"$f":"G3","v":"2023-11-25"}]
["사번",null,"호봉"]
[]
["지급항목",null,"공제항목"]
[]
[]
[]
[]
[]
["[과세분합계]"]
["[비과세분합계]"]
["지급합계",null,"공제합계"]
["급여외과세합산금",null,"실지급액"]
[]
["근로일수","연장근로시간","야간근로시간","휴일근로시간"]
[]
[]
["지급항목","산출방법","공제항목","산출방법"]
["연장근로수당",null,"국민연금"]
["야간근로수당",null,"건강보험"]
["휴일근로수당",null,"장기요양보험"]
["식대",null,"고용보험"]
[null,null,"근로소득세"]
[null,null,"지방소득세"]
[]
["※ 귀하의 노고에 감사드립니다."]
[]
[]
[]
[null,"업체명 :",null,"(인)"]
[]
[null,"대표자 : ",null,"(인)"]

{"sheet":"순서","index":4,"n_rows":39,"n_cols":12,"rows_kept":39,"cut":false,"hidden":false,"merged":[]}
[]
[null,"※ 작업 순서 ( 각 카테고리 버튼을 누르면 해당 시트가 표시/감추기 전환됩니다. )",null,null,null,null,null,null,null,"아래 모든 작업이 완료된 후 총정리 시트의 불러오기를 눌러 자료를 최종 정리합니다."]
[]
[null,null,null,null,null,"1) 급여테이블 작성",null,null,"급여의 기본적인 구성체계를 입력."]
[null,null,null,null,null,null,null,null,"호봉별로 차등 지급 되도록 설정 가능"]
[null,null,null,null,null,null,null,null,"통상임금 정보 및 비과세 항목 설정"]
[null,null,null,null,null,null,null,null,"매월/ 각 월 지급 설정 가능."]
[]
[null,null,null,null,null,"2) 사원 명단 작성",null,null,"급여를 받을 대상들의 정보를 기입합니다."]
[null,null,null,null,null,null,null,null,"사번을 통해 구분됩니다."]
[null,null,null,null,null,null,null,null,"주민번호를 통해 중복자를 걸러냅니다."]
[null,null,null,null,null,null,null,null,"부양가족 정보를 통해 소득세 원천징수 계산을 반영합니다."]
[null,null,null,null,null,null,null,null,"호봉과 무관한 개인별로 지급할 수당을 별도 입력 가능합니다.(과세분만 가능, 통상임금에서 제외됨)"]
[]
[]
[]
[null,null,null,null,null,"1) 추가근로정보 ",null,null,"추가근로 발생시 내용을 정리"]
[]
[null,null,null,null,null,"2) 시간외 수당 계산",null,null,"추가근로 기입이 완료되면 시간외수당을 계산"]
[null,null,"↑ 매월 작업"]
[null,null,null,null,null,"3) 지급정보",null,null,"시간외 수당이 모두 입력되면 지급정보 계산을 돌려 지급관련 정보를 총 정리."]
[null,null,null,null,null,null,null,null,"자동으로 정리된 내용에서 정정할 부분이 있으면 수기로 정정 가능."]
[null,null,null,null,null,null,null,null,"(수기로 정정시 버튼을 다시 돌리면 정정한 내용이 날아갈 수 있습니다.) 시간외 수당 등은 변경시 자동으로 반영됩니다."]
[null,null,null,null,null,null,null,null,"(추가 지급 기입을 입력하신 내용이 날아갈 수 있습니다.)"]
[null,null,null,null,null,null,null,null,"(버튼은 초기에 한번만!!!!)"]
[]
[null,null,null,null,null,"1) 4대보험 정보",null,null,"지급정보를 통해 과세합산금이 산출되면, 4대보험 계산이 가능합니다."]
[null,null,null,null,null,null,null,null,"(고용보험 및 산재보험이 과세합산금과 관련됨)"]
[null,null,null,null,null,null,null,null,"국민연금 소득월액 업데이트",null,null,"매년 7월 갱신"]
[null,null,"↑ 매월 작업",null,null,null,null,null,"건강보험 보수월액 업데이트",null,null,"매년 4월 갱신"]
[]
[null,null,null,null,null,"2) 공제정보",null,null,"4대보험이 마감되면 버튼을 눌러 공제정보를 최종적으로 정리합니다."]
[null,null,null,null,null,null,null,null,"추가로 공제할 내용이있다면 수기로 입력 가능합니다"]
[null,null,null,null,null,null,null,null,"(지급과 달리 버튼을 수시로 눌러도 추가 공제 기입 내용이 유지됩니다.)"]
[null,null,null,null,null,null,null,null,"(버튼 수시로 누르셔도 됩니다)"]
[]
[null,null,null,null,null,"1) 근로소득간이세액표",null,null,"원천징수될 세액이 정리되어있습니다. 매년 달라지니 국세청에 관련 고지가 뜨면 업데이트해주세요."]
[]
[null,null,null,null,null,"2) 메모",null,null,"급여관련 특이사항을 메모해두려고 만들어 놓은 시트입니다."]

{"sheet":"급여테이블","index":5,"n_rows":20,"n_cols":10,"rows_kept":20,"cut":false,"hidden":true,"merged":[]}
[10,"비과세 한도",null,null,null,null,null,null,200000,200000]
[null,"과세/비과세","과세","과세","과세","과세","과세","과세","비과세","비과세"]
[null,"지급월",0,0,0,"6,12","1,9,8,12","1,9",0,0]
["연 환산","직책(호봉)","기본급","직책수당","기술수당","정근수당","상여금","명절수당","식대","자가운전보조금"]
[35824800,1,2806900,null,null,null,null,null,{"$f":"(_xlfn.DAYS(EOMONTH(총정리!A1&\"-\"&총정리!C1&\"-1\",0),총정리!A1&\"-\"&총정리!C1&\"-1\")+1-A1)*8500","v":170000}]
[39380000,2,1900000,null,null,1900000,1900000,190000,200000,200000]
[41200000,3,2000000,null,null,2000000,2000000,200000,200000,200000]
[43020000,4,2100000,null,null,2100000,2100000,210000,200000,200000]
[44840000,5,2200000,null,null,2200000,2200000,220000,200000,200000]
[46660000,6,2300000,null,null,2300000,2300000,230000,200000,200000]
[48480000,7,2400000,null,null,2400000,2400000,240000,200000,200000]
[50300000,8,2500000,null,null,2500000,2500000,250000,200000,200000]
[52120000,9,2600000,null,null,2600000,2600000,260000,200000,200000]
[53940000,10,2700000,null,null,2700000,2700000,270000,200000,200000]
[39960000,"1(기)",1800000,null,200000,1800000,1800000,180000,200000,200000]
[41780000,"2(기)",1900000,null,200000,1900000,1900000,190000,200000,200000]
[43600000,"3(기)",2000000,null,200000,2000000,2000000,200000,200000,200000]
[45420000,"4(기)",2100000,null,200000,2100000,2100000,210000,200000,200000]
[47240000,"5(기)",2200000,null,200000,2200000,2200000,220000,200000,200000]
[36,"일용직",1,null,null,null,null,null,1,1]

{"sheet":"사원명단","index":6,"n_rows":11,"n_cols":21,"rows_kept":11,"cut":false,"hidden":true,"merged":[[0,5,0,6],[0,7,0,9],[0,10,0,15]]}
[null,null,null,null,null,"공제정보",null,"급여계좌정보",null,null,"별도 추가 수당",null,null,null,null,null,null,null,"이하 기타정보"]
["순번","성명","사번","직책","호봉(급여기준)","공제대상가족수","8세 이상 20세 이하 자녀 수","은행","계좌번호","계좌주","수당1 ","수당1금액","수당2","수당2금액","수당3","수당3금액","재직여부","육휴 지급비율","주민번호","입사일","주소"]
[1,"경경경",23001,"대표",1,2,1,"우리","1002-111-1111111","경경경",null,null,null,null,null,null,"y",null,870321]
[2,"민민민",23002,"대표","1(기)",1,null,"국민","320012-100-1200","민민민",null,null,null,null,null,null,"y",null,870312]
[3,"홍길동",23003,"직원",3,1,0,"카카오","3333-12-0000051","홍길동",null,null,null,null,null,null,"y",null,870333]
[4,"스티브",23004,"직원",2,1,null,"토스","312-100-10000","스티브",null,null,null,null,null,null,"n",null,900515]
[5,"김김김",23005,"직원",8,1,1,"신한","110-10-100000","김김김",null,null,null,null,null,null,"육",0,950513]
[6,"홍홍홍",23006,"직원",3,1,null,"농협","089-71-540231","홍홍홍",null,null,null,null,null,null,"무",null,870221]
[7,"길길길",23007,"직원","4(기)",1,null,"수협","123-11-111100","길길길",null,null,null,null,null,null,"y",null,650605]
[8,"동동동",23008,"직원",5,1,2,"광주","11-120-4455000","동동동",null,null,null,null,null,null,"n",null,880908]
[9,"이박",23009,"일용직","일용직",1,null,"카카오","3333-18-1055550","이박",null,null,null,null,null,null,"일",null,970303]

{"sheet":"추가근로정보","index":7,"n_rows":8,"n_cols":17,"rows_kept":8,"cut":false,"hidden":true,"merged":[[2,5,2,6],[2,7,2,8],[2,9,2,12]]}
[null,null,null,null,null,null,null,null,null,"하루근무시간",{"$f":"IF(M2>M1,HOUR(M2-M1)-K2,HOUR(24+M2-M1)-K2)","v":8},"근무시작시간","09:00:00","4시간근무",0.5]
[null,null,null,null,null,null,null,null,null,"휴게시간",{"$f":"IF(M2>M1,IF(HOUR(M2-M1)>=9,O2,IF(HOUR(M2-M1)>=4.5,O1,\"\")),IF(HOUR(24+M2-M1)>=9,O2,IF(HOUR(24+M2-M1)>=4.5,O1,\"\")))","v":1},"근무종료시간","18:00:00","8시간근무",1]
[null,null,null,null,null,"시작시간",null,"종료시간",null,"시간외",null,null,null,"정규","정규","정규","정규"]
["순번","성명","사번","근로일자","주/휴일 구분","시","분","시","분","총시간","휴일일반","연장근로","야간근로","야간근로","근무시작시간","근무종료시간"," 휴게시간"]
[1,"홍길동",23003,"2023-11-20",null,18,0,23,0,5,null,4.5,1,0,"09:00:00","18:00:00",1.5]
[2,"경경경",23001,"2023-11-21",null,18,0,19,0,1,null,1,0,0,"09:00:00","18:00:00",1]
[3,"민민민",23002,"2023-11-19","주말",9,0,17,0,8,7,0,0,null,null,null,1]
[4,"홍길동",23003,"2023-11-18","주말",9,0,12,0,3,3,0,0,null,null,null,0]

{"sheet":"시간외수당 계산","index":8,"n_rows":7,"n_cols":20,"rows_kept":7,"cut":false,"hidden":true,"merged":[[2,3,2,7],[2,11,2,15],[1,17,1,19]]}
[]
[null,null,null,null,null,null,null,null,null,null,null,null,null,null,null,null,null,"(야간 근무자 계산시 참고용)"]
[null,null,null,null,null,null,null,null,null,null,null,"특근수당 지급내역",null,null,null,null,null,"정규시간","정규시간","정규시간"]
["순번","성명","사번","평일(연장)","평일(야간)","휴일(일반)","휴일(연장)","휴일(야간)","특근일수","통상임금","시간당 단가","평일(연장)","평일(야간)","휴일(일반)","휴일(연장)","휴일(야간)","수당지급총액","정규(야간)","금액","일수"]
[1,"홍길동",23003,4.5,1,3,0,0,2,3400001,{"$f":"ROUNDUP(J5/209,-1)","v":16270},{"$f":"ROUNDUP(D5*$K5*1.5,-1)","v":109830},24410,73220,{"$f":"ROUNDUP(G5*$K5*2,-1)","v":0},0,{"$f":"SUM(L5:P5)","v":207460},0,{"$f":"ROUNDUP(R5*$K5*1.5,-1)","v":0},0]
[2,"경경경",23001,1,0,null,null,null,1,2985400,{"$f":"ROUNDUP(J6/209,-1)","v":14290},21440,0,0,0,0,{"$f":"SUM(L6:P6)","v":21440},null,{"$f":"ROUNDUP(R6*$K6*1.5,-1)","v":0}]
[3,"민민민",23002,null,null,7,0,0,1,3300000,{"$f":"ROUNDUP(J7/209,-1)","v":15790},0,0,165800,0,0,{"$f":"SUM(L7:P7)","v":165800},null,{"$f":"ROUNDUP(R7*$K7*1.5,-1)","v":0}]

{"sheet":"지급정보","index":9,"n_rows":10,"n_cols":15,"rows_kept":10,"cut":false,"hidden":true,"merged":[]}
[null,null,{"$f":"총정리!C1","v":11},"월"]
[]
[null,null,null,null,"급여테이블",null,null,null,null,null,"시간외수당","기타입력자료"]
["순번","성명","사번","호봉","기본급","직책수당","기술수당","식대","자가운전보조금","육휴수당","연장/휴일/야간","급여 외 과세합산금","기타추가수당","총과세합산금액","총비과세금액"]
[1,"경경경",23001,1,2806900,null,null,170000,null,null,{"$f":"_xlfn.IFNA(VLOOKUP(C5,'시간외수당 계산'!C:Q,15,FALSE),0)","v":21440},null,null,2828340,170000]
[2,"민민민",23002,"1(기)",1800000,null,200000,200000,200000,null,{"$f":"_xlfn.IFNA(VLOOKUP(C6,'시간외수당 계산'!C:Q,15,FALSE),0)","v":165800},null,null,2165800,400000]
[3,"홍길동",23003,3,2000000,null,null,200000,200000,null,{"$f":"_xlfn.IFNA(VLOOKUP(C7,'시간외수당 계산'!C:Q,15,FALSE),0)","v":207460},null,null,2207460,400000]
[4,"김김김",23005,8,null,null,null,null,null,0,{"$f":"_xlfn.IFNA(VLOOKUP(C8,'시간외수당 계산'!C:Q,15,FALSE),0)","v":0},null,null,0,0]
[5,"길길길",23007,"4(기)",2100000,null,200000,200000,200000,null,{"$f":"_xlfn.IFNA(VLOOKUP(C9,'시간외수당 계산'!C:Q,15,FALSE),0)","v":0},null,null,2300000,400000]
[6,"이박",23009,"일용직",1,null,null,1,1,null,{"$f":"_xlfn.IFNA(VLOOKUP(C10,'시간외수당 계산'!C:Q,15,FALSE),0)","v":0},null,null,1,2]

{"sheet":"4대보험 정보","index":10,"n_rows":12,"n_cols":20,"rows_kept":12,"cut":false,"hidden":true,"merged":[[4,3,4,6],[4,7,4,12]]}
[null,null,null,null,null,"국민연금요율",0.09,"고용보험요율",2.0500000000000001E-2,null,"국민연금 하한",16650,"국민연금 상한",265500]
[null,null,null,null,null,"건강보험요율",7.0900000000000005E-2,"산재보험요율",7.0000000000000001E-3,null,"건강보험 하한",19780,"건강보험 상한",7822560]
[null,null,null,null,null,"장기요양보험요율",0.12809999999999999,"고용안전보험요율",2.5000000000000001E-3]
[null,null,null,4.4999999999999998E-2,3.5450000000000002E-2,0.12809999999999999,8.9999999999999993E-3,4.4999999999999998E-2,3.5450000000000002E-2,0.12809999999999999,1.15E-2,7.0000000000000001E-3,2.5000000000000001E-3]
[null,null,null,"근로자 부담",null,null,null,"법인부담",null,null,null,null,null,null,"↓매년 7월 갱신",null,"↓매년 4월 갱신"]
["순번","성명","사번","국민연금","건강보험","장기요양보험","고용보험","국민연금","건강보험","장기요양보험","고용보험","산재보험","고용안전보험","특이사항","전년도과세합산금(국민)","전년도 근무일수","전년도과세합산금(건보)","전년도 근무월수","국민연금소득월액","건강보험 보수월액"]
[1,"경경경",23001,{"$f":"IF(ROUNDDOWN(S7*G1/2,-1)<L1,L1,IF(ROUNDDOWN(S7*G1/2,-1)>N1,N1,ROUNDDOWN(S7*G1/2,-1)))","v":158890},{"$f":"IF(ROUNDDOWN(T7*G2/2,-1)<L2,L2,IF(ROUNDDOWN(T7*G2/2,-1)>N2,N2,ROUNDDOWN(T7*G2/2,-1)))","v":126930},{"$f":"ROUNDDOWN(E7*G3,-1)","v":16250},{"$f":"ROUNDDOWN(VLOOKUP(C7,지급정보!C:P,12,FALSE)*0.009,-1)","v":25450},{"$f":"D7","v":158890},126930,16250,{"$f":"ROUNDDOWN(VLOOKUP(C7,지급정보!C:P,12,FALSE)*0.0115,-1)","v":32520},{"$f":"ROUNDDOWN(VLOOKUP(C7,지급정보!C:P,12,FALSE)*I2,-1)","v":19790},null,null,42967395,365,42967395,12,{"$f":"ROUNDDOWN(O7/P7*30,-3)","v":3531000},{"$f":"ROUNDDOWN(Q7/R7,0)","v":3580616}]
[2,"민민민",23002,{"$f":"IF(ROUNDDOWN(S8*G1/2,-1)<L1,L1,IF(ROUNDDOWN(S8*G1/2,-1)>N1,N1,ROUNDDOWN(S8*G1/2,-1)))","v":110920},{"$f":"IF(ROUNDDOWN(T8*G2/2,-1)<L2,L2,IF(ROUNDDOWN(T8*G2/2,-1)>N2,N2,ROUNDDOWN(T8*G2/2,-1)))","v":88620},{"$f":"ROUNDDOWN(E8*G3,-1)","v":11350},{"$f":"ROUNDDOWN(VLOOKUP(C8,지급정보!C:P,12,FALSE)*0.009,-1)","v":19490},110920,88620,11350,{"$f":"ROUNDDOWN(VLOOKUP(C8,지급정보!C:P,12,FALSE)*0.0115,-1)","v":24900},{"$f":"ROUNDDOWN(VLOOKUP(C8,지급정보!C:P,12,FALSE)*I2,-1)","v":15160},null,null,30000000,365,30000000,12,2465000,2500000]
[3,"홍길동",23003,{"$f":"IF(ROUNDDOWN(S9*G1/2,-1)<L1,L1,IF(ROUNDDOWN(S9*G1/2,-1)>N1,N1,ROUNDDOWN(S9*G1/2,-1)))","v":73930},{"$f":"IF(ROUNDDOWN(T9*G2/2,-1)<L2,L2,IF(ROUNDDOWN(T9*G2/2,-1)>N2,N2,ROUNDDOWN(T9*G2/2,-1)))","v":59080},{"$f":"ROUNDDOWN(E9*G3,-1)","v":7560},{"$f":"ROUNDDOWN(VLOOKUP(C9,지급정보!C:P,12,FALSE)*0.009,-1)","v":19860},73930,59080,7560,{"$f":"ROUNDDOWN(VLOOKUP(C9,지급정보!C:P,12,FALSE)*0.0115,-1)","v":25380},{"$f":"ROUNDDOWN(VLOOKUP(C9,지급정보!C:P,12,FALSE)*I2,-1)","v":15450},null,null,20000000,365,20000000,12,1643000,1666666]
[4,"김김김",23005,0,0,{"$f":"ROUNDDOWN(E10*G3,-1)","v":0},{"$f":"ROUNDDOWN(VLOOKUP(C10,지급정보!C:P,12,FALSE)*0.009,-1)","v":0},0,0,0,{"$f":"ROUNDDOWN(VLOOKUP(C10,지급정보!C:P,12,FALSE)*0.0115,-1)","v":0},{"$f":"ROUNDDOWN(VLOOKUP(C10,지급정보!C:P,12,FALSE)*I2,-1)","v":0},null,"연금육휴예외,육휴유예",47159260,306,47159260,10,4623000,4715926]
[5,"길길길",23007,{"$f":"IF(ROUNDDOWN(S11*G1/2,-1)<L1,L1,IF(ROUNDDOWN(S11*G1/2,-1)>N1,N1,ROUNDDOWN(S11*G1/2,-1)))","v":132750},{"$f":"IF(ROUNDDOWN(T11*G2/2,-1)<L2,L2,IF(ROUNDDOWN(T11*G2/2,-1)>N2,N2,ROUNDDOWN(T11*G2/2,-1)))","v":106350},{"$f":"ROUNDDOWN(E11*G3,-1)","v":13620},{"$f":"ROUNDDOWN(VLOOKUP(C11,지급정보!C:P,12,FALSE)*0.009,-1)","v":20700},132750,106350,13620,{"$f":"ROUNDDOWN(VLOOKUP(C11,지급정보!C:P,12,FALSE)*0.0115,-1)","v":26450},{"$f":"ROUNDDOWN(VLOOKUP(C11,지급정보!C:P,12,FALSE)*I2,-1)","v":16100},null,null,30000000,305,30000000,10,2950000,3000000]
[6,"이박",23009,null,null,{"$f":"ROUNDDOWN(E12*G3,-1)","v":0},{"$f":"ROUNDDOWN(VLOOKUP(C12,지급정보!C:P,12,FALSE)*0.009,-1)","v":0},0,0,0,{"$f":"ROUNDDOWN(VLOOKUP(C12,지급정보!C:P,12,FALSE)*0.0115,-1)","v":0},{"$f":"ROUNDDOWN(VLOOKUP(C12,지급정보!C:P,12,FALSE)*I2,-1)","v":0},null,null,0,0,0,0,{"$error":"#DIV/0!"},{"$error":"#DIV/0!"}]

{"sheet":"공제정보","index":11,"n_rows":10,"n_cols":10,"rows_kept":10,"cut":false,"hidden":true,"merged":[]}
[]
[]
[null,null,null,null,null,null,null,null,null,"기타공제"]
["순번","성명","사번","국민연금","국민건강보험","장기요양보험","고용보험","소득세","지방세","추가입력"]
[1,"경경경",23001,158890,126930,16250,25450,25840,2584]
[2,"민민민",23002,110920,88620,11350,19490,24660,2466]
[3,"홍길동",23003,73930,59080,7560,19860,25950,2595]
[4,"김김김",23005,0,0,0,0]
[5,"길길길",23007,132750,106350,13620,20700,29160,2916]
[6,"이박",23009,null,null,0,0]

{"sheet":"근로소득간이세액표","index":12,"n_rows":663,"n_cols":13,"rows_kept":663,"cut":false,"hidden":true,"merged":[[0,0,0,12],[3,0,4,1],[3,2,3,12],[652,0,652,1],[653,0,653,1],[653,2,653,12],[660,0,661,1],[660,2,661,12],[662,0,663,1],[662,2,663,12],[654,0,655,1],[654,2,655,12],[656,0,657,1],[656,2,657,12],[658,0,659,1],[658,2,659,12]]}
["2023년 근로소득에 대한 간이세액표(제189조 관련)"]
[]
[]
["월급여액(천원)\n[비과세 및 학자금 제외)",null,"공제대상가족의 수"]
[null,null,1,2,3,4,5,6,7,8,9,10,11]
["이상","미만"]
[770,775,0,0,0,0,0,0,0,0,0,0,0]
[775,780,0,0,0,0,0,0,0,0,0,0,0]
[780,785,0,0,0,0,0,0,0,0,0,0,0]
[785,790,0,0,0,0,0,0,0,0,0,0,0]
[790,795,0,0,0,0,0,0,0,0,0,0,0]
[795,800,0,0,0,0,0,0,0,0,0,0,0]
[800,805,0,0,0,0,0,0,0,0,0,0,0]
[805,810,0,0,0,0,0,0,0,0,0,0,0]
[810,815,0,0,0,0,0,0,0,0,0,0,0]
[815,820,0,0,0,0,0,0,0,0,0,0,0]
[820,825,0,0,0,0,0,0,0,0,0,0,0]
[825,830,0,0,0,0,0,0,0,0,0,0,0]
[830,835,0,0,0,0,0,0,0,0,0,0,0]
[835,840,0,0,0,0,0,0,0,0,0,0,0]
[840,845,0,0,0,0,0,0,0,0,0,0,0]
[845,850,0,0,0,0,0,0,0,0,0,0,0]
[850,855,0,0,0,0,0,0,0,0,0,0,0]
[855,860,0,0,0,0,0,0,0,0,0,0,0]
[860,865,0,0,0,0,0,0,0,0,0,0,0]
[865,870,0,0,0,0,0,0,0,0,0,0,0]
[870,875,0,0,0,0,0,0,0,0,0,0,0]
[875,880,0,0,0,0,0,0,0,0,0,0,0]
[880,885,0,0,0,0,0,0,0,0,0,0,0]
[885,890,0,0,0,0,0,0,0,0,0,0,0]
[890,895,0,0,0,0,0,0,0,0,0,0,0]
[895,900,0,0,0,0,0,0,0,0,0,0,0]
[900,905,0,0,0,0,0,0,0,0,0,0,0]
[905,910,0,0,0,0,0,0,0,0,0,0,0]
[910,915,0,0,0,0,0,0,0,0,0,0,0]
[915,920,0,0,0,0,0,0,0,0,0,0,0]
[920,925,0,0,0,0,0,0,0,0,0,0,0]
[925,930,0,0,0,0,0,0,0,0,0,0,0]
[930,935,0,0,0,0,0,0,0,0,0,0,0]
[935,940,0,0,0,0,0,0,0,0,0,0,0]
[940,945,0,0,0,0,0,0,0,0,0,0,0]
[945,950,0,0,0,0,0,0,0,0,0,0,0]
[950,955,0,0,0,0,0,0,0,0,0,0,0]
[955,960,0,0,0,0,0,0,0,0,0,0,0]
[960,965,0,0,0,0,0,0,0,0,0,0,0]
[965,970,0,0,0,0,0,0,0,0,0,0,0]
[970,975,0,0,0,0,0,0,0,0,0,0,0]
[975,980,0,0,0,0,0,0,0,0,0,0,0]
[980,985,0,0,0,0,0,0,0,0,0,0,0]
[985,990,0,0,0,0,0,0,0,0,0,0,0]
[990,995,0,0,0,0,0,0,0,0,0,0,0]
[995,1000,0,0,0,0,0,0,0,0,0,0,0]
[1000,1005,0,0,0,0,0,0,0,0,0,0,0]
[1005,1010,0,0,0,0,0,0,0,0,0,0,0]
[1010,1015,0,0,0,0,0,0,0,0,0,0,0]
[1015,1020,0,0,0,0,0,0,0,0,0,0,0]
[1020,1025,0,0,0,0,0,0,0,0,0,0,0]
[1025,1030,0,0,0,0,0,0,0,0,0,0,0]
[1030,1035,0,0,0,0,0,0,0,0,0,0,0]
[1035,1040,0,0,0,0,0,0,0,0,0,0,0]
[1040,1045,0,0,0,0,0,0,0,0,0,0,0]
[1045,1050,0,0,0,0,0,0,0,0,0,0,0]
[1050,1055,0,0,0,0,0,0,0,0,0,0,0]
[1055,1060,0,0,0,0,0,0,0,0,0,0,0]
[1060,1065,1040,0,0,0,0,0,0,0,0,0,0]
[1065,1070,1110,0,0,0,0,0,0,0,0,0,0]
[1070,1075,1180,0,0,0,0,0,0,0,0,0,0]
[1075,1080,1250,0,0,0,0,0,0,0,0,0,0]
[1080,1085,1320,0,0,0,0,0,0,0,0,0,0]
[1085,1090,1390,0,0,0,0,0,0,0,0,0,0]
[1090,1095,1460,0,0,0,0,0,0,0,0,0,0]
[1095,1100,1530,0,0,0,0,0,0,0,0,0,0]
[1100,1105,1600,0,0,0,0,0,0,0,0,0,0]
[1105,1110,1670,0,0,0,0,0,0,0,0,0,0]
[1110,1115,1740,0,0,0,0,0,0,0,0,0,0]
[1115,1120,1810,0,0,0,0,0,0,0,0,0,0]
[1120,1125,1880,0,0,0,0,0,0,0,0,0,0]
[1125,1130,1950,0,0,0,0,0,0,0,0,0,0]
[1130,1135,2020,0,0,0,0,0,0,0,0,0,0]
[1135,1140,2090,0,0,0,0,0,0,0,0,0,0]
[1140,1145,2160,0,0,0,0,0,0,0,0,0,0]
[1145,1150,2230,0,0,0,0,0,0,0,0,0,0]
[1150,1155,2300,0,0,0,0,0,0,0,0,0,0]
[1155,1160,2370,0,0,0,0,0,0,0,0,0,0]
[1160,1165,2440,0,0,0,0,0,0,0,0,0,0]
[1165,1170,2500,0,0,0,0,0,0,0,0,0,0]
[1170,1175,2570,0,0,0,0,0,0,0,0,0,0]
[1175,1180,2640,0,0,0,0,0,0,0,0,0,0]
[1180,1185,2710,0,0,0,0,0,0,0,0,0,0]
[1185,1190,2780,0,0,0,0,0,0,0,0,0,0]
[1190,1195,2850,0,0,0,0,0,0,0,0,0,0]
[1195,1200,2920,0,0,0,0,0,0,0,0,0,0]
[1200,1205,2990,0,0,0,0,0,0,0,0,0,0]
[1205,1210,3060,0,0,0,0,0,0,0,0,0,0]
[1210,1215,3130,0,0,0,0,0,0,0,0,0,0]
[1215,1220,3200,0,0,0,0,0,0,0,0,0,0]
[1220,1225,3270,0,0,0,0,0,0,0,0,0,0]
[1225,1230,3340,0,0,0,0,0,0,0,0,0,0]
[1230,1235,3410,0,0,0,0,0,0,0,0,0,0]
[1235,1240,3480,0,0,0,0,0,0,0,0,0,0]
[1240,1245,3550,0,0,0,0,0,0,0,0,0,0]
[1245,1250,3620,0,0,0,0,0,0,0,0,0,0]
[1250,1255,3700,0,0,0,0,0,0,0,0,0,0]
[1255,1260,3810,0,0,0,0,0,0,0,0,0,0]
[1260,1265,3910,0,0,0,0,0,0,0,0,0,0]
[1265,1270,4010,0,0,0,0,0,0,0,0,0,0]
[1270,1275,4120,0,0,0,0,0,0,0,0,0,0]
[1275,1280,4220,0,0,0,0,0,0,0,0,0,0]
[1280,1285,4320,0,0,0,0,0,0,0,0,0,0]
[1285,1290,4430,0,0,0,0,0,0,0,0,0,0]
[1290,1295,4530,0,0,0,0,0,0,0,0,0,0]
[1295,1300,4630,0,0,0,0,0,0,0,0,0,0]
[1300,1305,4740,0,0,0,0,0,0,0,0,0,0]
[1305,1310,4840,0,0,0,0,0,0,0,0,0,0]
[1310,1315,4940,0,0,0,0,0,0,0,0,0,0]
[1315,1320,5050,0,0,0,0,0,0,0,0,0,0]
[1320,1325,5150,0,0,0,0,0,0,0,0,0,0]
[1325,1330,5250,0,0,0,0,0,0,0,0,0,0]
[1330,1335,5360,0,0,0,0,0,0,0,0,0,0]
[1335,1340,5460,0,0,0,0,0,0,0,0,0,0]
[1340,1345,5560,1060,0,0,0,0,0,0,0,0,0]
[1345,1350,5670,1170,0,0,0,0,0,0,0,0,0]
[1350,1355,5770,1270,0,0,0,0,0,0,0,0,0]
[1355,1360,5870,1370,0,0,0,0,0,0,0,0,0]
[1360,1365,5980,1480,0,0,0,0,0,0,0,0,0]
[1365,1370,6080,1580,0,0,0,0,0,0,0,0,0]
[1370,1375,6180,1680,0,0,0,0,0,0,0,0,0]
[1375,1380,6290,1790,0,0,0,0,0,0,0,0,0]
[1380,1385,6390,1890,0,0,0,0,0,0,0,0,0]
[1385,1390,6490,1990,0,0,0,0,0,0,0,0,0]
[1390,1395,6600,2100,0,0,0,0,0,0,0,0,0]
[1395,1400,6700,2200,0,0,0,0,0,0,0,0,0]
[1400,1405,6800,2300,0,0,0,0,0,0,0,0,0]
[1405,1410,6910,2410,0,0,0,0,0,0,0,0,0]
[1410,1415,7010,2510,0,0,0,0,0,0,0,0,0]
[1415,1420,7110,2610,0,0,0,0,0,0,0,0,0]
[1420,1425,7210,2710,0,0,0,0,0,0,0,0,0]
[1425,1430,7320,2820,0,0,0,0,0,0,0,0,0]
[1430,1435,7420,2920,0,0,0,0,0,0,0,0,0]
[1435,1440,7520,3020,0,0,0,0,0,0,0,0,0]
[1440,1445,7630,3130,0,0,0,0,0,0,0,0,0]
[1445,1450,7730,3230,0,0,0,0,0,0,0,0,0]
[1450,1455,7830,3330,0,0,0,0,0,0,0,0,0]
[1455,1460,7940,3440,0,0,0,0,0,0,0,0,0]
[1460,1465,8040,3540,0,0,0,0,0,0,0,0,0]
[1465,1470,8140,3640,0,0,0,0,0,0,0,0,0]
[1470,1475,8250,3750,0,0,0,0,0,0,0,0,0]
[1475,1480,8350,3850,0,0,0,0,0,0,0,0,0]
[1480,1485,8450,3950,0,0,0,0,0,0,0,0,0]
[1485,1490,8560,4060,0,0,0,0,0,0,0,0,0]
[1490,1495,8660,4160,0,0,0,0,0,0,0,0,0]
[1495,1500,8760,4260,0,0,0,0,0,0,0,0,0]
[1500,1510,8920,4420,0,0,0,0,0,0,0,0,0]
[1510,1520,9120,4620,0,0,0,0,0,0,0,0,0]
[1520,1530,9330,4830,0,0,0,0,0,0,0,0,0]
[1530,1540,9540,5040,0,0,0,0,0,0,0,0,0]
[1540,1550,9740,5240,0,0,0,0,0,0,0,0,0]
[1550,1560,9950,5450,0,0,0,0,0,0,0,0,0]
[1560,1570,10160,5660,0,0,0,0,0,0,0,0,0]
[1570,1580,10360,5860,0,0,0,0,0,0,0,0,0]
[1580,1590,10570,6070,0,0,0,0,0,0,0,0,0]
[1590,1600,10780,6280,0,0,0,0,0,0,0,0,0]
[1600,1610,10980,6480,0,0,0,0,0,0,0,0,0]
[1610,1620,11190,6690,0,0,0,0,0,0,0,0,0]
[1620,1630,11400,6900,0,0,0,0,0,0,0,0,0]
[1630,1640,11600,7100,0,0,0,0,0,0,0,0,0]
[1640,1650,11810,7310,0,0,0,0,0,0,0,0,0]
[1650,1660,12020,7520,0,0,0,0,0,0,0,0,0]
[1660,1670,12220,7720,0,0,0,0,0,0,0,0,0]
[1670,1680,12430,7930,0,0,0,0,0,0,0,0,0]
[1680,1690,12640,8140,0,0,0,0,0,0,0,0,0]
[1690,1700,12840,8340,0,0,0,0,0,0,0,0,0]
[1700,1710,13050,8550,0,0,0,0,0,0,0,0,0]
[1710,1720,13260,8760,0,0,0,0,0,0,0,0,0]
[1720,1730,13460,8960,1040,0,0,0,0,0,0,0,0]
[1730,1740,13670,9170,1240,0,0,0,0,0,0,0,0]
[1740,1750,13880,9380,1440,0,0,0,0,0,0,0,0]
[1750,1760,14080,9580,1640,0,0,0,0,0,0,0,0]
[1760,1770,14290,9790,1830,0,0,0,0,0,0,0,0]
[1770,1780,14500,10000,2030,0,0,0,0,0,0,0,0]
[1780,1790,14700,10200,2230,0,0,0,0,0,0,0,0]
[1790,1800,14910,10410,2430,0,0,0,0,0,0,0,0]
[1800,1810,15110,10610,2630,0,0,0,0,0,0,0,0]
[1810,1820,15320,10820,2830,0,0,0,0,0,0,0,0]
[1820,1830,15530,11030,3020,0,0,0,0,0,0,0,0]
[1830,1840,15730,11230,3220,0,0,0,0,0,0,0,0]
[1840,1850,15940,11440,3420,0,0,0,0,0,0,0,0]
[1850,1860,16150,11650,3620,0,0,0,0,0,0,0,0]
[1860,1870,16350,11850,3820,0,0,0,0,0,0,0,0]
[1870,1880,16560,12060,4020,0,0,0,0,0,0,0,0]
[1880,1890,16770,12270,4220,0,0,0,0,0,0,0,0]
[1890,1900,16970,12470,4410,1040,0,0,0,0,0,0,0]
[1900,1910,17180,12680,4610,1240,0,0,0,0,0,0,0]
[1910,1920,17390,12890,4810,1440,0,0,0,0,0,0,0]
[1920,1930,17590,13090,5010,1630,0,0,0,0,0,0,0]
[1930,1940,17800,13300,5210,1830,0,0,0,0,0,0,0]
[1940,1950,18010,13510,5410,2030,0,0,0,0,0,0,0]
[1950,1960,18210,13710,5600,2230,0,0,0,0,0,0,0]
[1960,1970,18420,13920,5800,2430,0,0,0,0,0,0,0]
[1970,1980,18630,14130,6000,2630,0,0,0,0,0,0,0]
{"$rows_left_out":464}
{"sheet":"메모","index":13,"n_rows":2,"n_cols":2,"rows_kept":2,"cut":false,"hidden":true,"merged":[]}
[]
[null,"※ 급여 관련 특이사항을 메모해두는 용도입니다."]