{"text_format":"1","workbook":"xlsx","n_sheets":13,"sheets":["1월","2월","3월","4월","5월","6월","7월","8월","9월","10월","11월","12월","달력 설정"],"not_rendered":{"charts":0,"images":1,"macros":1,"external_links":0,"defined_names":3,"comments":0,"pivot_tables":0},"unopened":[],"bounds":{"document_bytes":16777216,"sheet_cells":100000,"rows_first":2000,"rows_last":500,"rows_between":2000,"halvings":0,"cell_chars":16384,"cell_head_chars":4096},"cells_cut":0,"cells_raw":0,"read":"whole","date_system":"1900"}

{"sheet":"1월","index":0,"n_rows":33,"n_cols":39,"rows_kept":33,"cut":false,"hidden":false,"merged":[[6,38,6,43],[27,38,27,43],[28,38,28,43],[29,38,29,43],[30,38,30,43],[31,38,31,43],[32,38,32,43],[6,2,11,6],[12,2,13,6],[27,9,27,12],[27,13,27,16],[27,17,27,20],[27,21,27,24],[6,9,6,12],[7,9,7,12],[10,33,10,36],[11,9,11,12],[11,13,11,16],[11,17,11,20],[11,21,11,24],[11,25,11,28],[11,29,11,32],[11,33,11,36],[10,9,10,12],[33,9,33,12],[33,13,33,16],[28,33,28,36],[29,10,29,12],[29,14,29,16],[30,9,30,12],[30,13,30,16],[31,9,31,12],[31,13,31,16],[28,9,28,12],[28,13,28,16],[28,17,28,20],[28,21,28,24],[28,25,28,28],[28,29,28,32],[27,33,27,36],[25,17,25,20],[25,21,25,24],[25,25,25,28],[25,29,25,32],[25,33,25,36],[32,9,32,12],[32,13,32,16],[26,9,26,12],[26,13,26,16],[26,17,26,20],[26,21,26,24],[26,25,26,28],[26,29,26,32],[26,33,26,36],[27,25,27,28],[27,29,27,32],[25,1,25,3],[22,33,22,36],[23,9,23,12],[23,13,23,16],[23,17,23,20],[23,21,23,24],[23,25,23,28],[23,29,23,32],[23,33,23,36],[22,9,22,12],[22,13,22,16],[22,17,22,20],[22,21,22,24],[22,25,22,28],[22,29,22,32],[24,34,24,36],[25,9,25,12],[25,13,25,16],[24,10,24,12],[24,26,24,28],[24,30,24,32],[24,14,24,16],[24,18,24,20],[24,22,24,24],[20,33,20,36],[21,9,21,12],[21,13,21,16],[21,17,21,20],[21,21,21,24],[21,25,21,28],[21,29,21,32],[21,33,21,36],[20,9,20,12],[20,13,20,16],[20,17,20,20],[20,21,20,24],[20,25,20,28],[20,29,20,32],[18,33,18,36],[19,10,19,12],[19,14,19,16],[19,18,19,20],[19,22,19,24],[19,26,19,28],[19,30,19,32],[19,34,19,36],[18,9,18,12],[18,13,18,16],[18,17,18,20],[18,21,18,24],[18,25,18,28],[18,29,18,32],[16,25,16,28],[16,29,16,32],[16,33,16,36],[17,9,17,12],[17,13,17,16],[17,17,17,20],[17,21,17,24],[17,25,17,28],[17,29,17,32],[17,33,17,36],[15,25,15,28],[15,29,15,32],[15,33,15,36],[14,10,14,12],[14,14,14,16],[14,18,14,20],[14,22,14,24],[14,26,14,28],[14,30,14,32],[16,1,16,3],[12,29,12,32],[12,33,12,36],[13,9,13,12],[13,13,13,16],[13,17,13,20],[13,21,13,24],[13,25,13,28],[13,29,13,32],[13,33,13,36],[12,9,12,12],[12,13,12,16],[12,17,12,20],[12,21,12,24],[12,25,12,28],[16,9,16,12],[16,13,16,16],[16,17,16,20],[16,21,16,24],[14,34,14,36],[15,9,15,12],[15,13,15,16],[15,17,15,20],[15,21,15,24],[10,25,10,28],[10,29,10,32],[8,25,8,28],[8,29,8,32],[8,33,8,36],[9,10,9,12],[9,14,9,16],[9,18,9,20],[9,22,9,24],[9,26,9,28],[9,30,9,32],[9,34,9,36],[8,9,8,12],[8,13,8,16],[8,17,8,20],[8,21,8,24],[10,13,10,16],[10,17,10,20],[10,21,10,24],[6,29,6,32],[6,33,6,36],[7,13,7,16],[7,17,7,20],[7,21,7,24],[7,25,7,28],[7,29,7,32],[7,33,7,36],[6,13,6,16],[6,17,6,20],[6,21,6,24],[6,25,6,28],[0,1,2,7],[2,9,3,12],[2,13,3,16],[2,17,3,20],[2,21,3,24],[2,25,3,28],[2,29,3,32],[2,33,3,36],[4,10,4,12],[4,14,4,16],[4,18,4,20],[4,22,4,24],[4,26,4,28],[4,30,4,32],[4,34,4,36],[4,2,5,6],[5,13,5,16],[5,17,5,20],[5,21,5,24],[5,25,5,28],[5,29,5,32],[5,33,5,36],[5,9,5,12],[10,39,10,43],[11,39,11,43],[9,39,9,43],[8,39,8,43],[7,39,7,43],[21,38,21,43],[22,38,22,43],[23,38,23,43],[24,38,24,43],[25,38,25,43],[26,38,26,43],[17,38,17,43],[18,38,18,43],[16,38,16,43],[19,38,19,43],[20,38,20,43],[12,39,12,43],[13,39,13,43]]}
[]
[]
[null,null,null,null,null,null,null,null,null,"일 Sunday",null,null,null,"월 Monday",null,null,null,"화 Tuesday",null,null,null,"수 Wednesday",null,null,null,"목 Thursday",null,null,null,"금 Friday",null,null,null,"토 Saturday"]
[]
[null,null,{"$f":"'달력 설정'!$B$2","v":2025},null,null,null,null,null,null,{"$f":"Calendar($C$5,$C$7,1)","v":""},{"$f":"IFERROR(IF(AND(J5<>\"\",VLOOKUP(DATE($C$5,$C$7,J5),_공휴일날짜,3,FALSE)<>\"\"),VLOOKUP(DATE($C$5,$C$7,J5),_공휴일날짜,3,FALSE),\"\"),\"\")","v":""},null,null,{"$f":"Calendar($C$5,$C$7,2)","v":""},{"$f":"IFERROR(IF(AND(N5<>\"\",VLOOKUP(DATE($C$5,$C$7,N5),_공휴일날짜,3,FALSE)<>\"\"),VLOOKUP(DATE($C$5,$C$7,N5),_공휴일날짜,3,FALSE),\"\"),\"\")","v":""},null,null,{"$f":"Calendar($C$5,$C$7,3)","v":""},{"$f":"IFERROR(IF(AND(R5<>\"\",VLOOKUP(DATE($C$5,$C$7,R5),_공휴일날짜,3,FALSE)<>\"\"),VLOOKUP(DATE($C$5,$C$7,R5),_공휴일날짜,3,FALSE),\"\"),\"\")","v":""},null,null,{"$f":"Calendar($C$5,$C$7,4)","v":"1900-01-01"},{"$f":"IFERROR(IF(AND(V5<>\"\",VLOOKUP(DATE($C$5,$C$7,V5),_공휴일날짜,3,FALSE)<>\"\"),VLOOKUP(DATE($C$5,$C$7,V5),_공휴일날짜,3,FALSE),\"\"),\"\")","v":"신정"},null,null,{"$f":"Calendar($C$5,$C$7,5)","v":"1900-01-02"},{"$f":"IFERROR(IF(AND(Z5<>\"\",VLOOKUP(DATE($C$5,$C$7,Z5),_공휴일날짜,3,FALSE)<>\"\"),VLOOKUP(DATE($C$5,$C$7,Z5),_공휴일날짜,3,FALSE),\"\"),\"\")","v":""},null,null,{"$f":"Calendar($C$5,$C$7,6)","v":"1900-01-03"},{"$f":"IFERROR(IF(AND(AD5<>\"\",VLOOKUP(DATE($C$5,$C$7,AD5),_공휴일날짜,3,FALSE)<>\"\"),VLOOKUP(DATE($C$5,$C$7,AD5),_공휴일날짜,3,FALSE),\"\"),\"\")","v":""},null,null,{"$f":"Calendar($C$5,$C$7,7)","v":"1900-01-04"},{"$f":"IFERROR(IF(AND(AH5<>\"\",VLOOKUP(DATE($C$5,$C$7,AH5),_공휴일날짜,3,FALSE)<>\"\"),VLOOKUP(DATE($C$5,$C$7,AH5),_공휴일날짜,3,FALSE),\"\"),\"\")","v":""}]
[]
[null,1,1,null,null,null,null,null,null,null,null,null,null,null,null,null,null,null,null,null,null,null,null,null,null,null,null,null,null,null,null,null,null,null,null,null,null,null,"Do It List"]
[null,null,null,null,null,null,null,null,null,null,null,null,null,null,null,null,null,null,null,null,null,null,null,null,null,null,null,null,null,null,null,null,null,null,null,null,null,null,false]
[null,null,null,null,null,null,null,null,null,null,null,null,null,null,null,null,null,null,null,null,null,null,null,null,null,null,null,null,null,null,null,null,null,null,null,null,null,null,false]
[null,null,null,null,null,null,null,null,null,{"$f":"Calendar($C$5,$C$7,8)","v":"1900-01-05"},{"$f":"IFERROR(IF(AND(J10<>\"\",VLOOKUP(DATE($C$5,$C$7,J10),_공휴일날짜,3,FALSE)<>\"\"),VLOOKUP(DATE($C$5,$C$7,J10),_공휴일날짜,3,FALSE),\"\"),\"\")","v":""},null,null,{"$f":"Calendar($C$5,$C$7,9)","v":"1900-01-06"},{"$f":"IFERROR(IF(AND(N10<>\"\",VLOOKUP(DATE($C$5,$C$7,N10),_공휴일날짜,3,FALSE)<>\"\"),VLOOKUP(DATE($C$5,$C$7,N10),_공휴일날짜,3,FALSE),\"\"),\"\")","v":""},null,null,{"$f":"Calendar($C$5,$C$7,10)","v":"1900-01-07"},{"$f":"IFERROR(IF(AND(R10<>\"\",VLOOKUP(DATE($C$5,$C$7,R10),_공휴일날짜,3,FALSE)<>\"\"),VLOOKUP(DATE($C$5,$C$7,R10),_공휴일날짜,3,FALSE),\"\"),\"\")","v":""},null,null,{"$f":"Calendar($C$5,$C$7,11)","v":"1900-01-08"},{"$f":"IFERROR(IF(AND(V10<>\"\",VLOOKUP(DATE($C$5,$C$7,V10),_공휴일날짜,3,FALSE)<>\"\"),VLOOKUP(DATE($C$5,$C$7,V10),_공휴일날짜,3,FALSE),\"\"),\"\")","v":""},null,null,{"$f":"Calendar($C$5,$C$7,12)","v":"1900-01-09"},{"$f":"IFERROR(IF(AND(Z10<>\"\",VLOOKUP(DATE($C$5,$C$7,Z10),_공휴일날짜,3,FALSE)<>\"\"),VLOOKUP(DATE($C$5,$C$7,Z10),_공휴일날짜,3,FALSE),\"\"),\"\")","v":""},null,null,{"$f":"Calendar($C$5,$C$7,13)","v":"1900-01-10"},{"$f":"IFERROR(IF(AND(AD10<>\"\",VLOOKUP(DATE($C$5,$C$7,AD10),_공휴일날짜,3,FALSE)<>\"\"),VLOOKUP(DATE($C$5,$C$7,AD10),_공휴일날짜,3,FALSE),\"\"),\"\")","v":""},null,null,{"$f":"Calendar($C$5,$C$7,14)","v":"1900-01-11"},{"$f":"IFERROR(IF(AND(AH10<>\"\",VLOOKUP(DATE($C$5,$C$7,AH10),_공휴일날짜,3,FALSE)<>\"\"),VLOOKUP(DATE($C$5,$C$7,AH10),_공휴일날짜,3,FALSE),\"\"),\"\")","v":""},null,null,null,false]
[null,null,null,null,null,null,null,null,null,null,null,null,null,null,null,null,null,null,null,null,null,null,null,null,null,null,null,null,null,null,null,null,null,null,null,null,null,null,false]
[null,null,null,null,null,null,null,null,null,null,null,null,null,null,null,null,null,null,null,null,null,null,null,null,null,null,null,null,null,null,null,null,null,null,null,null,null,null,false]
[null,null,{"$f":"VLOOKUP($C$7,'달력 설정'!$B$6:$C$17,2,FALSE)","v":"January"},null,null,null,null,null,null,null,null,null,null,null,null,null,null,null,null,null,null,null,null,null,null,null,null,null,null,null,null,null,null,null,null,null,null,null,false]
[null,null,null,null,null,null,null,null,null,null,null,null,null,null,null,null,null,null,null,null,null,null,null,null,null,null,null,null,null,null,null,null,null,null,null,null,null,null,false]
[null,null,null,null,null,null,null,null,null,{"$f":"Calendar($C$5,$C$7,15)","v":"1900-01-12"},{"$f":"IFERROR(IF(AND(J15<>\"\",VLOOKUP(DATE($C$5,$C$7,J15),_공휴일날짜,3,FALSE)<>\"\"),VLOOKUP(DATE($C$5,$C$7,J15),_공휴일날짜,3,FALSE),\"\"),\"\")","v":""},null,null,{"$f":"Calendar($C$5,$C$7,16)","v":"1900-01-13"},{"$f":"IFERROR(IF(AND(N15<>\"\",VLOOKUP(DATE($C$5,$C$7,N15),_공휴일날짜,3,FALSE)<>\"\"),VLOOKUP(DATE($C$5,$C$7,N15),_공휴일날짜,3,FALSE),\"\"),\"\")","v":""},null,null,{"$f":"Calendar($C$5,$C$7,17)","v":"1900-01-14"},{"$f":"IFERROR(IF(AND(R15<>\"\",VLOOKUP(DATE($C$5,$C$7,R15),_공휴일날짜,3,FALSE)<>\"\"),VLOOKUP(DATE($C$5,$C$7,R15),_공휴일날짜,3,FALSE),\"\"),\"\")","v":""},null,null,{"$f":"Calendar($C$5,$C$7,18)","v":"1900-01-15"},{"$f":"IFERROR(IF(AND(V15<>\"\",VLOOKUP(DATE($C$5,$C$7,V15),_공휴일날짜,3,FALSE)<>\"\"),VLOOKUP(DATE($C$5,$C$7,V15),_공휴일날짜,3,FALSE),\"\"),\"\")","v":""},null,null,{"$f":"Calendar($C$5,$C$7,19)","v":"1900-01-16"},{"$f":"IFERROR(IF(AND(Z15<>\"\",VLOOKUP(DATE($C$5,$C$7,Z15),_공휴일날짜,3,FALSE)<>\"\"),VLOOKUP(DATE($C$5,$C$7,Z15),_공휴일날짜,3,FALSE),\"\"),\"\")","v":""},null,null,{"$f":"Calendar($C$5,$C$7,20)","v":"1900-01-17"},{"$f":"IFERROR(IF(AND(AD15<>\"\",VLOOKUP(DATE($C$5,$C$7,AD15),_공휴일날짜,3,FALSE)<>\"\"),VLOOKUP(DATE($C$5,$C$7,AD15),_공휴일날짜,3,FALSE),\"\"),\"\")","v":""},null,null,{"$f":"Calendar($C$5,$C$7,21)","v":"1900-01-18"},{"$f":"IFERROR(IF(AND(AH15<>\"\",VLOOKUP(DATE($C$5,$C$7,AH15),_공휴일날짜,3,FALSE)<>\"\"),VLOOKUP(DATE($C$5,$C$7,AH15),_공휴일날짜,3,FALSE),\"\"),\"\")","v":""}]
[]
[null,{"$f":"VLOOKUP($E$17,'달력 설정'!$B$6:$C$17,2,FALSE)","v":"December"},null,null,{"$f":"IF($C$7=1,12,$C$7-1)","v":12},null,null,null,null,null,null,null,null,null,null,null,null,null,null,null,null,null,null,null,null,null,null,null,null,null,null,null,null,null,null,null,null,null,"MEMO"]
[null,"일","월","화","수","목","금","토"]
[null,{"$f":"IF($C$7=1,Calendar($C$5-1,12,1),Calendar($C$5,$C$7-1,1))","v":"1900-01-01"},{"$f":"IF($C$7=1,Calendar($C$5-1,12,2),Calendar($C$5,$C$7-1,2))","v":"1900-01-02"},{"$f":"IF($C$7=1,Calendar($C$5-1,12,3),Calendar($C$5,$C$7-1,3))","v":"1900-01-03"},{"$f":"IF($C$7=1,Calendar($C$5-1,12,4),Calendar($C$5,$C$7-1,4))","v":"1900-01-04"},{"$f":"IF($C$7=1,Calendar($C$5-1,12,5),Calendar($C$5,$C$7-1,5))","v":"1900-01-05"},{"$f":"IF($C$7=1,Calendar($C$5-1,12,6),Calendar($C$5,$C$7-1,6))","v":"1900-01-06"},{"$f":"IF($C$7=1,Calendar($C$5-1,12,7),Calendar($C$5,$C$7-1,7))","v":"1900-01-07"}]
[null,{"$f":"IF($C$7=1,Calendar($C$5-1,12,8),Calendar($C$5,$C$7-1,8))","v":"1900-01-08"},{"$f":"IF($C$7=1,Calendar($C$5-1,12,9),Calendar($C$5,$C$7-1,9))","v":"1900-01-09"},{"$f":"IF($C$7=1,Calendar($C$5-1,12,10),Calendar($C$5,$C$7-1,10))","v":"1900-01-10"},{"$f":"IF($C$7=1,Calendar($C$5-1,12,11),Calendar($C$5,$C$7-1,11))","v":"1900-01-11"},{"$f":"IF($C$7=1,Calendar($C$5-1,12,12),Calendar($C$5,$C$7-1,12))","v":"1900-01-12"},{"$f":"IF($C$7=1,Calendar($C$5-1,12,13),Calendar($C$5,$C$7-1,13))","v":"1900-01-13"},{"$f":"IF($C$7=1,Calendar($C$5-1,12,14),Calendar($C$5,$C$7-1,14))","v":"1900-01-14"},null,{"$f":"Calendar($C$5,$C$7,22)","v":"1900-01-19"},{"$f":"IFERROR(IF(AND(J20<>\"\",VLOOKUP(DATE($C$5,$C$7,J20),_공휴일날짜,3,FALSE)<>\"\"),VLOOKUP(DATE($C$5,$C$7,J20),_공휴일날짜,3,FALSE),\"\"),\"\")","v":""},null,null,{"$f":"Calendar($C$5,$C$7,23)","v":"1900-01-20"},{"$f":"IFERROR(IF(AND(N20<>\"\",VLOOKUP(DATE($C$5,$C$7,N20),_공휴일날짜,3,FALSE)<>\"\"),VLOOKUP(DATE($C$5,$C$7,N20),_공휴일날짜,3,FALSE),\"\"),\"\")","v":""},null,null,{"$f":"Calendar($C$5,$C$7,24)","v":"1900-01-21"},{"$f":"IFERROR(IF(AND(R20<>\"\",VLOOKUP(DATE($C$5,$C$7,R20),_공휴일날짜,3,FALSE)<>\"\"),VLOOKUP(DATE($C$5,$C$7,R20),_공휴일날짜,3,FALSE),\"\"),\"\")","v":""},null,null,{"$f":"Calendar($C$5,$C$7,25)","v":"1900-01-22"},{"$f":"IFERROR(IF(AND(V20<>\"\",VLOOKUP(DATE($C$5,$C$7,V20),_공휴일날짜,3,FALSE)<>\"\"),VLOOKUP(DATE($C$5,$C$7,V20),_공휴일날짜,3,FALSE),\"\"),\"\")","v":""},null,null,{"$f":"Calendar($C$5,$C$7,26)","v":"1900-01-23"},{"$f":"IFERROR(IF(AND(Z20<>\"\",VLOOKUP(DATE($C$5,$C$7,Z20),_공휴일날짜,3,FALSE)<>\"\"),VLOOKUP(DATE($C$5,$C$7,Z20),_공휴일날짜,3,FALSE),\"\"),\"\")","v":""},null,null,{"$f":"Calendar($C$5,$C$7,27)","v":"1900-01-24"},{"$f":"IFERROR(IF(AND(AD20<>\"\",VLOOKUP(DATE($C$5,$C$7,AD20),_공휴일날짜,3,FALSE)<>\"\"),VLOOKUP(DATE($C$5,$C$7,AD20),_공휴일날짜,3,FALSE),\"\"),\"\")","v":""},null,null,{"$f":"Calendar($C$5,$C$7,28)","v":"1900-01-25"},{"$f":"IFERROR(IF(AND(AH20<>\"\",VLOOKUP(DATE($C$5,$C$7,AH20),_공휴일날짜,3,FALSE)<>\"\"),VLOOKUP(DATE($C$5,$C$7,AH20),_공휴일날짜,3,FALSE),\"\"),\"\")","v":""}]
[null,{"$f":"IF($C$7=1,Calendar($C$5-1,12,15),Calendar($C$5,$C$7-1,15))","v":"1900-01-15"},{"$f":"IF($C$7=1,Calendar($C$5-1,12,16),Calendar($C$5,$C$7-1,16))","v":"1900-01-16"},{"$f":"IF($C$7=1,Calendar($C$5-1,12,17),Calendar($C$5,$C$7-1,17))","v":"1900-01-17"},{"$f":"IF($C$7=1,Calendar($C$5-1,12,18),Calendar($C$5,$C$7-1,18))","v":"1900-01-18"},{"$f":"IF($C$7=1,Calendar($C$5-1,12,19),Calendar($C$5,$C$7-1,19))","v":"1900-01-19"},{"$f":"IF($C$7=1,Calendar($C$5-1,12,20),Calendar($C$5,$C$7-1,20))","v":"1900-01-20"},{"$f":"IF($C$7=1,Calendar($C$5-1,12,21),Calendar($C$5,$C$7-1,21))","v":"1900-01-21"}]
[null,{"$f":"IF($C$7=1,Calendar($C$5-1,12,22),Calendar($C$5,$C$7-1,22))","v":"1900-01-22"},{"$f":"IF($C$7=1,Calendar($C$5-1,12,23),Calendar($C$5,$C$7-1,23))","v":"1900-01-23"},{"$f":"IF($C$7=1,Calendar($C$5-1,12,24),Calendar($C$5,$C$7-1,24))","v":"1900-01-24"},{"$f":"IF($C$7=1,Calendar($C$5-1,12,25),Calendar($C$5,$C$7-1,25))","v":"1900-01-25"},{"$f":"IF($C$7=1,Calendar($C$5-1,12,26),Calendar($C$5,$C$7-1,26))","v":"1900-01-26"},{"$f":"IF($C$7=1,Calendar($C$5-1,12,27),Calendar($C$5,$C$7-1,27))","v":"1900-01-27"},{"$f":"IF($C$7=1,Calendar($C$5-1,12,28),Calendar($C$5,$C$7-1,28))","v":"1900-01-28"}]
[null,{"$f":"IF($C$7=1,Calendar($C$5-1,12,29),Calendar($C$5,$C$7-1,29))","v":"1900-01-29"},{"$f":"IF($C$7=1,Calendar($C$5-1,12,30),Calendar($C$5,$C$7-1,30))","v":"1900-01-30"},{"$f":"IF($C$7=1,Calendar($C$5-1,12,31),Calendar($C$5,$C$7-1,31))","v":"1900-01-31"},{"$f":"IF($C$7=1,Calendar($C$5-1,12,32),Calendar($C$5,$C$7-1,32))","v":""},{"$f":"IF($C$7=1,Calendar($C$5-1,12,33),Calendar($C$5,$C$7-1,33))","v":""},{"$f":"IF($C$7=1,Calendar($C$5-1,12,34),Calendar($C$5,$C$7-1,34))","v":""},{"$f":"IF($C$7=1,Calendar($C$5-1,12,35),Calendar($C$5,$C$7-1,35))","v":""}]
[null,{"$f":"IF($C$7=1,Calendar($C$5-1,12,36),Calendar($C$5,$C$7-1,36))","v":""},{"$f":"IF($C$7=1,Calendar($C$5-1,12,37),Calendar($C$5,$C$7-1,37))","v":""}]
[null,null,null,null,null,null,null,null,null,{"$f":"Calendar($C$5,$C$7,29)","v":"1900-01-26"},{"$f":"IFERROR(IF(AND(J25<>\"\",VLOOKUP(DATE($C$5,$C$7,J25),_공휴일날짜,3,FALSE)<>\"\"),VLOOKUP(DATE($C$5,$C$7,J25),_공휴일날짜,3,FALSE),\"\"),\"\")","v":""},null,null,{"$f":"Calendar($C$5,$C$7,30)","v":"1900-01-27"},{"$f":"IFERROR(IF(AND(N25<>\"\",VLOOKUP(DATE($C$5,$C$7,N25),_공휴일날짜,3,FALSE)<>\"\"),VLOOKUP(DATE($C$5,$C$7,N25),_공휴일날짜,3,FALSE),\"\"),\"\")","v":""},null,null,{"$f":"Calendar($C$5,$C$7,31)","v":"1900-01-28"},{"$f":"IFERROR(IF(AND(R25<>\"\",VLOOKUP(DATE($C$5,$C$7,R25),_공휴일날짜,3,FALSE)<>\"\"),VLOOKUP(DATE($C$5,$C$7,R25),_공휴일날짜,3,FALSE),\"\"),\"\")","v":""},null,null,{"$f":"Calendar($C$5,$C$7,32)","v":"1900-01-29"},{"$f":"IFERROR(IF(AND(V25<>\"\",VLOOKUP(DATE($C$5,$C$7,V25),_공휴일날짜,3,FALSE)<>\"\"),VLOOKUP(DATE($C$5,$C$7,V25),_공휴일날짜,3,FALSE),\"\"),\"\")","v":"설날"},null,null,{"$f":"Calendar($C$5,$C$7,33)","v":"1900-01-30"},{"$f":"IFERROR(IF(AND(Z25<>\"\",VLOOKUP(DATE($C$5,$C$7,Z25),_공휴일날짜,3,FALSE)<>\"\"),VLOOKUP(DATE($C$5,$C$7,Z25),_공휴일날짜,3,FALSE),\"\"),\"\")","v":""},null,null,{"$f":"Calendar($C$5,$C$7,34)","v":"1900-01-31"},{"$f":"IFERROR(IF(AND(AD25<>\"\",VLOOKUP(DATE($C$5,$C$7,AD25),_공휴일날짜,3,FALSE)<>\"\"),VLOOKUP(DATE($C$5,$C$7,AD25),_공휴일날짜,3,FALSE),\"\"),\"\")","v":""},null,null,{"$f":"Calendar($C$5,$C$7,35)","v":""},{"$f":"IFERROR(IF(AND(AH25<>\"\",VLOOKUP(DATE($C$5,$C$7,AH25),_공휴일날짜,3,FALSE)<>\"\"),VLOOKUP(DATE($C$5,$C$7,AH25),_공휴일날짜,3,FALSE),\"\"),\"\")","v":""}]
[null,{"$f":"VLOOKUP($E$26,'달력 설정'!$B$6:$C$17,2,FALSE)","v":"February"},null,null,{"$f":"IF($C$7=12,1,$C$7+1)","v":2}]
[null,"일","월","화","수","목","금","토"]
[null,{"$f":"IF($C$7=12,Calendar($C$5+1,1,1),Calendar($C$5,$C$7+1,1))","v":""},{"$f":"IF($C$7=12,Calendar($C$5+1,1,2),Calendar($C$5,$C$7+1,2))","v":""},{"$f":"IF($C$7=12,Calendar($C$5+1,1,3),Calendar($C$5,$C$7+1,3))","v":""},{"$f":"IF($C$7=12,Calendar($C$5+1,1,4),Calendar($C$5,$C$7+1,4))","v":""},{"$f":"IF($C$7=12,Calendar($C$5+1,1,5),Calendar($C$5,$C$7+1,5))","v":""},{"$f":"IF($C$7=12,Calendar($C$5+1,1,6),Calendar($C$5,$C$7+1,6))","v":""},{"$f":"IF($C$7=12,Calendar($C$5+1,1,7),Calendar($C$5,$C$7+1,7))","v":"1900-01-01"}]
[null,{"$f":"IF($C$7=12,Calendar($C$5+1,1,8),Calendar($C$5,$C$7+1,8))","v":"1900-01-02"},{"$f":"IF($C$7=12,Calendar($C$5+1,1,9),Calendar($C$5,$C$7+1,9))","v":"1900-01-03"},{"$f":"IF($C$7=12,Calendar($C$5+1,1,10),Calendar($C$5,$C$7+1,10))","v":"1900-01-04"},{"$f":"IF($C$7=12,Calendar($C$5+1,1,11),Calendar($C$5,$C$7+1,11))","v":"1900-01-05"},{"$f":"IF($C$7=12,Calendar($C$5+1,1,12),Calendar($C$5,$C$7+1,12))","v":"1900-01-06"},{"$f":"IF($C$7=12,Calendar($C$5+1,1,13),Calendar($C$5,$C$7+1,13))","v":"1900-01-07"},{"$f":"IF($C$7=12,Calendar($C$5+1,1,14),Calendar($C$5,$C$7+1,14))","v":"1900-01-08"}]
[null,{"$f":"IF($C$7=12,Calendar($C$5+1,1,15),Calendar($C$5,$C$7+1,15))","v":"1900-01-09"},{"$f":"IF($C$7=12,Calendar($C$5+1,1,16),Calendar($C$5,$C$7+1,16))","v":"1900-01-10"},{"$f":"IF($C$7=12,Calendar($C$5+1,1,17),Calendar($C$5,$C$7+1,17))","v":"1900-01-11"},{"$f":"IF($C$7=12,Calendar($C$5+1,1,18),Calendar($C$5,$C$7+1,18))","v":"1900-01-12"},{"$f":"IF($C$7=12,Calendar($C$5+1,1,19),Calendar($C$5,$C$7+1,19))","v":"1900-01-13"},{"$f":"IF($C$7=12,Calendar($C$5+1,1,20),Calendar($C$5,$C$7+1,20))","v":"1900-01-14"},{"$f":"IF($C$7=12,Calendar($C$5+1,1,21),Calendar($C$5,$C$7+1,21))","v":"1900-01-15"},null,{"$f":"Calendar($C$5,$C$7,36)","v":""},{"$f":"IFERROR(IF(AND(J30<>\"\",VLOOKUP(DATE($C$5,$C$7,J30),_공휴일날짜,3,FALSE)<>\"\"),VLOOKUP(DATE($C$5,$C$7,J30),_공휴일날짜,3,FALSE),\"\"),\"\")","v":""},null,null,{"$f":"Calendar($C$5,$C$7,37)","v":""},{"$f":"IFERROR(IF(AND(N30<>\"\",VLOOKUP(DATE($C$5,$C$7,N30),_공휴일날짜,3,FALSE)<>\"\"),VLOOKUP(DATE($C$5,$C$7,N30),_공휴일날짜,3,FALSE),\"\"),\"\")","v":""}]
[null,{"$f":"IF($C$7=12,Calendar($C$5+1,1,22),Calendar($C$5,$C$7+1,22))","v":"1900-01-16"},{"$f":"IF($C$7=12,Calendar($C$5+1,1,23),Calendar($C$5,$C$7+1,23))","v":"1900-01-17"},{"$f":"IF($C$7=12,Calendar($C$5+1,1,24),Calendar($C$5,$C$7+1,24))","v":"1900-01-18"},{"$f":"IF($C$7=12,Calendar($C$5+1,1,25),Calendar($C$5,$C$7+1,25))","v":"1900-01-19"},{"$f":"IF($C$7=12,Calendar($C$5+1,1,26),Calendar($C$5,$C$7+1,26))","v":"1900-01-20"},{"$f":"IF($C$7=12,Calendar($C$5+1,1,27),Calendar($C$5,$C$7+1,27))","v":"1900-01-21"},{"$f":"IF($C$7=12,Calendar($C$5+1,1,28),Calendar($C$5,$C$7+1,28))","v":"1900-01-22"}]
[null,{"$f":"IF($C$7=12,Calendar($C$5+1,1,29),Calendar($C$5,$C$7+1,29))","v":"1900-01-23"},{"$f":"IF($C$7=12,Calendar($C$5+1,1,30),Calendar($C$5,$C$7+1,30))","v":"1900-01-24"},{"$f":"IF($C$7=12,Calendar($C$5+1,1,31),Calendar($C$5,$C$7+1,31))","v":"1900-01-25"},{"$f":"IF($C$7=12,Calendar($C$5+1,1,32),Calendar($C$5,$C$7+1,32))","v":"1900-01-26"},{"$f":"IF($C$7=12,Calendar($C$5+1,1,33),Calendar($C$5,$C$7+1,33))","v":"1900-01-27"},{"$f":"IF($C$7=12,Calendar($C$5+1,1,34),Calendar($C$5,$C$7+1,34))","v":"1900-01-28"},{"$f":"IF($C$7=12,Calendar($C$5+1,1,35),Calendar($C$5,$C$7+1,35))","v":""}]
[null,{"$f":"IF($C$7=12,Calendar($C$5+1,1,36),Calendar($C$5,$C$7+1,36))","v":""},{"$f":"IF($C$7=12,Calendar($C$5+1,1,37),Calendar($C$5,$C$7+1,37))","v":""}]

{"sheet":"2월","index":1,"n_rows":33,"n_cols":39,"rows_kept":33,"cut":false,"hidden":false,"merged":[[2,29,3,32],[2,33,3,36],[4,2,5,6],[4,10,4,12],[4,14,4,16],[4,18,4,20],[4,22,4,24],[4,26,4,28],[4,30,4,32],[4,34,4,36],[0,1,2,7],[2,9,3,12],[2,13,3,16],[2,17,3,20],[2,21,3,24],[2,25,3,28],[5,33,5,36],[6,2,11,6],[6,9,6,12],[6,13,6,16],[6,17,6,20],[6,21,6,24],[6,25,6,28],[6,29,6,32],[6,33,6,36],[8,9,8,12],[5,9,5,12],[5,13,5,16],[5,17,5,20],[5,21,5,24],[5,25,5,28],[5,29,5,32],[6,38,6,43],[7,9,7,12],[7,13,7,16],[7,17,7,20],[7,21,7,24],[7,25,7,28],[7,29,7,32],[7,33,7,36],[7,39,7,43],[8,39,8,43],[9,10,9,12],[9,14,9,16],[9,18,9,20],[9,22,9,24],[9,26,9,28],[9,30,9,32],[9,34,9,36],[9,39,9,43],[8,13,8,16],[8,17,8,20],[8,21,8,24],[8,25,8,28],[8,29,8,32],[8,33,8,36],[12,2,13,6],[12,9,12,12],[12,13,12,16],[12,17,12,20],[12,21,12,24],[12,25,12,28],[10,33,10,36],[10,39,10,43],[11,9,11,12],[11,13,11,16],[11,17,11,20],[11,21,11,24],[11,25,11,28],[11,29,11,32],[11,33,11,36],[11,39,11,43],[10,9,10,12],[10,13,10,16],[10,17,10,20],[10,21,10,24],[10,25,10,28],[10,29,10,32],[13,39,13,43],[14,10,14,12],[14,14,14,16],[14,18,14,20],[14,22,14,24],[14,26,14,28],[14,30,14,32],[14,34,14,36],[12,29,12,32],[12,33,12,36],[12,39,12,43],[13,9,13,12],[13,13,13,16],[13,17,13,20],[13,21,13,24],[13,25,13,28],[13,29,13,32],[13,33,13,36],[15,33,15,36],[16,1,16,3],[16,9,16,12],[16,13,16,16],[16,17,16,20],[16,21,16,24],[16,25,16,28],[16,29,16,32],[16,33,16,36],[15,9,15,12],[15,13,15,16],[15,17,15,20],[15,21,15,24],[15,25,15,28],[15,29,15,32],[16,38,16,43],[17,9,17,12],[17,13,17,16],[17,17,17,20],[17,21,17,24],[17,25,17,28],[17,29,17,32],[17,33,17,36],[17,38,17,43],[18,33,18,36],[18,38,18,43],[19,10,19,12],[19,14,19,16],[19,18,19,20],[19,22,19,24],[19,26,19,28],[19,30,19,32],[19,34,19,36],[19,38,19,43],[18,9,18,12],[18,13,18,16],[18,17,18,20],[18,21,18,24],[18,25,18,28],[18,29,18,32],[20,33,20,36],[20,38,20,43],[21,9,21,12],[21,13,21,16],[21,17,21,20],[21,21,21,24],[21,25,21,28],[21,29,21,32],[21,33,21,36],[21,38,21,43],[20,9,20,12],[20,13,20,16],[20,17,20,20],[20,21,20,24],[20,25,20,28],[20,29,20,32],[22,33,22,36],[22,38,22,43],[23,9,23,12],[23,13,23,16],[23,17,23,20],[23,21,23,24],[23,25,23,28],[23,29,23,32],[23,33,23,36],[23,38,23,43],[22,9,22,12],[22,13,22,16],[22,17,22,20],[22,21,22,24],[22,25,22,28],[22,29,22,32],[24,34,24,36],[24,38,24,43],[25,1,25,3],[25,9,25,12],[25,13,25,16],[25,17,25,20],[25,21,25,24],[25,25,25,28],[25,29,25,32],[25,33,25,36],[24,10,24,12],[24,14,24,16],[24,18,24,20],[24,22,24,24],[24,26,24,28],[24,30,24,32],[25,38,25,43],[26,9,26,12],[26,13,26,16],[26,17,26,20],[26,21,26,24],[26,25,26,28],[26,29,26,32],[26,33,26,36],[26,38,26,43],[27,33,27,36],[27,38,27,43],[28,9,28,12],[28,13,28,16],[28,17,28,20],[28,21,28,24],[28,25,28,28],[28,29,28,32],[28,33,28,36],[28,38,28,43],[27,9,27,12],[27,13,27,16],[27,17,27,20],[27,21,27,24],[27,25,27,28],[27,29,27,32],[33,9,33,12],[33,13,33,16],[31,9,31,12],[31,13,31,16],[31,38,31,43],[32,9,32,12],[32,13,32,16],[32,38,32,43],[29,10,29,12],[29,14,29,16],[29,38,29,43],[30,9,30,12],[30,13,30,16],[30,38,30,43]]}
[]
[]
[null,null,null,null,null,null,null,null,null,"일 Sunday",null,null,null,"월 Monday",null,null,null,"화 Tuesday",null,null,null,"수 Wednesday",null,null,null,"목 Thursday",null,null,null,"금 Friday",null,null,null,"토 Saturday"]
[]
[null,null,{"$f":"'달력 설정'!$B$2","v":2025},null,null,null,null,null,null,{"$f":"Calendar($C$5,$C$7,1)","v":""},{"$f":"IFERROR(IF(AND(J5<>\"\",VLOOKUP(DATE($C$5,$C$7,J5),_공휴일날짜,3,FALSE)<>\"\"),VLOOKUP(DATE($C$5,$C$7,J5),_공휴일날짜,3,FALSE),\"\"),\"\")","v":""},null,null,{"$f":"Calendar($C$5,$C$7,2)","v":""},{"$f":"IFERROR(IF(AND(N5<>\"\",VLOOKUP(DATE($C$5,$C$7,N5),_공휴일날짜,3,FALSE)<>\"\"),VLOOKUP(DATE($C$5,$C$7,N5),_공휴일날짜,3,FALSE),\"\"),\"\")","v":""},null,null,{"$f":"Calendar($C$5,$C$7,3)","v":""},{"$f":"IFERROR(IF(AND(R5<>\"\",VLOOKUP(DATE($C$5,$C$7,R5),_공휴일날짜,3,FALSE)<>\"\"),VLOOKUP(DATE($C$5,$C$7,R5),_공휴일날짜,3,FALSE),\"\"),\"\")","v":""},null,null,{"$f":"Calendar($C$5,$C$7,4)","v":""},{"$f":"IFERROR(IF(AND(V5<>\"\",VLOOKUP(DATE($C$5,$C$7,V5),_공휴일날짜,3,FALSE)<>\"\"),VLOOKUP(DATE($C$5,$C$7,V5),_공휴일날짜,3,FALSE),\"\"),\"\")","v":""},null,null,{"$f":"Calendar($C$5,$C$7,5)","v":""},{"$f":"IFERROR(IF(AND(Z5<>\"\",VLOOKUP(DATE($C$5,$C$7,Z5),_공휴일날짜,3,FALSE)<>\"\"),VLOOKUP(DATE($C$5,$C$7,Z5),_공휴일날짜,3,FALSE),\"\"),\"\")","v":""},null,null,{"$f":"Calendar($C$5,$C$7,6)","v":""},{"$f":"IFERROR(IF(AND(AD5<>\"\",VLOOKUP(DATE($C$5,$C$7,AD5),_공휴일날짜,3,FALSE)<>\"\"),VLOOKUP(DATE($C$5,$C$7,AD5),_공휴일날짜,3,FALSE),\"\"),\"\")","v":""},null,null,{"$f":"Calendar($C$5,$C$7,7)","v":"1900-01-01"},{"$f":"IFERROR(IF(AND(AH5<>\"\",VLOOKUP(DATE($C$5,$C$7,AH5),_공휴일날짜,3,FALSE)<>\"\"),VLOOKUP(DATE($C$5,$C$7,AH5),_공휴일날짜,3,FALSE),\"\"),\"\")","v":""}]
[]
[null,1,2,null,null,null,null,null,null,null,null,null,null,null,null,null,null,null,null,null,null,null,null,null,null,null,null,null,null,null,null,null,null,null,null,null,null,null,"Do It List"]
[null,null,null,null,null,null,null,null,null,null,null,null,null,null,null,null,null,null,null,null,null,null,null,null,null,null,null,null,null,null,null,null,null,null,null,null,null,null,false]
[null,null,null,null,null,null,null,null,null,null,null,null,null,null,null,null,null,null,null,null,null,null,null,null,null,null,null,null,null,null,null,null,null,null,null,null,null,null,false]
[null,null,null,null,null,null,null,null,null,{"$f":"Calendar($C$5,$C$7,8)","v":"1900-01-02"},{"$f":"IFERROR(IF(AND(J10<>\"\",VLOOKUP(DATE($C$5,$C$7,J10),_공휴일날짜,3,FALSE)<>\"\"),VLOOKUP(DATE($C$5,$C$7,J10),_공휴일날짜,3,FALSE),\"\"),\"\")","v":""},null,null,{"$f":"Calendar($C$5,$C$7,9)","v":"1900-01-03"},{"$f":"IFERROR(IF(AND(N10<>\"\",VLOOKUP(DATE($C$5,$C$7,N10),_공휴일날짜,3,FALSE)<>\"\"),VLOOKUP(DATE($C$5,$C$7,N10),_공휴일날짜,3,FALSE),\"\"),\"\")","v":""},null,null,{"$f":"Calendar($C$5,$C$7,10)","v":"1900-01-04"},{"$f":"IFERROR(IF(AND(R10<>\"\",VLOOKUP(DATE($C$5,$C$7,R10),_공휴일날짜,3,FALSE)<>\"\"),VLOOKUP(DATE($C$5,$C$7,R10),_공휴일날짜,3,FALSE),\"\"),\"\")","v":""},null,null,{"$f":"Calendar($C$5,$C$7,11)","v":"1900-01-05"},{"$f":"IFERROR(IF(AND(V10<>\"\",VLOOKUP(DATE($C$5,$C$7,V10),_공휴일날짜,3,FALSE)<>\"\"),VLOOKUP(DATE($C$5,$C$7,V10),_공휴일날짜,3,FALSE),\"\"),\"\")","v":""},null,null,{"$f":"Calendar($C$5,$C$7,12)","v":"1900-01-06"},{"$f":"IFERROR(IF(AND(Z10<>\"\",VLOOKUP(DATE($C$5,$C$7,Z10),_공휴일날짜,3,FALSE)<>\"\"),VLOOKUP(DATE($C$5,$C$7,Z10),_공휴일날짜,3,FALSE),\"\"),\"\")","v":""},null,null,{"$f":"Calendar($C$5,$C$7,13)","v":"1900-01-07"},{"$f":"IFERROR(IF(AND(AD10<>\"\",VLOOKUP(DATE($C$5,$C$7,AD10),_공휴일날짜,3,FALSE)<>\"\"),VLOOKUP(DATE($C$5,$C$7,AD10),_공휴일날짜,3,FALSE),\"\"),\"\")","v":""},null,null,{"$f":"Calendar($C$5,$C$7,14)","v":"1900-01-08"},{"$f":"IFERROR(IF(AND(AH10<>\"\",VLOOKUP(DATE($C$5,$C$7,AH10),_공휴일날짜,3,FALSE)<>\"\"),VLOOKUP(DATE($C$5,$C$7,AH10),_공휴일날짜,3,FALSE),\"\"),\"\")","v":""},null,null,null,false]
[null,null,null,null,null,null,null,null,null,null,null,null,null,null,null,null,null,null,null,null,null,null,null,null,null,null,null,null,null,null,null,null,null,null,null,null,null,null,false]
[null,null,null,null,null,null,null,null,null,null,null,null,null,null,null,null,null,null,null,null,null,null,null,null,null,null,null,null,null,null,null,null,null,null,null,null,null,null,false]
[null,null,{"$f":"VLOOKUP($C$7,'달력 설정'!$B$6:$C$17,2,FALSE)","v":"February"},null,null,null,null,null,null,null,null,null,null,null,null,null,null,null,null,null,null,null,null,null,null,null,null,null,null,null,null,null,null,null,null,null,null,null,false]
[null,null,null,null,null,null,null,null,null,null,null,null,null,null,null,null,null,null,null,null,null,null,null,null,null,null,null,null,null,null,null,null,null,null,null,null,null,null,false]
[null,null,null,null,null,null,null,null,null,{"$f":"Calendar($C$5,$C$7,15)","v":"1900-01-09"},{"$f":"IFERROR(IF(AND(J15<>\"\",VLOOKUP(DATE($C$5,$C$7,J15),_공휴일날짜,3,FALSE)<>\"\"),VLOOKUP(DATE($C$5,$C$7,J15),_공휴일날짜,3,FALSE),\"\"),\"\")","v":""},null,null,{"$f":"Calendar($C$5,$C$7,16)","v":"1900-01-10"},{"$f":"IFERROR(IF(AND(N15<>\"\",VLOOKUP(DATE($C$5,$C$7,N15),_공휴일날짜,3,FALSE)<>\"\"),VLOOKUP(DATE($C$5,$C$7,N15),_공휴일날짜,3,FALSE),\"\"),\"\")","v":""},null,null,{"$f":"Calendar($C$5,$C$7,17)","v":"1900-01-11"},{"$f":"IFERROR(IF(AND(R15<>\"\",VLOOKUP(DATE($C$5,$C$7,R15),_공휴일날짜,3,FALSE)<>\"\"),VLOOKUP(DATE($C$5,$C$7,R15),_공휴일날짜,3,FALSE),\"\"),\"\")","v":""},null,null,{"$f":"Calendar($C$5,$C$7,18)","v":"1900-01-12"},{"$f":"IFERROR(IF(AND(V15<>\"\",VLOOKUP(DATE($C$5,$C$7,V15),_공휴일날짜,3,FALSE)<>\"\"),VLOOKUP(DATE($C$5,$C$7,V15),_공휴일날짜,3,FALSE),\"\"),\"\")","v":""},null,null,{"$f":"Calendar($C$5,$C$7,19)","v":"1900-01-13"},{"$f":"IFERROR(IF(AND(Z15<>\"\",VLOOKUP(DATE($C$5,$C$7,Z15),_공휴일날짜,3,FALSE)<>\"\"),VLOOKUP(DATE($C$5,$C$7,Z15),_공휴일날짜,3,FALSE),\"\"),\"\")","v":""},null,null,{"$f":"Calendar($C$5,$C$7,20)","v":"1900-01-14"},{"$f":"IFERROR(IF(AND(AD15<>\"\",VLOOKUP(DATE($C$5,$C$7,AD15),_공휴일날짜,3,FALSE)<>\"\"),VLOOKUP(DATE($C$5,$C$7,AD15),_공휴일날짜,3,FALSE),\"\"),\"\")","v":""},null,null,{"$f":"Calendar($C$5,$C$7,21)","v":"1900-01-15"},{"$f":"IFERROR(IF(AND(AH15<>\"\",VLOOKUP(DATE($C$5,$C$7,AH15),_공휴일날짜,3,FALSE)<>\"\"),VLOOKUP(DATE($C$5,$C$7,AH15),_공휴일날짜,3,FALSE),\"\"),\"\")","v":""}]
[]
[null,{"$f":"VLOOKUP($E$17,'달력 설정'!$B$6:$C$17,2,FALSE)","v":"January"},null,null,{"$f":"IF($C$7=1,12,$C$7-1)","v":1},null,null,null,null,null,null,null,null,null,null,null,null,null,null,null,null,null,null,null,null,null,null,null,null,null,null,null,null,null,null,null,null,null,"MEMO"]
[null,"일","월","화","수","목","금","토"]
[null,{"$f":"IF($C$7=1,Calendar($C$5-1,12,1),Calendar($C$5,$C$7-1,1))","v":""},{"$f":"IF($C$7=1,Calendar($C$5-1,12,2),Calendar($C$5,$C$7-1,2))","v":""},{"$f":"IF($C$7=1,Calendar($C$5-1,12,3),Calendar($C$5,$C$7-1,3))","v":""},{"$f":"IF($C$7=1,Calendar($C$5-1,12,4),Calendar($C$5,$C$7-1,4))","v":"1900-01-01"},{"$f":"IF($C$7=1,Calendar($C$5-1,12,5),Calendar($C$5,$C$7-1,5))","v":"1900-01-02"},{"$f":"IF($C$7=1,Calendar($C$5-1,12,6),Calendar($C$5,$C$7-1,6))","v":"1900-01-03"},{"$f":"IF($C$7=1,Calendar($C$5-1,12,7),Calendar($C$5,$C$7-1,7))","v":"1900-01-04"}]
[null,{"$f":"IF($C$7=1,Calendar($C$5-1,12,8),Calendar($C$5,$C$7-1,8))","v":"1900-01-05"},{"$f":"IF($C$7=1,Calendar($C$5-1,12,9),Calendar($C$5,$C$7-1,9))","v":"1900-01-06"},{"$f":"IF($C$7=1,Calendar($C$5-1,12,10),Calendar($C$5,$C$7-1,10))","v":"1900-01-07"},{"$f":"IF($C$7=1,Calendar($C$5-1,12,11),Calendar($C$5,$C$7-1,11))","v":"1900-01-08"},{"$f":"IF($C$7=1,Calendar($C$5-1,12,12),Calendar($C$5,$C$7-1,12))","v":"1900-01-09"},{"$f":"IF($C$7=1,Calendar($C$5-1,12,13),Calendar($C$5,$C$7-1,13))","v":"1900-01-10"},{"$f":"IF($C$7=1,Calendar($C$5-1,12,14),Calendar($C$5,$C$7-1,14))","v":"1900-01-11"},null,{"$f":"Calendar($C$5,$C$7,22)","v":"1900-01-16"},{"$f":"IFERROR(IF(AND(J20<>\"\",VLOOKUP(DATE($C$5,$C$7,J20),_공휴일날짜,3,FALSE)<>\"\"),VLOOKUP(DATE($C$5,$C$7,J20),_공휴일날짜,3,FALSE),\"\"),\"\")","v":""},null,null,{"$f":"Calendar($C$5,$C$7,23)","v":"1900-01-17"},{"$f":"IFERROR(IF(AND(N20<>\"\",VLOOKUP(DATE($C$5,$C$7,N20),_공휴일날짜,3,FALSE)<>\"\"),VLOOKUP(DATE($C$5,$C$7,N20),_공휴일날짜,3,FALSE),\"\"),\"\")","v":""},null,null,{"$f":"Calendar($C$5,$C$7,24)","v":"1900-01-18"},{"$f":"IFERROR(IF(AND(R20<>\"\",VLOOKUP(DATE($C$5,$C$7,R20),_공휴일날짜,3,FALSE)<>\"\"),VLOOKUP(DATE($C$5,$C$7,R20),_공휴일날짜,3,FALSE),\"\"),\"\")","v":""},null,null,{"$f":"Calendar($C$5,$C$7,25)","v":"1900-01-19"},{"$f":"IFERROR(IF(AND(V20<>\"\",VLOOKUP(DATE($C$5,$C$7,V20),_공휴일날짜,3,FALSE)<>\"\"),VLOOKUP(DATE($C$5,$C$7,V20),_공휴일날짜,3,FALSE),\"\"),\"\")","v":""},null,null,{"$f":"Calendar($C$5,$C$7,26)","v":"1900-01-20"},{"$f":"IFERROR(IF(AND(Z20<>\"\",VLOOKUP(DATE($C$5,$C$7,Z20),_공휴일날짜,3,FALSE)<>\"\"),VLOOKUP(DATE($C$5,$C$7,Z20),_공휴일날짜,3,FALSE),\"\"),\"\")","v":""},null,null,{"$f":"Calendar($C$5,$C$7,27)","v":"1900-01-21"},{"$f":"IFERROR(IF(AND(AD20<>\"\",VLOOKUP(DATE($C$5,$C$7,AD20),_공휴일날짜,3,FALSE)<>\"\"),VLOOKUP(DATE($C$5,$C$7,AD20),_공휴일날짜,3,FALSE),\"\"),\"\")","v":""},null,null,{"$f":"Calendar($C$5,$C$7,28)","v":"1900-01-22"},{"$f":"IFERROR(IF(AND(AH20<>\"\",VLOOKUP(DATE($C$5,$C$7,AH20),_공휴일날짜,3,FALSE)<>\"\"),VLOOKUP(DATE($C$5,$C$7,AH20),_공휴일날짜,3,FALSE),\"\"),\"\")","v":""}]
[null,{"$f":"IF($C$7=1,Calendar($C$5-1,12,15),Calendar($C$5,$C$7-1,15))","v":"1900-01-12"},{"$f":"IF($C$7=1,Calendar($C$5-1,12,16),Calendar($C$5,$C$7-1,16))","v":"1900-01-13"},{"$f":"IF($C$7=1,Calendar($C$5-1,12,17),Calendar($C$5,$C$7-1,17))","v":"1900-01-14"},{"$f":"IF($C$7=1,Calendar($C$5-1,12,18),Calendar($C$5,$C$7-1,18))","v":"1900-01-15"},{"$f":"IF($C$7=1,Calendar($C$5-1,12,19),Calendar($C$5,$C$7-1,19))","v":"1900-01-16"},{"$f":"IF($C$7=1,Calendar($C$5-1,12,20),Calendar($C$5,$C$7-1,20))","v":"1900-01-17"},{"$f":"IF($C$7=1,Calendar($C$5-1,12,21),Calendar($C$5,$C$7-1,21))","v":"1900-01-18"}]
[null,{"$f":"IF($C$7=1,Calendar($C$5-1,12,22),Calendar($C$5,$C$7-1,22))","v":"1900-01-19"},{"$f":"IF($C$7=1,Calendar($C$5-1,12,23),Calendar($C$5,$C$7-1,23))","v":"1900-01-20"},{"$f":"IF($C$7=1,Calendar($C$5-1,12,24),Calendar($C$5,$C$7-1,24))","v":"1900-01-21"},{"$f":"IF($C$7=1,Calendar($C$5-1,12,25),Calendar($C$5,$C$7-1,25))","v":"1900-01-22"},{"$f":"IF($C$7=1,Calendar($C$5-1,12,26),Calendar($C$5,$C$7-1,26))","v":"1900-01-23"},{"$f":"IF($C$7=1,Calendar($C$5-1,12,27),Calendar($C$5,$C$7-1,27))","v":"1900-01-24"},{"$f":"IF($C$7=1,Calendar($C$5-1,12,28),Calendar($C$5,$C$7-1,28))","v":"1900-01-25"}]
[null,{"$f":"IF($C$7=1,Calendar($C$5-1,12,29),Calendar($C$5,$C$7-1,29))","v":"1900-01-26"},{"$f":"IF($C$7=1,Calendar($C$5-1,12,30),Calendar($C$5,$C$7-1,30))","v":"1900-01-27"},{"$f":"IF($C$7=1,Calendar($C$5-1,12,31),Calendar($C$5,$C$7-1,31))","v":"1900-01-28"},{"$f":"IF($C$7=1,Calendar($C$5-1,12,32),Calendar($C$5,$C$7-1,32))","v":"1900-01-29"},{"$f":"IF($C$7=1,Calendar($C$5-1,12,33),Calendar($C$5,$C$7-1,33))","v":"1900-01-30"},{"$f":"IF($C$7=1,Calendar($C$5-1,12,34),Calendar($C$5,$C$7-1,34))","v":"1900-01-31"},{"$f":"IF($C$7=1,Calendar($C$5-1,12,35),Calendar($C$5,$C$7-1,35))","v":""}]
[null,{"$f":"IF($C$7=1,Calendar($C$5-1,12,36),Calendar($C$5,$C$7-1,36))","v":""},{"$f":"IF($C$7=1,Calendar($C$5-1,12,37),Calendar($C$5,$C$7-1,37))","v":""}]
[null,null,null,null,null,null,null,null,null,{"$f":"Calendar($C$5,$C$7,29)","v":"1900-01-23"},{"$f":"IFERROR(IF(AND(J25<>\"\",VLOOKUP(DATE($C$5,$C$7,J25),_공휴일날짜,3,FALSE)<>\"\"),VLOOKUP(DATE($C$5,$C$7,J25),_공휴일날짜,3,FALSE),\"\"),\"\")","v":""},null,null,{"$f":"Calendar($C$5,$C$7,30)","v":"1900-01-24"},{"$f":"IFERROR(IF(AND(N25<>\"\",VLOOKUP(DATE($C$5,$C$7,N25),_공휴일날짜,3,FALSE)<>\"\"),VLOOKUP(DATE($C$5,$C$7,N25),_공휴일날짜,3,FALSE),\"\"),\"\")","v":""},null,null,{"$f":"Calendar($C$5,$C$7,31)","v":"1900-01-25"},{"$f":"IFERROR(IF(AND(R25<>\"\",VLOOKUP(DATE($C$5,$C$7,R25),_공휴일날짜,3,FALSE)<>\"\"),VLOOKUP(DATE($C$5,$C$7,R25),_공휴일날짜,3,FALSE),\"\"),\"\")","v":""},null,null,{"$f":"Calendar($C$5,$C$7,32)","v":"1900-01-26"},{"$f":"IFERROR(IF(AND(V25<>\"\",VLOOKUP(DATE($C$5,$C$7,V25),_공휴일날짜,3,FALSE)<>\"\"),VLOOKUP(DATE($C$5,$C$7,V25),_공휴일날짜,3,FALSE),\"\"),\"\")","v":""},null,null,{"$f":"Calendar($C$5,$C$7,33)","v":"1900-01-27"},{"$f":"IFERROR(IF(AND(Z25<>\"\",VLOOKUP(DATE($C$5,$C$7,Z25),_공휴일날짜,3,FALSE)<>\"\"),VLOOKUP(DATE($C$5,$C$7,Z25),_공휴일날짜,3,FALSE),\"\"),\"\")","v":""},null,null,{"$f":"Calendar($C$5,$C$7,34)","v":"1900-01-28"},{"$f":"IFERROR(IF(AND(AD25<>\"\",VLOOKUP(DATE($C$5,$C$7,AD25),_공휴일날짜,3,FALSE)<>\"\"),VLOOKUP(DATE($C$5,$C$7,AD25),_공휴일날짜,3,FALSE),\"\"),\"\")","v":""},null,null,{"$f":"Calendar($C$5,$C$7,35)","v":""},{"$f":"IFERROR(IF(AND(AH25<>\"\",VLOOKUP(DATE($C$5,$C$7,AH25),_공휴일날짜,3,FALSE)<>\"\"),VLOOKUP(DATE($C$5,$C$7,AH25),_공휴일날짜,3,FALSE),\"\"),\"\")","v":""}]
[null,{"$f":"VLOOKUP($E$26,'달력 설정'!$B$6:$C$17,2,FALSE)","v":"March"},null,null,{"$f":"IF($C$7=12,1,$C$7+1)","v":3}]
[null,"일","월","화","수","목","금","토"]
[null,{"$f":"IF($C$7=12,Calendar($C$5+1,1,1),Calendar($C$5,$C$7+1,1))","v":""},{"$f":"IF($C$7=12,Calendar($C$5+1,1,2),Calendar($C$5,$C$7+1,2))","v":""},{"$f":"IF($C$7=12,Calendar($C$5+1,1,3),Calendar($C$5,$C$7+1,3))","v":""},{"$f":"IF($C$7=12,Calendar($C$5+1,1,4),Calendar($C$5,$C$7+1,4))","v":""},{"$f":"IF($C$7=12,Calendar($C$5+1,1,5),Calendar($C$5,$C$7+1,5))","v":""},{"$f":"IF($C$7=12,Calendar($C$5+1,1,6),Calendar($C$5,$C$7+1,6))","v":""},{"$f":"IF($C$7=12,Calendar($C$5+1,1,7),Calendar($C$5,$C$7+1,7))","v":"1900-01-01"}]
[null,{"$f":"IF($C$7=12,Calendar($C$5+1,1,8),Calendar($C$5,$C$7+1,8))","v":"1900-01-02"},{"$f":"IF($C$7=12,Calendar($C$5+1,1,9),Calendar($C$5,$C$7+1,9))","v":"1900-01-03"},{"$f":"IF($C$7=12,Calendar($C$5+1,1,10),Calendar($C$5,$C$7+1,10))","v":"1900-01-04"},{"$f":"IF($C$7=12,Calendar($C$5+1,1,11),Calendar($C$5,$C$7+1,11))","v":"1900-01-05"},{"$f":"IF($C$7=12,Calendar($C$5+1,1,12),Calendar($C$5,$C$7+1,12))","v":"1900-01-06"},{"$f":"IF($C$7=12,Calendar($C$5+1,1,13),Calendar($C$5,$C$7+1,13))","v":"1900-01-07"},{"$f":"IF($C$7=12,Calendar($C$5+1,1,14),Calendar($C$5,$C$7+1,14))","v":"1900-01-08"}]
[null,{"$f":"IF($C$7=12,Calendar($C$5+1,1,15),Calendar($C$5,$C$7+1,15))","v":"1900-01-09"},{"$f":"IF($C$7=12,Calendar($C$5+1,1,16),Calendar($C$5,$C$7+1,16))","v":"1900-01-10"},{"$f":"IF($C$7=12,Calendar($C$5+1,1,17),Calendar($C$5,$C$7+1,17))","v":"1900-01-11"},{"$f":"IF($C$7=12,Calendar($C$5+1,1,18),Calendar($C$5,$C$7+1,18))","v":"1900-01-12"},{"$f":"IF($C$7=12,Calendar($C$5+1,1,19),Calendar($C$5,$C$7+1,19))","v":"1900-01-13"},{"$f":"IF($C$7=12,Calendar($C$5+1,1,20),Calendar($C$5,$C$7+1,20))","v":"1900-01-14"},{"$f":"IF($C$7=12,Calendar($C$5+1,1,21),Calendar($C$5,$C$7+1,21))","v":"1900-01-15"},null,{"$f":"Calendar($C$5,$C$7,36)","v":""},{"$f":"IFERROR(IF(AND(J30<>\"\",VLOOKUP(DATE($C$5,$C$7,J30),_공휴일날짜,3,FALSE)<>\"\"),VLOOKUP(DATE($C$5,$C$7,J30),_공휴일날짜,3,FALSE),\"\"),\"\")","v":""},null,null,{"$f":"Calendar($C$5,$C$7,37)","v":""},{"$f":"IFERROR(IF(AND(N30<>\"\",VLOOKUP(DATE($C$5,$C$7,N30),_공휴일날짜,3,FALSE)<>\"\"),VLOOKUP(DATE($C$5,$C$7,N30),_공휴일날짜,3,FALSE),\"\"),\"\")","v":""}]
[null,{"$f":"IF($C$7=12,Calendar($C$5+1,1,22),Calendar($C$5,$C$7+1,22))","v":"1900-01-16"},{"$f":"IF($C$7=12,Calendar($C$5+1,1,23),Calendar($C$5,$C$7+1,23))","v":"1900-01-17"},{"$f":"IF($C$7=12,Calendar($C$5+1,1,24),Calendar($C$5,$C$7+1,24))","v":"1900-01-18"},{"$f":"IF($C$7=12,Calendar($C$5+1,1,25),Calendar($C$5,$C$7+1,25))","v":"1900-01-19"},{"$f":"IF($C$7=12,Calendar($C$5+1,1,26),Calendar($C$5,$C$7+1,26))","v":"1900-01-20"},{"$f":"IF($C$7=12,Calendar($C$5+1,1,27),Calendar($C$5,$C$7+1,27))","v":"1900-01-21"},{"$f":"IF($C$7=12,Calendar($C$5+1,1,28),Calendar($C$5,$C$7+1,28))","v":"1900-01-22"}]
[null,{"$f":"IF($C$7=12,Calendar($C$5+1,1,29),Calendar($C$5,$C$7+1,29))","v":"1900-01-23"},{"$f":"IF($C$7=12,Calendar($C$5+1,1,30),Calendar($C$5,$C$7+1,30))","v":"1900-01-24"},{"$f":"IF($C$7=12,Calendar($C$5+1,1,31),Calendar($C$5,$C$7+1,31))","v":"1900-01-25"},{"$f":"IF($C$7=12,Calendar($C$5+1,1,32),Calendar($C$5,$C$7+1,32))","v":"1900-01-26"},{"$f":"IF($C$7=12,Calendar($C$5+1,1,33),Calendar($C$5,$C$7+1,33))","v":"1900-01-27"},{"$f":"IF($C$7=12,Calendar($C$5+1,1,34),Calendar($C$5,$C$7+1,34))","v":"1900-01-28"},{"$f":"IF($C$7=12,Calendar($C$5+1,1,35),Calendar($C$5,$C$7+1,35))","v":"1900-01-29"}]
[null,{"$f":"IF($C$7=12,Calendar($C$5+1,1,36),Calendar($C$5,$C$7+1,36))","v":"1900-01-30"},{"$f":"IF($C$7=12,Calendar($C$5+1,1,37),Calendar($C$5,$C$7+1,37))","v":"1900-01-31"}]

{"sheet":"3월","index":2,"n_rows":33,"n_cols":39,"rows_kept":33,"cut":false,"hidden":false,"merged":[[2,29,3,32],[2,33,3,36],[4,2,5,6],[4,10,4,12],[4,14,4,16],[4,18,4,20],[4,22,4,24],[4,26,4,28],[4,30,4,32],[4,34,4,36],[0,1,2,7],[2,9,3,12],[2,13,3,16],[2,17,3,20],[2,21,3,24],[2,25,3,28],[5,33,5,36],[6,2,11,6],[6,9,6,12],[6,13,6,16],[6,17,6,20],[6,21,6,24],[6,25,6,28],[6,29,6,32],[6,33,6,36],[8,9,8,12],[5,9,5,12],[5,13,5,16],[5,17,5,20],[5,21,5,24],[5,25,5,28],[5,29,5,32],[6,38,6,43],[7,9,7,12],[7,13,7,16],[7,17,7,20],[7,21,7,24],[7,25,7,28],[7,29,7,32],[7,33,7,36],[7,39,7,43],[8,39,8,43],[9,10,9,12],[9,14,9,16],[9,18,9,20],[9,22,9,24],[9,26,9,28],[9,30,9,32],[9,34,9,36],[9,39,9,43],[8,13,8,16],[8,17,8,20],[8,21,8,24],[8,25,8,28],[8,29,8,32],[8,33,8,36],[12,2,13,6],[12,9,12,12],[12,13,12,16],[12,17,12,20],[12,21,12,24],[12,25,12,28],[10,33,10,36],[10,39,10,43],[11,9,11,12],[11,13,11,16],[11,17,11,20],[11,21,11,24],[11,25,11,28],[11,29,11,32],[11,33,11,36],[11,39,11,43],[10,9,10,12],[10,13,10,16],[10,17,10,20],[10,21,10,24],[10,25,10,28],[10,29,10,32],[13,39,13,43],[14,10,14,12],[14,14,14,16],[14,18,14,20],[14,22,14,24],[14,26,14,28],[14,30,14,32],[14,34,14,36],[12,29,12,32],[12,33,12,36],[12,39,12,43],[13,9,13,12],[13,13,13,16],[13,17,13,20],[13,21,13,24],[13,25,13,28],[13,29,13,32],[13,33,13,36],[15,33,15,36],[16,1,16,3],[16,9,16,12],[16,13,16,16],[16,17,16,20],[16,21,16,24],[16,25,16,28],[16,29,16,32],[16,33,16,36],[15,9,15,12],[15,13,15,16],[15,17,15,20],[15,21,15,24],[15,25,15,28],[15,29,15,32],[16,38,16,43],[17,9,17,12],[17,13,17,16],[17,17,17,20],[17,21,17,24],[17,25,17,28],[17,29,17,32],[17,33,17,36],[17,38,17,43],[18,33,18,36],[18,38,18,43],[19,10,19,12],[19,14,19,16],[19,18,19,20],[19,22,19,24],[19,26,19,28],[19,30,19,32],[19,34,19,36],[19,38,19,43],[18,9,18,12],[18,13,18,16],[18,17,18,20],[18,21,18,24],[18,25,18,28],[18,29,18,32],[20,33,20,36],[20,38,20,43],[21,9,21,12],[21,13,21,16],[21,17,21,20],[21,21,21,24],[21,25,21,28],[21,29,21,32],[21,33,21,36],[21,38,21,43],[20,9,20,12],[20,13,20,16],[20,17,20,20],[20,21,20,24],[20,25,20,28],[20,29,20,32],[22,33,22,36],[22,38,22,43],[23,9,23,12],[23,13,23,16],[23,17,23,20],[23,21,23,24],[23,25,23,28],[23,29,23,32],[23,33,23,36],[23,38,23,43],[22,9,22,12],[22,13,22,16],[22,17,22,20],[22,21,22,24],[22,25,22,28],[22,29,22,32],[24,34,24,36],[24,38,24,43],[25,1,25,3],[25,9,25,12],[25,13,25,16],[25,17,25,20],[25,21,25,24],[25,25,25,28],[25,29,25,32],[25,33,25,36],[24,10,24,12],[24,14,24,16],[24,18,24,20],[24,22,24,24],[24,26,24,28],[24,30,24,32],[25,38,25,43],[26,9,26,12],[26,13,26,16],[26,17,26,20],[26,21,26,24],[26,25,26,28],[26,29,26,32],[26,33,26,36],[26,38,26,43],[27,33,27,36],[27,38,27,43],[28,9,28,12],[28,13,28,16],[28,17,28,20],[28,21,28,24],[28,25,28,28],[28,29,28,32],[28,33,28,36],[28,38,28,43],[27,9,27,12],[27,13,27,16],[27,17,27,20],[27,21,27,24],[27,25,27,28],[27,29,27,32],[33,9,33,12],[33,13,33,16],[31,9,31,12],[31,13,31,16],[31,38,31,43],[32,9,32,12],[32,13,32,16],[32,38,32,43],[29,10,29,12],[29,14,29,16],[29,38,29,43],[30,9,30,12],[30,13,30,16],[30,38,30,43]]}
[]
[]
[null,null,null,null,null,null,null,null,null,"일 Sunday",null,null,null,"월 Monday",null,null,null,"화 Tuesday",null,null,null,"수 Wednesday",null,null,null,"목 Thursday",null,null,null,"금 Friday",null,null,null,"토 Saturday"]
[]
[null,null,{"$f":"'달력 설정'!$B$2","v":2025},null,null,null,null,null,null,{"$f":"Calendar($C$5,$C$7,1)","v":""},{"$f":"IFERROR(IF(AND(J5<>\"\",VLOOKUP(DATE($C$5,$C$7,J5),_공휴일날짜,3,FALSE)<>\"\"),VLOOKUP(DATE($C$5,$C$7,J5),_공휴일날짜,3,FALSE),\"\"),\"\")","v":""},null,null,{"$f":"Calendar($C$5,$C$7,2)","v":""},{"$f":"IFERROR(IF(AND(N5<>\"\",VLOOKUP(DATE($C$5,$C$7,N5),_공휴일날짜,3,FALSE)<>\"\"),VLOOKUP(DATE($C$5,$C$7,N5),_공휴일날짜,3,FALSE),\"\"),\"\")","v":""},null,null,{"$f":"Calendar($C$5,$C$7,3)","v":""},{"$f":"IFERROR(IF(AND(R5<>\"\",VLOOKUP(DATE($C$5,$C$7,R5),_공휴일날짜,3,FALSE)<>\"\"),VLOOKUP(DATE($C$5,$C$7,R5),_공휴일날짜,3,FALSE),\"\"),\"\")","v":""},null,null,{"$f":"Calendar($C$5,$C$7,4)","v":""},{"$f":"IFERROR(IF(AND(V5<>\"\",VLOOKUP(DATE($C$5,$C$7,V5),_공휴일날짜,3,FALSE)<>\"\"),VLOOKUP(DATE($C$5,$C$7,V5),_공휴일날짜,3,FALSE),\"\"),\"\")","v":""},null,null,{"$f":"Calendar($C$5,$C$7,5)","v":""},{"$f":"IFERROR(IF(AND(Z5<>\"\",VLOOKUP(DATE($C$5,$C$7,Z5),_공휴일날짜,3,FALSE)<>\"\"),VLOOKUP(DATE($C$5,$C$7,Z5),_공휴일날짜,3,FALSE),\"\"),\"\")","v":""},null,null,{"$f":"Calendar($C$5,$C$7,6)","v":""},{"$f":"IFERROR(IF(AND(AD5<>\"\",VLOOKUP(DATE($C$5,$C$7,AD5),_공휴일날짜,3,FALSE)<>\"\"),VLOOKUP(DATE($C$5,$C$7,AD5),_공휴일날짜,3,FALSE),\"\"),\"\")","v":""},null,null,{"$f":"Calendar($C$5,$C$7,7)","v":"1900-01-01"},{"$f":"IFERROR(IF(AND(AH5<>\"\",VLOOKUP(DATE($C$5,$C$7,AH5),_공휴일날짜,3,FALSE)<>\"\"),VLOOKUP(DATE($C$5,$C$7,AH5),_공휴일날짜,3,FALSE),\"\"),\"\")","v":"삼일절"}]
[]
[null,1,3,null,null,null,null,null,null,null,null,null,null,null,null,null,null,null,null,null,null,null,null,null,null,null,null,null,null,null,null,null,null,null,null,null,null,null,"Do It List"]
[null,null,null,null,null,null,null,null,null,null,null,null,null,null,null,null,null,null,null,null,null,null,null,null,null,null,null,null,null,null,null,null,null,null,null,null,null,null,false]
[null,null,null,null,null,null,null,null,null,null,null,null,null,null,null,null,null,null,null,null,null,null,null,null,null,null,null,null,null,null,null,null,null,null,null,null,null,null,false]
[null,null,null,null,null,null,null,null,null,{"$f":"Calendar($C$5,$C$7,8)","v":"1900-01-02"},{"$f":"IFERROR(IF(AND(J10<>\"\",VLOOKUP(DATE($C$5,$C$7,J10),_공휴일날짜,3,FALSE)<>\"\"),VLOOKUP(DATE($C$5,$C$7,J10),_공휴일날짜,3,FALSE),\"\"),\"\")","v":""},null,null,{"$f":"Calendar($C$5,$C$7,9)","v":"1900-01-03"},{"$f":"IFERROR(IF(AND(N10<>\"\",VLOOKUP(DATE($C$5,$C$7,N10),_공휴일날짜,3,FALSE)<>\"\"),VLOOKUP(DATE($C$5,$C$7,N10),_공휴일날짜,3,FALSE),\"\"),\"\")","v":"대체 휴일"},null,null,{"$f":"Calendar($C$5,$C$7,10)","v":"1900-01-04"},{"$f":"IFERROR(IF(AND(R10<>\"\",VLOOKUP(DATE($C$5,$C$7,R10),_공휴일날짜,3,FALSE)<>\"\"),VLOOKUP(DATE($C$5,$C$7,R10),_공휴일날짜,3,FALSE),\"\"),\"\")","v":""},null,null,{"$f":"Calendar($C$5,$C$7,11)","v":"1900-01-05"},{"$f":"IFERROR(IF(AND(V10<>\"\",VLOOKUP(DATE($C$5,$C$7,V10),_공휴일날짜,3,FALSE)<>\"\"),VLOOKUP(DATE($C$5,$C$7,V10),_공휴일날짜,3,FALSE),\"\"),\"\")","v":""},null,null,{"$f":"Calendar($C$5,$C$7,12)","v":"1900-01-06"},{"$f":"IFERROR(IF(AND(Z10<>\"\",VLOOKUP(DATE($C$5,$C$7,Z10),_공휴일날짜,3,FALSE)<>\"\"),VLOOKUP(DATE($C$5,$C$7,Z10),_공휴일날짜,3,FALSE),\"\"),\"\")","v":""},null,null,{"$f":"Calendar($C$5,$C$7,13)","v":"1900-01-07"},{"$f":"IFERROR(IF(AND(AD10<>\"\",VLOOKUP(DATE($C$5,$C$7,AD10),_공휴일날짜,3,FALSE)<>\"\"),VLOOKUP(DATE($C$5,$C$7,AD10),_공휴일날짜,3,FALSE),\"\"),\"\")","v":""},null,null,{"$f":"Calendar($C$5,$C$7,14)","v":"1900-01-08"},{"$f":"IFERROR(IF(AND(AH10<>\"\",VLOOKUP(DATE($C$5,$C$7,AH10),_공휴일날짜,3,FALSE)<>\"\"),VLOOKUP(DATE($C$5,$C$7,AH10),_공휴일날짜,3,FALSE),\"\"),\"\")","v":""},null,null,null,false]
[null,null,null,null,null,null,null,null,null,null,null,null,null,null,null,null,null,null,null,null,null,null,null,null,null,null,null,null,null,null,null,null,null,null,null,null,null,null,false]
[null,null,null,null,null,null,null,null,null,null,null,null,null,null,null,null,null,null,null,null,null,null,null,null,null,null,null,null,null,null,null,null,null,null,null,null,null,null,false]
[null,null,{"$f":"VLOOKUP($C$7,'달력 설정'!$B$6:$C$17,2,FALSE)","v":"March"},null,null,null,null,null,null,null,null,null,null,null,null,null,null,null,null,null,null,null,null,null,null,null,null,null,null,null,null,null,null,null,null,null,null,null,false]
[null,null,null,null,null,null,null,null,null,null,null,null,null,null,null,null,null,null,null,null,null,null,null,null,null,null,null,null,null,null,null,null,null,null,null,null,null,null,false]
[null,null,null,null,null,null,null,null,null,{"$f":"Calendar($C$5,$C$7,15)","v":"1900-01-09"},{"$f":"IFERROR(IF(AND(J15<>\"\",VLOOKUP(DATE($C$5,$C$7,J15),_공휴일날짜,3,FALSE)<>\"\"),VLOOKUP(DATE($C$5,$C$7,J15),_공휴일날짜,3,FALSE),\"\"),\"\")","v":""},null,null,{"$f":"Calendar($C$5,$C$7,16)","v":"1900-01-10"},{"$f":"IFERROR(IF(AND(N15<>\"\",VLOOKUP(DATE($C$5,$C$7,N15),_공휴일날짜,3,FALSE)<>\"\"),VLOOKUP(DATE($C$5,$C$7,N15),_공휴일날짜,3,FALSE),\"\"),\"\")","v":""},null,null,{"$f":"Calendar($C$5,$C$7,17)","v":"1900-01-11"},{"$f":"IFERROR(IF(AND(R15<>\"\",VLOOKUP(DATE($C$5,$C$7,R15),_공휴일날짜,3,FALSE)<>\"\"),VLOOKUP(DATE($C$5,$C$7,R15),_공휴일날짜,3,FALSE),\"\"),\"\")","v":""},null,null,{"$f":"Calendar($C$5,$C$7,18)","v":"1900-01-12"},{"$f":"IFERROR(IF(AND(V15<>\"\",VLOOKUP(DATE($C$5,$C$7,V15),_공휴일날짜,3,FALSE)<>\"\"),VLOOKUP(DATE($C$5,$C$7,V15),_공휴일날짜,3,FALSE),\"\"),\"\")","v":""},null,null,{"$f":"Calendar($C$5,$C$7,19)","v":"1900-01-13"},{"$f":"IFERROR(IF(AND(Z15<>\"\",VLOOKUP(DATE($C$5,$C$7,Z15),_공휴일날짜,3,FALSE)<>\"\"),VLOOKUP(DATE($C$5,$C$7,Z15),_공휴일날짜,3,FALSE),\"\"),\"\")","v":""},null,null,{"$f":"Calendar($C$5,$C$7,20)","v":"1900-01-14"},{"$f":"IFERROR(IF(AND(AD15<>\"\",VLOOKUP(DATE($C$5,$C$7,AD15),_공휴일날짜,3,FALSE)<>\"\"),VLOOKUP(DATE($C$5,$C$7,AD15),_공휴일날짜,3,FALSE),\"\"),\"\")","v":""},null,null,{"$f":"Calendar($C$5,$C$7,21)","v":"1900-01-15"},{"$f":"IFERROR(IF(AND(AH15<>\"\",VLOOKUP(DATE($C$5,$C$7,AH15),_공휴일날짜,3,FALSE)<>\"\"),VLOOKUP(DATE($C$5,$C$7,AH15),_공휴일날짜,3,FALSE),\"\"),\"\")","v":""}]
[]
[null,{"$f":"VLOOKUP($E$17,'달력 설정'!$B$6:$C$17,2,FALSE)","v":"February"},null,null,{"$f":"IF($C$7=1,12,$C$7-1)","v":2},null,null,null,null,null,null,null,null,null,null,null,null,null,null,null,null,null,null,null,null,null,null,null,null,null,null,null,null,null,null,null,null,null,"MEMO"]
[null,"일","월","화","수","목","금","토"]
[null,{"$f":"IF($C$7=1,Calendar($C$5-1,12,1),Calendar($C$5,$C$7-1,1))","v":""},{"$f":"IF($C$7=1,Calendar($C$5-1,12,2),Calendar($C$5,$C$7-1,2))","v":""},{"$f":"IF($C$7=1,Calendar($C$5-1,12,3),Calendar($C$5,$C$7-1,3))","v":""},{"$f":"IF($C$7=1,Calendar($C$5-1,12,4),Calendar($C$5,$C$7-1,4))","v":""},{"$f":"IF($C$7=1,Calendar($C$5-1,12,5),Calendar($C$5,$C$7-1,5))","v":""},{"$f":"IF($C$7=1,Calendar($C$5-1,12,6),Calendar($C$5,$C$7-1,6))","v":""},{"$f":"IF($C$7=1,Calendar($C$5-1,12,7),Calendar($C$5,$C$7-1,7))","v":"1900-01-01"}]
[null,{"$f":"IF($C$7=1,Calendar($C$5-1,12,8),Calendar($C$5,$C$7-1,8))","v":"1900-01-02"},{"$f":"IF($C$7=1,Calendar($C$5-1,12,9),Calendar($C$5,$C$7-1,9))","v":"1900-01-03"},{"$f":"IF($C$7=1,Calendar($C$5-1,12,10),Calendar($C$5,$C$7-1,10))","v":"1900-01-04"},{"$f":"IF($C$7=1,Calendar($C$5-1,12,11),Calendar($C$5,$C$7-1,11))","v":"1900-01-05"},{"$f":"IF($C$7=1,Calendar($C$5-1,12,12),Calendar($C$5,$C$7-1,12))","v":"1900-01-06"},{"$f":"IF($C$7=1,Calendar($C$5-1,12,13),Calendar($C$5,$C$7-1,13))","v":"1900-01-07"},{"$f":"IF($C$7=1,Calendar($C$5-1,12,14),Calendar($C$5,$C$7-1,14))","v":"1900-01-08"},null,{"$f":"Calendar($C$5,$C$7,22)","v":"1900-01-16"},{"$f":"IFERROR(IF(AND(J20<>\"\",VLOOKUP(DATE($C$5,$C$7,J20),_공휴일날짜,3,FALSE)<>\"\"),VLOOKUP(DATE($C$5,$C$7,J20),_공휴일날짜,3,FALSE),\"\"),\"\")","v":""},null,null,{"$f":"Calendar($C$5,$C$7,23)","v":"1900-01-17"},{"$f":"IFERROR(IF(AND(N20<>\"\",VLOOKUP(DATE($C$5,$C$7,N20),_공휴일날짜,3,FALSE)<>\"\"),VLOOKUP(DATE($C$5,$C$7,N20),_공휴일날짜,3,FALSE),\"\"),\"\")","v":""},null,null,{"$f":"Calendar($C$5,$C$7,24)","v":"1900-01-18"},{"$f":"IFERROR(IF(AND(R20<>\"\",VLOOKUP(DATE($C$5,$C$7,R20),_공휴일날짜,3,FALSE)<>\"\"),VLOOKUP(DATE($C$5,$C$7,R20),_공휴일날짜,3,FALSE),\"\"),\"\")","v":""},null,null,{"$f":"Calendar($C$5,$C$7,25)","v":"1900-01-19"},{"$f":"IFERROR(IF(AND(V20<>\"\",VLOOKUP(DATE($C$5,$C$7,V20),_공휴일날짜,3,FALSE)<>\"\"),VLOOKUP(DATE($C$5,$C$7,V20),_공휴일날짜,3,FALSE),\"\"),\"\")","v":""},null,null,{"$f":"Calendar($C$5,$C$7,26)","v":"1900-01-20"},{"$f":"IFERROR(IF(AND(Z20<>\"\",VLOOKUP(DATE($C$5,$C$7,Z20),_공휴일날짜,3,FALSE)<>\"\"),VLOOKUP(DATE($C$5,$C$7,Z20),_공휴일날짜,3,FALSE),\"\"),\"\")","v":""},null,null,{"$f":"Calendar($C$5,$C$7,27)","v":"1900-01-21"},{"$f":"IFERROR(IF(AND(AD20<>\"\",VLOOKUP(DATE($C$5,$C$7,AD20),_공휴일날짜,3,FALSE)<>\"\"),VLOOKUP(DATE($C$5,$C$7,AD20),_공휴일날짜,3,FALSE),\"\"),\"\")","v":""},null,null,{"$f":"Calendar($C$5,$C$7,28)","v":"1900-01-22"},{"$f":"IFERROR(IF(AND(AH20<>\"\",VLOOKUP(DATE($C$5,$C$7,AH20),_공휴일날짜,3,FALSE)<>\"\"),VLOOKUP(DATE($C$5,$C$7,AH20),_공휴일날짜,3,FALSE),\"\"),\"\")","v":""}]
[null,{"$f":"IF($C$7=1,Calendar($C$5-1,12,15),Calendar($C$5,$C$7-1,15))","v":"1900-01-09"},{"$f":"IF($C$7=1,Calendar($C$5-1,12,16),Calendar($C$5,$C$7-1,16))","v":"1900-01-10"},{"$f":"IF($C$7=1,Calendar($C$5-1,12,17),Calendar($C$5,$C$7-1,17))","v":"1900-01-11"},{"$f":"IF($C$7=1,Calendar($C$5-1,12,18),Calendar($C$5,$C$7-1,18))","v":"1900-01-12"},{"$f":"IF($C$7=1,Calendar($C$5-1,12,19),Calendar($C$5,$C$7-1,19))","v":"1900-01-13"},{"$f":"IF($C$7=1,Calendar($C$5-1,12,20),Calendar($C$5,$C$7-1,20))","v":"1900-01-14"},{"$f":"IF($C$7=1,Calendar($C$5-1,12,21),Calendar($C$5,$C$7-1,21))","v":"1900-01-15"}]
[null,{"$f":"IF($C$7=1,Calendar($C$5-1,12,22),Calendar($C$5,$C$7-1,22))","v":"1900-01-16"},{"$f":"IF($C$7=1,Calendar($C$5-1,12,23),Calendar($C$5,$C$7-1,23))","v":"1900-01-17"},{"$f":"IF($C$7=1,Calendar($C$5-1,12,24),Calendar($C$5,$C$7-1,24))","v":"1900-01-18"},{"$f":"IF($C$7=1,Calendar($C$5-1,12,25),Calendar($C$5,$C$7-1,25))","v":"1900-01-19"},{"$f":"IF($C$7=1,Calendar($C$5-1,12,26),Calendar($C$5,$C$7-1,26))","v":"1900-01-20"},{"$f":"IF($C$7=1,Calendar($C$5-1,12,27),Calendar($C$5,$C$7-1,27))","v":"1900-01-21"},{"$f":"IF($C$7=1,Calendar($C$5-1,12,28),Calendar($C$5,$C$7-1,28))","v":"1900-01-22"}]
[null,{"$f":"IF($C$7=1,Calendar($C$5-1,12,29),Calendar($C$5,$C$7-1,29))","v":"1900-01-23"},{"$f":"IF($C$7=1,Calendar($C$5-1,12,30),Calendar($C$5,$C$7-1,30))","v":"1900-01-24"},{"$f":"IF($C$7=1,Calendar($C$5-1,12,31),Calendar($C$5,$C$7-1,31))","v":"1900-01-25"},{"$f":"IF($C$7=1,Calendar($C$5-1,12,32),Calendar($C$5,$C$7-1,32))","v":"1900-01-26"},{"$f":"IF($C$7=1,Calendar($C$5-1,12,33),Calendar($C$5,$C$7-1,33))","v":"1900-01-27"},{"$f":"IF($C$7=1,Calendar($C$5-1,12,34),Calendar($C$5,$C$7-1,34))","v":"1900-01-28"},{"$f":"IF($C$7=1,Calendar($C$5-1,12,35),Calendar($C$5,$C$7-1,35))","v":""}]
[null,{"$f":"IF($C$7=1,Calendar($C$5-1,12,36),Calendar($C$5,$C$7-1,36))","v":""},{"$f":"IF($C$7=1,Calendar($C$5-1,12,37),Calendar($C$5,$C$7-1,37))","v":""}]
[null,null,null,null,null,null,null,null,null,{"$f":"Calendar($C$5,$C$7,29)","v":"1900-01-23"},{"$f":"IFERROR(IF(AND(J25<>\"\",VLOOKUP(DATE($C$5,$C$7,J25),_공휴일날짜,3,FALSE)<>\"\"),VLOOKUP(DATE($C$5,$C$7,J25),_공휴일날짜,3,FALSE),\"\"),\"\")","v":""},null,null,{"$f":"Calendar($C$5,$C$7,30)","v":"1900-01-24"},{"$f":"IFERROR(IF(AND(N25<>\"\",VLOOKUP(DATE($C$5,$C$7,N25),_공휴일날짜,3,FALSE)<>\"\"),VLOOKUP(DATE($C$5,$C$7,N25),_공휴일날짜,3,FALSE),\"\"),\"\")","v":""},null,null,{"$f":"Calendar($C$5,$C$7,31)","v":"1900-01-25"},{"$f":"IFERROR(IF(AND(R25<>\"\",VLOOKUP(DATE($C$5,$C$7,R25),_공휴일날짜,3,FALSE)<>\"\"),VLOOKUP(DATE($C$5,$C$7,R25),_공휴일날짜,3,FALSE),\"\"),\"\")","v":""},null,null,{"$f":"Calendar($C$5,$C$7,32)","v":"1900-01-26"},{"$f":"IFERROR(IF(AND(V25<>\"\",VLOOKUP(DATE($C$5,$C$7,V25),_공휴일날짜,3,FALSE)<>\"\"),VLOOKUP(DATE($C$5,$C$7,V25),_공휴일날짜,3,FALSE),\"\"),\"\")","v":""},null,null,{"$f":"Calendar($C$5,$C$7,33)","v":"1900-01-27"},{"$f":"IFERROR(IF(AND(Z25<>\"\",VLOOKUP(DATE($C$5,$C$7,Z25),_공휴일날짜,3,FALSE)<>\"\"),VLOOKUP(DATE($C$5,$C$7,Z25),_공휴일날짜,3,FALSE),\"\"),\"\")","v":""},null,null,{"$f":"Calendar($C$5,$C$7,34)","v":"1900-01-28"},{"$f":"IFERROR(IF(AND(AD25<>\"\",VLOOKUP(DATE($C$5,$C$7,AD25),_공휴일날짜,3,FALSE)<>\"\"),VLOOKUP(DATE($C$5,$C$7,AD25),_공휴일날짜,3,FALSE),\"\"),\"\")","v":""},null,null,{"$f":"Calendar($C$5,$C$7,35)","v":"1900-01-29"},{"$f":"IFERROR(IF(AND(AH25<>\"\",VLOOKUP(DATE($C$5,$C$7,AH25),_공휴일날짜,3,FALSE)<>\"\"),VLOOKUP(DATE($C$5,$C$7,AH25),_공휴일날짜,3,FALSE),\"\"),\"\")","v":""}]
[null,{"$f":"VLOOKUP($E$26,'달력 설정'!$B$6:$C$17,2,FALSE)","v":"April"},null,null,{"$f":"IF($C$7=12,1,$C$7+1)","v":4}]
[null,"일","월","화","수","목","금","토"]
[null,{"$f":"IF($C$7=12,Calendar($C$5+1,1,1),Calendar($C$5,$C$7+1,1))","v":""},{"$f":"IF($C$7=12,Calendar($C$5+1,1,2),Calendar($C$5,$C$7+1,2))","v":""},{"$f":"IF($C$7=12,Calendar($C$5+1,1,3),Calendar($C$5,$C$7+1,3))","v":"1900-01-01"},{"$f":"IF($C$7=12,Calendar($C$5+1,1,4),Calendar($C$5,$C$7+1,4))","v":"1900-01-02"},{"$f":"IF($C$7=12,Calendar($C$5+1,1,5),Calendar($C$5,$C$7+1,5))","v":"1900-01-03"},{"$f":"IF($C$7=12,Calendar($C$5+1,1,6),Calendar($C$5,$C$7+1,6))","v":"1900-01-04"},{"$f":"IF($C$7=12,Calendar($C$5+1,1,7),Calendar($C$5,$C$7+1,7))","v":"1900-01-05"}]
[null,{"$f":"IF($C$7=12,Calendar($C$5+1,1,8),Calendar($C$5,$C$7+1,8))","v":"1900-01-06"},{"$f":"IF($C$7=12,Calendar($C$5+1,1,9),Calendar($C$5,$C$7+1,9))","v":"1900-01-07"},{"$f":"IF($C$7=12,Calendar($C$5+1,1,10),Calendar($C$5,$C$7+1,10))","v":"1900-01-08"},{"$f":"IF($C$7=12,Calendar($C$5+1,1,11),Calendar($C$5,$C$7+1,11))","v":"1900-01-09"},{"$f":"IF($C$7=12,Calendar($C$5+1,1,12),Calendar($C$5,$C$7+1,12))","v":"1900-01-10"},{"$f":"IF($C$7=12,Calendar($C$5+1,1,13),Calendar($C$5,$C$7+1,13))","v":"1900-01-11"},{"$f":"IF($C$7=12,Calendar($C$5+1,1,14),Calendar($C$5,$C$7+1,14))","v":"1900-01-12"}]
[null,{"$f":"IF($C$7=12,Calendar($C$5+1,1,15),Calendar($C$5,$C$7+1,15))","v":"1900-01-13"},{"$f":"IF($C$7=12,Calendar($C$5+1,1,16),Calendar($C$5,$C$7+1,16))","v":"1900-01-14"},{"$f":"IF($C$7=12,Calendar($C$5+1,1,17),Calendar($C$5,$C$7+1,17))","v":"1900-01-15"},{"$f":"IF($C$7=12,Calendar($C$5+1,1,18),Calendar($C$5,$C$7+1,18))","v":"1900-01-16"},{"$f":"IF($C$7=12,Calendar($C$5+1,1,19),Calendar($C$5,$C$7+1,19))","v":"1900-01-17"},{"$f":"IF($C$7=12,Calendar($C$5+1,1,20),Calendar($C$5,$C$7+1,20))","v":"1900-01-18"},{"$f":"IF($C$7=12,Calendar($C$5+1,1,21),Calendar($C$5,$C$7+1,21))","v":"1900-01-19"},null,{"$f":"Calendar($C$5,$C$7,36)","v":"1900-01-30"},{"$f":"IFERROR(IF(AND(J30<>\"\",VLOOKUP(DATE($C$5,$C$7,J30),_공휴일날짜,3,FALSE)<>\"\"),VLOOKUP(DATE($C$5,$C$7,J30),_공휴일날짜,3,FALSE),\"\"),\"\")","v":""},null,null,{"$f":"Calendar($C$5,$C$7,37)","v":"1900-01-31"},{"$f":"IFERROR(IF(AND(N30<>\"\",VLOOKUP(DATE($C$5,$C$7,N30),_공휴일날짜,3,FALSE)<>\"\"),VLOOKUP(DATE($C$5,$C$7,N30),_공휴일날짜,3,FALSE),\"\"),\"\")","v":""}]
[null,{"$f":"IF($C$7=12,Calendar($C$5+1,1,22),Calendar($C$5,$C$7+1,22))","v":"1900-01-20"},{"$f":"IF($C$7=12,Calendar($C$5+1,1,23),Calendar($C$5,$C$7+1,23))","v":"1900-01-21"},{"$f":"IF($C$7=12,Calendar($C$5+1,1,24),Calendar($C$5,$C$7+1,24))","v":"1900-01-22"},{"$f":"IF($C$7=12,Calendar($C$5+1,1,25),Calendar($C$5,$C$7+1,25))","v":"1900-01-23"},{"$f":"IF($C$7=12,Calendar($C$5+1,1,26),Calendar($C$5,$C$7+1,26))","v":"1900-01-24"},{"$f":"IF($C$7=12,Calendar($C$5+1,1,27),Calendar($C$5,$C$7+1,27))","v":"1900-01-25"},{"$f":"IF($C$7=12,Calendar($C$5+1,1,28),Calendar($C$5,$C$7+1,28))","v":"1900-01-26"}]
[null,{"$f":"IF($C$7=12,Calendar($C$5+1,1,29),Calendar($C$5,$C$7+1,29))","v":"1900-01-27"},{"$f":"IF($C$7=12,Calendar($C$5+1,1,30),Calendar($C$5,$C$7+1,30))","v":"1900-01-28"},{"$f":"IF($C$7=12,Calendar($C$5+1,1,31),Calendar($C$5,$C$7+1,31))","v":"1900-01-29"},{"$f":"IF($C$7=12,Calendar($C$5+1,1,32),Calendar($C$5,$C$7+1,32))","v":"1900-01-30"},{"$f":"IF($C$7=12,Calendar($C$5+1,1,33),Calendar($C$5,$C$7+1,33))","v":""},{"$f":"IF($C$7=12,Calendar($C$5+1,1,34),Calendar($C$5,$C$7+1,34))","v":""},{"$f":"IF($C$7=12,Calendar($C$5+1,1,35),Calendar($C$5,$C$7+1,35))","v":""}]
[null,{"$f":"IF($C$7=12,Calendar($C$5+1,1,36),Calendar($C$5,$C$7+1,36))","v":""},{"$f":"IF($C$7=12,Calendar($C$5+1,1,37),Calendar($C$5,$C$7+1,37))","v":""}]

{"sheet":"4월","index":3,"n_rows":33,"n_cols":39,"rows_kept":33,"cut":false,"hidden":false,"merged":[[2,29,3,32],[2,33,3,36],[4,2,5,6],[4,10,4,12],[4,14,4,16],[4,18,4,20],[4,22,4,24],[4,26,4,28],[4,30,4,32],[4,34,4,36],[0,1,2,7],[2,9,3,12],[2,13,3,16],[2,17,3,20],[2,21,3,24],[2,25,3,28],[5,33,5,36],[6,2,11,6],[6,9,6,12],[6,13,6,16],[6,17,6,20],[6,21,6,24],[6,25,6,28],[6,29,6,32],[6,33,6,36],[8,9,8,12],[5,9,5,12],[5,13,5,16],[5,17,5,20],[5,21,5,24],[5,25,5,28],[5,29,5,32],[6,38,6,43],[7,9,7,12],[7,13,7,16],[7,17,7,20],[7,21,7,24],[7,25,7,28],[7,29,7,32],[7,33,7,36],[7,39,7,43],[8,39,8,43],[9,10,9,12],[9,14,9,16],[9,18,9,20],[9,22,9,24],[9,26,9,28],[9,30,9,32],[9,34,9,36],[9,39,9,43],[8,13,8,16],[8,17,8,20],[8,21,8,24],[8,25,8,28],[8,29,8,32],[8,33,8,36],[12,2,13,6],[12,9,12,12],[12,13,12,16],[12,17,12,20],[12,21,12,24],[12,25,12,28],[10,33,10,36],[10,39,10,43],[11,9,11,12],[11,13,11,16],[11,17,11,20],[11,21,11,24],[11,25,11,28],[11,29,11,32],[11,33,11,36],[11,39,11,43],[10,9,10,12],[10,13,10,16],[10,17,10,20],[10,21,10,24],[10,25,10,28],[10,29,10,32],[13,39,13,43],[14,10,14,12],[14,14,14,16],[14,18,14,20],[14,22,14,24],[14,26,14,28],[14,30,14,32],[14,34,14,36],[12,29,12,32],[12,33,12,36],[12,39,12,43],[13,9,13,12],[13,13,13,16],[13,17,13,20],[13,21,13,24],[13,25,13,28],[13,29,13,32],[13,33,13,36],[15,33,15,36],[16,1,16,3],[16,9,16,12],[16,13,16,16],[16,17,16,20],[16,21,16,24],[16,25,16,28],[16,29,16,32],[16,33,16,36],[15,9,15,12],[15,13,15,16],[15,17,15,20],[15,21,15,24],[15,25,15,28],[15,29,15,32],[16,38,16,43],[17,9,17,12],[17,13,17,16],[17,17,17,20],[17,21,17,24],[17,25,17,28],[17,29,17,32],[17,33,17,36],[17,38,17,43],[18,33,18,36],[18,38,18,43],[19,10,19,12],[19,14,19,16],[19,18,19,20],[19,22,19,24],[19,26,19,28],[19,30,19,32],[19,34,19,36],[19,38,19,43],[18,9,18,12],[18,13,18,16],[18,17,18,20],[18,21,18,24],[18,25,18,28],[18,29,18,32],[20,33,20,36],[20,38,20,43],[21,9,21,12],[21,13,21,16],[21,17,21,20],[21,21,21,24],[21,25,21,28],[21,29,21,32],[21,33,21,36],[21,38,21,43],[20,9,20,12],[20,13,20,16],[20,17,20,20],[20,21,20,24],[20,25,20,28],[20,29,20,32],[22,33,22,36],[22,38,22,43],[23,9,23,12],[23,13,23,16],[23,17,23,20],[23,21,23,24],[23,25,23,28],[23,29,23,32],[23,33,23,36],[23,38,23,43],[22,9,22,12],[22,13,22,16],[22,17,22,20],[22,21,22,24],[22,25,22,28],[22,29,22,32],[24,34,24,36],[24,38,24,43],[25,1,25,3],[25,9,25,12],[25,13,25,16],[25,17,25,20],[25,21,25,24],[25,25,25,28],[25,29,25,32],[25,33,25,36],[24,10,24,12],[24,14,24,16],[24,18,24,20],[24,22,24,24],[24,26,24,28],[24,30,24,32],[25,38,25,43],[26,9,26,12],[26,13,26,16],[26,17,26,20],[26,21,26,24],[26,25,26,28],[26,29,26,32],[26,33,26,36],[26,38,26,43],[27,33,27,36],[27,38,27,43],[28,9,28,12],[28,13,28,16],[28,17,28,20],[28,21,28,24],[28,25,28,28],[28,29,28,32],[28,33,28,36],[28,38,28,43],[27,9,27,12],[27,13,27,16],[27,17,27,20],[27,21,27,24],[27,25,27,28],[27,29,27,32],[33,9,33,12],[33,13,33,16],[31,9,31,12],[31,13,31,16],[31,38,31,43],[32,9,32,12],[32,13,32,16],[32,38,32,43],[29,10,29,12],[29,14,29,16],[29,38,29,43],[30,9,30,12],[30,13,30,16],[30,38,30,43]]}
[]
[]
[null,null,null,null,null,null,null,null,null,"일 Sunday",null,null,null,"월 Monday",null,null,null,"화 Tuesday",null,null,null,"수 Wednesday",null,null,null,"목 Thursday",null,null,null,"금 Friday",null,null,null,"토 Saturday"]
[]
[null,null,{"$f":"'달력 설정'!$B$2","v":2025},null,null,null,null,null,null,{"$f":"Calendar($C$5,$C$7,1)","v":""},{"$f":"IFERROR(IF(AND(J5<>\"\",VLOOKUP(DATE($C$5,$C$7,J5),_공휴일날짜,3,FALSE)<>\"\"),VLOOKUP(DATE($C$5,$C$7,J5),_공휴일날짜,3,FALSE),\"\"),\"\")","v":""},null,null,{"$f":"Calendar($C$5,$C$7,2)","v":""},{"$f":"IFERROR(IF(AND(N5<>\"\",VLOOKUP(DATE($C$5,$C$7,N5),_공휴일날짜,3,FALSE)<>\"\"),VLOOKUP(DATE($C$5,$C$7,N5),_공휴일날짜,3,FALSE),\"\"),\"\")","v":""},null,null,{"$f":"Calendar($C$5,$C$7,3)","v":"1900-01-01"},{"$f":"IFERROR(IF(AND(R5<>\"\",VLOOKUP(DATE($C$5,$C$7,R5),_공휴일날짜,3,FALSE)<>\"\"),VLOOKUP(DATE($C$5,$C$7,R5),_공휴일날짜,3,FALSE),\"\"),\"\")","v":""},null,null,{"$f":"Calendar($C$5,$C$7,4)","v":"1900-01-02"},{"$f":"IFERROR(IF(AND(V5<>\"\",VLOOKUP(DATE($C$5,$C$7,V5),_공휴일날짜,3,FALSE)<>\"\"),VLOOKUP(DATE($C$5,$C$7,V5),_공휴일날짜,3,FALSE),\"\"),\"\")","v":""},null,null,{"$f":"Calendar($C$5,$C$7,5)","v":"1900-01-03"},{"$f":"IFERROR(IF(AND(Z5<>\"\",VLOOKUP(DATE($C$5,$C$7,Z5),_공휴일날짜,3,FALSE)<>\"\"),VLOOKUP(DATE($C$5,$C$7,Z5),_공휴일날짜,3,FALSE),\"\"),\"\")","v":""},null,null,{"$f":"Calendar($C$5,$C$7,6)","v":"1900-01-04"},{"$f":"IFERROR(IF(AND(AD5<>\"\",VLOOKUP(DATE($C$5,$C$7,AD5),_공휴일날짜,3,FALSE)<>\"\"),VLOOKUP(DATE($C$5,$C$7,AD5),_공휴일날짜,3,FALSE),\"\"),\"\")","v":""},null,null,{"$f":"Calendar($C$5,$C$7,7)","v":"1900-01-05"},{"$f":"IFERROR(IF(AND(AH5<>\"\",VLOOKUP(DATE($C$5,$C$7,AH5),_공휴일날짜,3,FALSE)<>\"\"),VLOOKUP(DATE($C$5,$C$7,AH5),_공휴일날짜,3,FALSE),\"\"),\"\")","v":""}]
[]
[null,1,4,null,null,null,null,null,null,null,null,null,null,null,null,null,null,null,null,null,null,null,null,null,null,null,null,null,null,null,null,null,null,null,null,null,null,null,"Do It List"]
[null,null,null,null,null,null,null,null,null,null,null,null,null,null,null,null,null,null,null,null,null,null,null,null,null,null,null,null,null,null,null,null,null,null,null,null,null,null,false]
[null,null,null,null,null,null,null,null,null,null,null,null,null,null,null,null,null,null,null,null,null,null,null,null,null,null,null,null,null,null,null,null,null,null,null,null,null,null,false]
[null,null,null,null,null,null,null,null,null,{"$f":"Calendar($C$5,$C$7,8)","v":"1900-01-06"},{"$f":"IFERROR(IF(AND(J10<>\"\",VLOOKUP(DATE($C$5,$C$7,J10),_공휴일날짜,3,FALSE)<>\"\"),VLOOKUP(DATE($C$5,$C$7,J10),_공휴일날짜,3,FALSE),\"\"),\"\")","v":""},null,null,{"$f":"Calendar($C$5,$C$7,9)","v":"1900-01-07"},{"$f":"IFERROR(IF(AND(N10<>\"\",VLOOKUP(DATE($C$5,$C$7,N10),_공휴일날짜,3,FALSE)<>\"\"),VLOOKUP(DATE($C$5,$C$7,N10),_공휴일날짜,3,FALSE),\"\"),\"\")","v":""},null,null,{"$f":"Calendar($C$5,$C$7,10)","v":"1900-01-08"},{"$f":"IFERROR(IF(AND(R10<>\"\",VLOOKUP(DATE($C$5,$C$7,R10),_공휴일날짜,3,FALSE)<>\"\"),VLOOKUP(DATE($C$5,$C$7,R10),_공휴일날짜,3,FALSE),\"\"),\"\")","v":""},null,null,{"$f":"Calendar($C$5,$C$7,11)","v":"1900-01-09"},{"$f":"IFERROR(IF(AND(V10<>\"\",VLOOKUP(DATE($C$5,$C$7,V10),_공휴일날짜,3,FALSE)<>\"\"),VLOOKUP(DATE($C$5,$C$7,V10),_공휴일날짜,3,FALSE),\"\"),\"\")","v":""},null,null,{"$f":"Calendar($C$5,$C$7,12)","v":"1900-01-10"},{"$f":"IFERROR(IF(AND(Z10<>\"\",VLOOKUP(DATE($C$5,$C$7,Z10),_공휴일날짜,3,FALSE)<>\"\"),VLOOKUP(DATE($C$5,$C$7,Z10),_공휴일날짜,3,FALSE),\"\"),\"\")","v":""},null,null,{"$f":"Calendar($C$5,$C$7,13)","v":"1900-01-11"},{"$f":"IFERROR(IF(AND(AD10<>\"\",VLOOKUP(DATE($C$5,$C$7,AD10),_공휴일날짜,3,FALSE)<>\"\"),VLOOKUP(DATE($C$5,$C$7,AD10),_공휴일날짜,3,FALSE),\"\"),\"\")","v":""},null,null,{"$f":"Calendar($C$5,$C$7,14)","v":"1900-01-12"},{"$f":"IFERROR(IF(AND(AH10<>\"\",VLOOKUP(DATE($C$5,$C$7,AH10),_공휴일날짜,3,FALSE)<>\"\"),VLOOKUP(DATE($C$5,$C$7,AH10),_공휴일날짜,3,FALSE),\"\"),\"\")","v":""},null,null,null,false]
[null,null,null,null,null,null,null,null,null,null,null,null,null,null,null,null,null,null,null,null,null,null,null,null,null,null,null,null,null,null,null,null,null,null,null,null,null,null,false]
[null,null,null,null,null,null,null,null,null,null,null,null,null,null,null,null,null,null,null,null,null,null,null,null,null,null,null,null,null,null,null,null,null,null,null,null,null,null,false]
[null,null,{"$f":"VLOOKUP($C$7,'달력 설정'!$B$6:$C$17,2,FALSE)","v":"April"},null,null,null,null,null,null,null,null,null,null,null,null,null,null,null,null,null,null,null,null,null,null,null,null,null,null,null,null,null,null,null,null,null,null,null,false]
[null,null,null,null,null,null,null,null,null,null,null,null,null,null,null,null,null,null,null,null,null,null,null,null,null,null,null,null,null,null,null,null,null,null,null,null,null,null,false]
[null,null,null,null,null,null,null,null,null,{"$f":"Calendar($C$5,$C$7,15)","v":"1900-01-13"},{"$f":"IFERROR(IF(AND(J15<>\"\",VLOOKUP(DATE($C$5,$C$7,J15),_공휴일날짜,3,FALSE)<>\"\"),VLOOKUP(DATE($C$5,$C$7,J15),_공휴일날짜,3,FALSE),\"\"),\"\")","v":""},null,null,{"$f":"Calendar($C$5,$C$7,16)","v":"1900-01-14"},{"$f":"IFERROR(IF(AND(N15<>\"\",VLOOKUP(DATE($C$5,$C$7,N15),_공휴일날짜,3,FALSE)<>\"\"),VLOOKUP(DATE($C$5,$C$7,N15),_공휴일날짜,3,FALSE),\"\"),\"\")","v":""},null,null,{"$f":"Calendar($C$5,$C$7,17)","v":"1900-01-15"},{"$f":"IFERROR(IF(AND(R15<>\"\",VLOOKUP(DATE($C$5,$C$7,R15),_공휴일날짜,3,FALSE)<>\"\"),VLOOKUP(DATE($C$5,$C$7,R15),_공휴일날짜,3,FALSE),\"\"),\"\")","v":""},null,null,{"$f":"Calendar($C$5,$C$7,18)","v":"1900-01-16"},{"$f":"IFERROR(IF(AND(V15<>\"\",VLOOKUP(DATE($C$5,$C$7,V15),_공휴일날짜,3,FALSE)<>\"\"),VLOOKUP(DATE($C$5,$C$7,V15),_공휴일날짜,3,FALSE),\"\"),\"\")","v":""},null,null,{"$f":"Calendar($C$5,$C$7,19)","v":"1900-01-17"},{"$f":"IFERROR(IF(AND(Z15<>\"\",VLOOKUP(DATE($C$5,$C$7,Z15),_공휴일날짜,3,FALSE)<>\"\"),VLOOKUP(DATE($C$5,$C$7,Z15),_공휴일날짜,3,FALSE),\"\"),\"\")","v":""},null,null,{"$f":"Calendar($C$5,$C$7,20)","v":"1900-01-18"},{"$f":"IFERROR(IF(AND(AD15<>\"\",VLOOKUP(DATE($C$5,$C$7,AD15),_공휴일날짜,3,FALSE)<>\"\"),VLOOKUP(DATE($C$5,$C$7,AD15),_공휴일날짜,3,FALSE),\"\"),\"\")","v":""},null,null,{"$f":"Calendar($C$5,$C$7,21)","v":"1900-01-19"},{"$f":"IFERROR(IF(AND(AH15<>\"\",VLOOKUP(DATE($C$5,$C$7,AH15),_공휴일날짜,3,FALSE)<>\"\"),VLOOKUP(DATE($C$5,$C$7,AH15),_공휴일날짜,3,FALSE),\"\"),\"\")","v":""}]
[]
[null,{"$f":"VLOOKUP($E$17,'달력 설정'!$B$6:$C$17,2,FALSE)","v":"March"},null,null,{"$f":"IF($C$7=1,12,$C$7-1)","v":3},null,null,null,null,null,null,null,null,null,null,null,null,null,null,null,null,null,null,null,null,null,null,null,null,null,null,null,null,null,null,null,null,null,"MEMO"]
[null,"일","월","화","수","목","금","토"]
[null,{"$f":"IF($C$7=1,Calendar($C$5-1,12,1),Calendar($C$5,$C$7-1,1))","v":""},{"$f":"IF($C$7=1,Calendar($C$5-1,12,2),Calendar($C$5,$C$7-1,2))","v":""},{"$f":"IF($C$7=1,Calendar($C$5-1,12,3),Calendar($C$5,$C$7-1,3))","v":""},{"$f":"IF($C$7=1,Calendar($C$5-1,12,4),Calendar($C$5,$C$7-1,4))","v":""},{"$f":"IF($C$7=1,Calendar($C$5-1,12,5),Calendar($C$5,$C$7-1,5))","v":""},{"$f":"IF($C$7=1,Calendar($C$5-1,12,6),Calendar($C$5,$C$7-1,6))","v":""},{"$f":"IF($C$7=1,Calendar($C$5-1,12,7),Calendar($C$5,$C$7-1,7))","v":"1900-01-01"}]
[null,{"$f":"IF($C$7=1,Calendar($C$5-1,12,8),Calendar($C$5,$C$7-1,8))","v":"1900-01-02"},{"$f":"IF($C$7=1,Calendar($C$5-1,12,9),Calendar($C$5,$C$7-1,9))","v":"1900-01-03"},{"$f":"IF($C$7=1,Calendar($C$5-1,12,10),Calendar($C$5,$C$7-1,10))","v":"1900-01-04"},{"$f":"IF($C$7=1,Calendar($C$5-1,12,11),Calendar($C$5,$C$7-1,11))","v":"1900-01-05"},{"$f":"IF($C$7=1,Calendar($C$5-1,12,12),Calendar($C$5,$C$7-1,12))","v":"1900-01-06"},{"$f":"IF($C$7=1,Calendar($C$5-1,12,13),Calendar($C$5,$C$7-1,13))","v":"1900-01-07"},{"$f":"IF($C$7=1,Calendar($C$5-1,12,14),Calendar($C$5,$C$7-1,14))","v":"1900-01-08"},null,{"$f":"Calendar($C$5,$C$7,22)","v":"1900-01-20"},{"$f":"IFERROR(IF(AND(J20<>\"\",VLOOKUP(DATE($C$5,$C$7,J20),_공휴일날짜,3,FALSE)<>\"\"),VLOOKUP(DATE($C$5,$C$7,J20),_공휴일날짜,3,FALSE),\"\"),\"\")","v":""},null,null,{"$f":"Calendar($C$5,$C$7,23)","v":"1900-01-21"},{"$f":"IFERROR(IF(AND(N20<>\"\",VLOOKUP(DATE($C$5,$C$7,N20),_공휴일날짜,3,FALSE)<>\"\"),VLOOKUP(DATE($C$5,$C$7,N20),_공휴일날짜,3,FALSE),\"\"),\"\")","v":""},null,null,{"$f":"Calendar($C$5,$C$7,24)","v":"1900-01-22"},{"$f":"IFERROR(IF(AND(R20<>\"\",VLOOKUP(DATE($C$5,$C$7,R20),_공휴일날짜,3,FALSE)<>\"\"),VLOOKUP(DATE($C$5,$C$7,R20),_공휴일날짜,3,FALSE),\"\"),\"\")","v":""},null,null,{"$f":"Calendar($C$5,$C$7,25)","v":"1900-01-23"},{"$f":"IFERROR(IF(AND(V20<>\"\",VLOOKUP(DATE($C$5,$C$7,V20),_공휴일날짜,3,FALSE)<>\"\"),VLOOKUP(DATE($C$5,$C$7,V20),_공휴일날짜,3,FALSE),\"\"),\"\")","v":""},null,null,{"$f":"Calendar($C$5,$C$7,26)","v":"1900-01-24"},{"$f":"IFERROR(IF(AND(Z20<>\"\",VLOOKUP(DATE($C$5,$C$7,Z20),_공휴일날짜,3,FALSE)<>\"\"),VLOOKUP(DATE($C$5,$C$7,Z20),_공휴일날짜,3,FALSE),\"\"),\"\")","v":""},null,null,{"$f":"Calendar($C$5,$C$7,27)","v":"1900-01-25"},{"$f":"IFERROR(IF(AND(AD20<>\"\",VLOOKUP(DATE($C$5,$C$7,AD20),_공휴일날짜,3,FALSE)<>\"\"),VLOOKUP(DATE($C$5,$C$7,AD20),_공휴일날짜,3,FALSE),\"\"),\"\")","v":""},null,null,{"$f":"Calendar($C$5,$C$7,28)","v":"1900-01-26"},{"$f":"IFERROR(IF(AND(AH20<>\"\",VLOOKUP(DATE($C$5,$C$7,AH20),_공휴일날짜,3,FALSE)<>\"\"),VLOOKUP(DATE($C$5,$C$7,AH20),_공휴일날짜,3,FALSE),\"\"),\"\")","v":""}]
[null,{"$f":"IF($C$7=1,Calendar($C$5-1,12,15),Calendar($C$5,$C$7-1,15))","v":"1900-01-09"},{"$f":"IF($C$7=1,Calendar($C$5-1,12,16),Calendar($C$5,$C$7-1,16))","v":"1900-01-10"},{"$f":"IF($C$7=1,Calendar($C$5-1,12,17),Calendar($C$5,$C$7-1,17))","v":"1900-01-11"},{"$f":"IF($C$7=1,Calendar($C$5-1,12,18),Calendar($C$5,$C$7-1,18))","v":"1900-01-12"},{"$f":"IF($C$7=1,Calendar($C$5-1,12,19),Calendar($C$5,$C$7-1,19))","v":"1900-01-13"},{"$f":"IF($C$7=1,Calendar($C$5-1,12,20),Calendar($C$5,$C$7-1,20))","v":"1900-01-14"},{"$f":"IF($C$7=1,Calendar($C$5-1,12,21),Calendar($C$5,$C$7-1,21))","v":"1900-01-15"}]
[null,{"$f":"IF($C$7=1,Calendar($C$5-1,12,22),Calendar($C$5,$C$7-1,22))","v":"1900-01-16"},{"$f":"IF($C$7=1,Calendar($C$5-1,12,23),Calendar($C$5,$C$7-1,23))","v":"1900-01-17"},{"$f":"IF($C$7=1,Calendar($C$5-1,12,24),Calendar($C$5,$C$7-1,24))","v":"1900-01-18"},{"$f":"IF($C$7=1,Calendar($C$5-1,12,25),Calendar($C$5,$C$7-1,25))","v":"1900-01-19"},{"$f":"IF($C$7=1,Calendar($C$5-1,12,26),Calendar($C$5,$C$7-1,26))","v":"1900-01-20"},{"$f":"IF($C$7=1,Calendar($C$5-1,12,27),Calendar($C$5,$C$7-1,27))","v":"1900-01-21"},{"$f":"IF($C$7=1,Calendar($C$5-1,12,28),Calendar($C$5,$C$7-1,28))","v":"1900-01-22"}]
[null,{"$f":"IF($C$7=1,Calendar($C$5-1,12,29),Calendar($C$5,$C$7-1,29))","v":"1900-01-23"},{"$f":"IF($C$7=1,Calendar($C$5-1,12,30),Calendar($C$5,$C$7-1,30))","v":"1900-01-24"},{"$f":"IF($C$7=1,Calendar($C$5-1,12,31),Calendar($C$5,$C$7-1,31))","v":"1900-01-25"},{"$f":"IF($C$7=1,Calendar($C$5-1,12,32),Calendar($C$5,$C$7-1,32))","v":"1900-01-26"},{"$f":"IF($C$7=1,Calendar($C$5-1,12,33),Calendar($C$5,$C$7-1,33))","v":"1900-01-27"},{"$f":"IF($C$7=1,Calendar($C$5-1,12,34),Calendar($C$5,$C$7-1,34))","v":"1900-01-28"},{"$f":"IF($C$7=1,Calendar($C$5-1,12,35),Calendar($C$5,$C$7-1,35))","v":"1900-01-29"}]
[null,{"$f":"IF($C$7=1,Calendar($C$5-1,12,36),Calendar($C$5,$C$7-1,36))","v":"1900-01-30"},{"$f":"IF($C$7=1,Calendar($C$5-1,12,37),Calendar($C$5,$C$7-1,37))","v":"1900-01-31"}]
[null,null,null,null,null,null,null,null,null,{"$f":"Calendar($C$5,$C$7,29)","v":"1900-01-27"},{"$f":"IFERROR(IF(AND(J25<>\"\",VLOOKUP(DATE($C$5,$C$7,J25),_공휴일날짜,3,FALSE)<>\"\"),VLOOKUP(DATE($C$5,$C$7,J25),_공휴일날짜,3,FALSE),\"\"),\"\")","v":""},null,null,{"$f":"Calendar($C$5,$C$7,30)","v":"1900-01-28"},{"$f":"IFERROR(IF(AND(N25<>\"\",VLOOKUP(DATE($C$5,$C$7,N25),_공휴일날짜,3,FALSE)<>\"\"),VLOOKUP(DATE($C$5,$C$7,N25),_공휴일날짜,3,FALSE),\"\"),\"\")","v":""},null,null,{"$f":"Calendar($C$5,$C$7,31)","v":"1900-01-29"},{"$f":"IFERROR(IF(AND(R25<>\"\",VLOOKUP(DATE($C$5,$C$7,R25),_공휴일날짜,3,FALSE)<>\"\"),VLOOKUP(DATE($C$5,$C$7,R25),_공휴일날짜,3,FALSE),\"\"),\"\")","v":""},null,null,{"$f":"Calendar($C$5,$C$7,32)","v":"1900-01-30"},{"$f":"IFERROR(IF(AND(V25<>\"\",VLOOKUP(DATE($C$5,$C$7,V25),_공휴일날짜,3,FALSE)<>\"\"),VLOOKUP(DATE($C$5,$C$7,V25),_공휴일날짜,3,FALSE),\"\"),\"\")","v":""},null,null,{"$f":"Calendar($C$5,$C$7,33)","v":""},{"$f":"IFERROR(IF(AND(Z25<>\"\",VLOOKUP(DATE($C$5,$C$7,Z25),_공휴일날짜,3,FALSE)<>\"\"),VLOOKUP(DATE($C$5,$C$7,Z25),_공휴일날짜,3,FALSE),\"\"),\"\")","v":""},null,null,{"$f":"Calendar($C$5,$C$7,34)","v":""},{"$f":"IFERROR(IF(AND(AD25<>\"\",VLOOKUP(DATE($C$5,$C$7,AD25),_공휴일날짜,3,FALSE)<>\"\"),VLOOKUP(DATE($C$5,$C$7,AD25),_공휴일날짜,3,FALSE),\"\"),\"\")","v":""},null,null,{"$f":"Calendar($C$5,$C$7,35)","v":""},{"$f":"IFERROR(IF(AND(AH25<>\"\",VLOOKUP(DATE($C$5,$C$7,AH25),_공휴일날짜,3,FALSE)<>\"\"),VLOOKUP(DATE($C$5,$C$7,AH25),_공휴일날짜,3,FALSE),\"\"),\"\")","v":""}]
[null,{"$f":"VLOOKUP($E$26,'달력 설정'!$B$6:$C$17,2,FALSE)","v":"May"},null,null,{"$f":"IF($C$7=12,1,$C$7+1)","v":5}]
[null,"일","월","화","수","목","금","토"]
[null,{"$f":"IF($C$7=12,Calendar($C$5+1,1,1),Calendar($C$5,$C$7+1,1))","v":""},{"$f":"IF($C$7=12,Calendar($C$5+1,1,2),Calendar($C$5,$C$7+1,2))","v":""},{"$f":"IF($C$7=12,Calendar($C$5+1,1,3),Calendar($C$5,$C$7+1,3))","v":""},{"$f":"IF($C$7=12,Calendar($C$5+1,1,4),Calendar($C$5,$C$7+1,4))","v":""},{"$f":"IF($C$7=12,Calendar($C$5+1,1,5),Calendar($C$5,$C$7+1,5))","v":"1900-01-01"},{"$f":"IF($C$7=12,Calendar($C$5+1,1,6),Calendar($C$5,$C$7+1,6))","v":"1900-01-02"},{"$f":"IF($C$7=12,Calendar($C$5+1,1,7),Calendar($C$5,$C$7+1,7))","v":"1900-01-03"}]
[null,{"$f":"IF($C$7=12,Calendar($C$5+1,1,8),Calendar($C$5,$C$7+1,8))","v":"1900-01-04"},{"$f":"IF($C$7=12,Calendar($C$5+1,1,9),Calendar($C$5,$C$7+1,9))","v":"1900-01-05"},{"$f":"IF($C$7=12,Calendar($C$5+1,1,10),Calendar($C$5,$C$7+1,10))","v":"1900-01-06"},{"$f":"IF($C$7=12,Calendar($C$5+1,1,11),Calendar($C$5,$C$7+1,11))","v":"1900-01-07"},{"$f":"IF($C$7=12,Calendar($C$5+1,1,12),Calendar($C$5,$C$7+1,12))","v":"1900-01-08"},{"$f":"IF($C$7=12,Calendar($C$5+1,1,13),Calendar($C$5,$C$7+1,13))","v":"1900-01-09"},{"$f":"IF($C$7=12,Calendar($C$5+1,1,14),Calendar($C$5,$C$7+1,14))","v":"1900-01-10"}]
[null,{"$f":"IF($C$7=12,Calendar($C$5+1,1,15),Calendar($C$5,$C$7+1,15))","v":"1900-01-11"},{"$f":"IF($C$7=12,Calendar($C$5+1,1,16),Calendar($C$5,$C$7+1,16))","v":"1900-01-12"},{"$f":"IF($C$7=12,Calendar($C$5+1,1,17),Calendar($C$5,$C$7+1,17))","v":"1900-01-13"},{"$f":"IF($C$7=12,Calendar($C$5+1,1,18),Calendar($C$5,$C$7+1,18))","v":"1900-01-14"},{"$f":"IF($C$7=12,Calendar($C$5+1,1,19),Calendar($C$5,$C$7+1,19))","v":"1900-01-15"},{"$f":"IF($C$7=12,Calendar($C$5+1,1,20),Calendar($C$5,$C$7+1,20))","v":"1900-01-16"},{"$f":"IF($C$7=12,Calendar($C$5+1,1,21),Calendar($C$5,$C$7+1,21))","v":"1900-01-17"},null,{"$f":"Calendar($C$5,$C$7,36)","v":""},{"$f":"IFERROR(IF(AND(J30<>\"\",VLOOKUP(DATE($C$5,$C$7,J30),_공휴일날짜,3,FALSE)<>\"\"),VLOOKUP(DATE($C$5,$C$7,J30),_공휴일날짜,3,FALSE),\"\"),\"\")","v":""},null,null,{"$f":"Calendar($C$5,$C$7,37)","v":""},{"$f":"IFERROR(IF(AND(N30<>\"\",VLOOKUP(DATE($C$5,$C$7,N30),_공휴일날짜,3,FALSE)<>\"\"),VLOOKUP(DATE($C$5,$C$7,N30),_공휴일날짜,3,FALSE),\"\"),\"\")","v":""}]
[null,{"$f":"IF($C$7=12,Calendar($C$5+1,1,22),Calendar($C$5,$C$7+1,22))","v":"1900-01-18"},{"$f":"IF($C$7=12,Calendar($C$5+1,1,23),Calendar($C$5,$C$7+1,23))","v":"1900-01-19"},{"$f":"IF($C$7=12,Calendar($C$5+1,1,24),Calendar($C$5,$C$7+1,24))","v":"1900-01-20"},{"$f":"IF($C$7=12,Calendar($C$5+1,1,25),Calendar($C$5,$C$7+1,25))","v":"1900-01-21"},{"$f":"IF($C$7=12,Calendar($C$5+1,1,26),Calendar($C$5,$C$7+1,26))","v":"1900-01-22"},{"$f":"IF($C$7=12,Calendar($C$5+1,1,27),Calendar($C$5,$C$7+1,27))","v":"1900-01-23"},{"$f":"IF($C$7=12,Calendar($C$5+1,1,28),Calendar($C$5,$C$7+1,28))","v":"1900-01-24"}]
[null,{"$f":"IF($C$7=12,Calendar($C$5+1,1,29),Calendar($C$5,$C$7+1,29))","v":"1900-01-25"},{"$f":"IF($C$7=12,Calendar($C$5+1,1,30),Calendar($C$5,$C$7+1,30))","v":"1900-01-26"},{"$f":"IF($C$7=12,Calendar($C$5+1,1,31),Calendar($C$5,$C$7+1,31))","v":"1900-01-27"},{"$f":"IF($C$7=12,Calendar($C$5+1,1,32),Calendar($C$5,$C$7+1,32))","v":"1900-01-28"},{"$f":"IF($C$7=12,Calendar($C$5+1,1,33),Calendar($C$5,$C$7+1,33))","v":"1900-01-29"},{"$f":"IF($C$7=12,Calendar($C$5+1,1,34),Calendar($C$5,$C$7+1,34))","v":"1900-01-30"},{"$f":"IF($C$7=12,Calendar($C$5+1,1,35),Calendar($C$5,$C$7+1,35))","v":"1900-01-31"}]
[null,{"$f":"IF($C$7=12,Calendar($C$5+1,1,36),Calendar($C$5,$C$7+1,36))","v":""},{"$f":"IF($C$7=12,Calendar($C$5+1,1,37),Calendar($C$5,$C$7+1,37))","v":""}]

{"sheet":"5월","index":4,"n_rows":33,"n_cols":39,"rows_kept":33,"cut":false,"hidden":false,"merged":[[2,29,3,32],[2,33,3,36],[4,2,5,6],[4,10,4,12],[4,14,4,16],[4,18,4,20],[4,22,4,24],[4,26,4,28],[4,30,4,32],[4,34,4,36],[0,1,2,7],[2,9,3,12],[2,13,3,16],[2,17,3,20],[2,21,3,24],[2,25,3,28],[5,33,5,36],[6,2,11,6],[6,9,6,12],[6,13,6,16],[6,17,6,20],[6,21,6,24],[6,25,6,28],[6,29,6,32],[6,33,6,36],[8,9,8,12],[5,9,5,12],[5,13,5,16],[5,17,5,20],[5,21,5,24],[5,25,5,28],[5,29,5,32],[6,38,6,43],[7,9,7,12],[7,13,7,16],[7,17,7,20],[7,21,7,24],[7,25,7,28],[7,29,7,32],[7,33,7,36],[7,39,7,43],[8,39,8,43],[9,10,9,12],[9,14,9,16],[9,18,9,20],[9,22,9,24],[9,26,9,28],[9,30,9,32],[9,34,9,36],[9,39,9,43],[8,13,8,16],[8,17,8,20],[8,21,8,24],[8,25,8,28],[8,29,8,32],[8,33,8,36],[12,2,13,6],[12,9,12,12],[12,13,12,16],[12,17,12,20],[12,21,12,24],[12,25,12,28],[10,33,10,36],[10,39,10,43],[11,9,11,12],[11,13,11,16],[11,17,11,20],[11,21,11,24],[11,25,11,28],[11,29,11,32],[11,33,11,36],[11,39,11,43],[10,9,10,12],[10,13,10,16],[10,17,10,20],[10,21,10,24],[10,25,10,28],[10,29,10,32],[13,39,13,43],[14,10,14,12],[14,14,14,16],[14,18,14,20],[14,22,14,24],[14,26,14,28],[14,30,14,32],[14,34,14,36],[12,29,12,32],[12,33,12,36],[12,39,12,43],[13,9,13,12],[13,13,13,16],[13,17,13,20],[13,21,13,24],[13,25,13,28],[13,29,13,32],[13,33,13,36],[15,33,15,36],[16,1,16,3],[16,9,16,12],[16,13,16,16],[16,17,16,20],[16,21,16,24],[16,25,16,28],[16,29,16,32],[16,33,16,36],[15,9,15,12],[15,13,15,16],[15,17,15,20],[15,21,15,24],[15,25,15,28],[15,29,15,32],[16,38,16,43],[17,9,17,12],[17,13,17,16],[17,17,17,20],[17,21,17,24],[17,25,17,28],[17,29,17,32],[17,33,17,36],[17,38,17,43],[18,33,18,36],[18,38,18,43],[19,10,19,12],[19,14,19,16],[19,18,19,20],[19,22,19,24],[19,26,19,28],[19,30,19,32],[19,34,19,36],[19,38,19,43],[18,9,18,12],[18,13,18,16],[18,17,18,20],[18,21,18,24],[18,25,18,28],[18,29,18,32],[20,33,20,36],[20,38,20,43],[21,9,21,12],[21,13,21,16],[21,17,21,20],[21,21,21,24],[21,25,21,28],[21,29,21,32],[21,33,21,36],[21,38,21,43],[20,9,20,12],[20,13,20,16],[20,17,20,20],[20,21,20,24],[20,25,20,28],[20,29,20,32],[22,33,22,36],[22,38,22,43],[23,9,23,12],[23,13,23,16],[23,17,23,20],[23,21,23,24],[23,25,23,28],[23,29,23,32],[23,33,23,36],[23,38,23,43],[22,9,22,12],[22,13,22,16],[22,17,22,20],[22,21,22,24],[22,25,22,28],[22,29,22,32],[24,34,24,36],[24,38,24,43],[25,1,25,3],[25,9,25,12],[25,13,25,16],[25,17,25,20],[25,21,25,24],[25,25,25,28],[25,29,25,32],[25,33,25,36],[24,10,24,12],[24,14,24,16],[24,18,24,20],[24,22,24,24],[24,26,24,28],[24,30,24,32],[25,38,25,43],[26,9,26,12],[26,13,26,16],[26,17,26,20],[26,21,26,24],[26,25,26,28],[26,29,26,32],[26,33,26,36],[26,38,26,43],[27,33,27,36],[27,38,27,43],[28,9,28,12],[28,13,28,16],[28,17,28,20],[28,21,28,24],[28,25,28,28],[28,29,28,32],[28,33,28,36],[28,38,28,43],[27,9,27,12],[27,13,27,16],[27,17,27,20],[27,21,27,24],[27,25,27,28],[27,29,27,32],[33,9,33,12],[33,13,33,16],[31,9,31,12],[31,13,31,16],[31,38,31,43],[32,9,32,12],[32,13,32,16],[32,38,32,43],[29,10,29,12],[29,14,29,16],[29,38,29,43],[30,9,30,12],[30,13,30,16],[30,38,30,43]]}
[]
[]
[null,null,null,null,null,null,null,null,null,"일 Sunday",null,null,null,"월 Monday",null,null,null,"화 Tuesday",null,null,null,"수 Wednesday",null,null,null,"목 Thursday",null,null,null,"금 Friday",null,null,null,"토 Saturday"]
[]
[null,null,{"$f":"'달력 설정'!$B$2","v":2025},null,null,null,null,null,null,{"$f":"Calendar($C$5,$C$7,1)","v":""},{"$f":"IFERROR(IF(AND(J5<>\"\",VLOOKUP(DATE($C$5,$C$7,J5),_공휴일날짜,3,FALSE)<>\"\"),VLOOKUP(DATE($C$5,$C$7,J5),_공휴일날짜,3,FALSE),\"\"),\"\")","v":""},null,null,{"$f":"Calendar($C$5,$C$7,2)","v":""},{"$f":"IFERROR(IF(AND(N5<>\"\",VLOOKUP(DATE($C$5,$C$7,N5),_공휴일날짜,3,FALSE)<>\"\"),VLOOKUP(DATE($C$5,$C$7,N5),_공휴일날짜,3,FALSE),\"\"),\"\")","v":""},null,null,{"$f":"Calendar($C$5,$C$7,3)","v":""},{"$f":"IFERROR(IF(AND(R5<>\"\",VLOOKUP(DATE($C$5,$C$7,R5),_공휴일날짜,3,FALSE)<>\"\"),VLOOKUP(DATE($C$5,$C$7,R5),_공휴일날짜,3,FALSE),\"\"),\"\")","v":""},null,null,{"$f":"Calendar($C$5,$C$7,4)","v":""},{"$f":"IFERROR(IF(AND(V5<>\"\",VLOOKUP(DATE($C$5,$C$7,V5),_공휴일날짜,3,FALSE)<>\"\"),VLOOKUP(DATE($C$5,$C$7,V5),_공휴일날짜,3,FALSE),\"\"),\"\")","v":""},null,null,{"$f":"Calendar($C$5,$C$7,5)","v":"1900-01-01"},{"$f":"IFERROR(IF(AND(Z5<>\"\",VLOOKUP(DATE($C$5,$C$7,Z5),_공휴일날짜,3,FALSE)<>\"\"),VLOOKUP(DATE($C$5,$C$7,Z5),_공휴일날짜,3,FALSE),\"\"),\"\")","v":""},null,null,{"$f":"Calendar($C$5,$C$7,6)","v":"1900-01-02"},{"$f":"IFERROR(IF(AND(AD5<>\"\",VLOOKUP(DATE($C$5,$C$7,AD5),_공휴일날짜,3,FALSE)<>\"\"),VLOOKUP(DATE($C$5,$C$7,AD5),_공휴일날짜,3,FALSE),\"\"),\"\")","v":""},null,null,{"$f":"Calendar($C$5,$C$7,7)","v":"1900-01-03"},{"$f":"IFERROR(IF(AND(AH5<>\"\",VLOOKUP(DATE($C$5,$C$7,AH5),_공휴일날짜,3,FALSE)<>\"\"),VLOOKUP(DATE($C$5,$C$7,AH5),_공휴일날짜,3,FALSE),\"\"),\"\")","v":""}]
[]
[null,1,5,null,null,null,null,null,null,null,null,null,null,null,null,null,null,null,null,null,null,null,null,null,null,null,null,null,null,null,null,null,null,null,null,null,null,null,"Do It List"]
[null,null,null,null,null,null,null,null,null,null,null,null,null,null,null,null,null,null,null,null,null,null,null,null,null,null,null,null,null,null,null,null,null,null,null,null,null,null,false]
[null,null,null,null,null,null,null,null,null,null,null,null,null,null,null,null,null,null,null,null,null,null,null,null,null,null,null,null,null,null,null,null,null,null,null,null,null,null,false]
[null,null,null,null,null,null,null,null,null,{"$f":"Calendar($C$5,$C$7,8)","v":"1900-01-04"},{"$f":"IFERROR(IF(AND(J10<>\"\",VLOOKUP(DATE($C$5,$C$7,J10),_공휴일날짜,3,FALSE)<>\"\"),VLOOKUP(DATE($C$5,$C$7,J10),_공휴일날짜,3,FALSE),\"\"),\"\")","v":""},null,null,{"$f":"Calendar($C$5,$C$7,9)","v":"1900-01-05"},{"$f":"IFERROR(IF(AND(N10<>\"\",VLOOKUP(DATE($C$5,$C$7,N10),_공휴일날짜,3,FALSE)<>\"\"),VLOOKUP(DATE($C$5,$C$7,N10),_공휴일날짜,3,FALSE),\"\"),\"\")","v":"부처님오신날,어린이날"},null,null,{"$f":"Calendar($C$5,$C$7,10)","v":"1900-01-06"},{"$f":"IFERROR(IF(AND(R10<>\"\",VLOOKUP(DATE($C$5,$C$7,R10),_공휴일날짜,3,FALSE)<>\"\"),VLOOKUP(DATE($C$5,$C$7,R10),_공휴일날짜,3,FALSE),\"\"),\"\")","v":"대체 휴일"},null,null,{"$f":"Calendar($C$5,$C$7,11)","v":"1900-01-07"},{"$f":"IFERROR(IF(AND(V10<>\"\",VLOOKUP(DATE($C$5,$C$7,V10),_공휴일날짜,3,FALSE)<>\"\"),VLOOKUP(DATE($C$5,$C$7,V10),_공휴일날짜,3,FALSE),\"\"),\"\")","v":""},null,null,{"$f":"Calendar($C$5,$C$7,12)","v":"1900-01-08"},{"$f":"IFERROR(IF(AND(Z10<>\"\",VLOOKUP(DATE($C$5,$C$7,Z10),_공휴일날짜,3,FALSE)<>\"\"),VLOOKUP(DATE($C$5,$C$7,Z10),_공휴일날짜,3,FALSE),\"\"),\"\")","v":""},null,null,{"$f":"Calendar($C$5,$C$7,13)","v":"1900-01-09"},{"$f":"IFERROR(IF(AND(AD10<>\"\",VLOOKUP(DATE($C$5,$C$7,AD10),_공휴일날짜,3,FALSE)<>\"\"),VLOOKUP(DATE($C$5,$C$7,AD10),_공휴일날짜,3,FALSE),\"\"),\"\")","v":""},null,null,{"$f":"Calendar($C$5,$C$7,14)","v":"1900-01-10"},{"$f":"IFERROR(IF(AND(AH10<>\"\",VLOOKUP(DATE($C$5,$C$7,AH10),_공휴일날짜,3,FALSE)<>\"\"),VLOOKUP(DATE($C$5,$C$7,AH10),_공휴일날짜,3,FALSE),\"\"),\"\")","v":""},null,null,null,false]
[null,null,null,null,null,null,null,null,null,null,null,null,null,null,null,null,null,null,null,null,null,null,null,null,null,null,null,null,null,null,null,null,null,null,null,null,null,null,false]
[null,null,null,null,null,null,null,null,null,null,null,null,null,null,null,null,null,null,null,null,null,null,null,null,null,null,null,null,null,null,null,null,null,null,null,null,null,null,false]
[null,null,{"$f":"VLOOKUP($C$7,'달력 설정'!$B$6:$C$17,2,FALSE)","v":"May"},null,null,null,null,null,null,null,null,null,null,null,null,null,null,null,null,null,null,null,null,null,null,null,null,null,null,null,null,null,null,null,null,null,null,null,false]
[null,null,null,null,null,null,null,null,null,null,null,null,null,null,null,null,null,null,null,null,null,null,null,null,null,null,null,null,null,null,null,null,null,null,null,null,null,null,false]
[null,null,null,null,null,null,null,null,null,{"$f":"Calendar($C$5,$C$7,15)","v":"1900-01-11"},{"$f":"IFERROR(IF(AND(J15<>\"\",VLOOKUP(DATE($C$5,$C$7,J15),_공휴일날짜,3,FALSE)<>\"\"),VLOOKUP(DATE($C$5,$C$7,J15),_공휴일날짜,3,FALSE),\"\"),\"\")","v":""},null,null,{"$f":"Calendar($C$5,$C$7,16)","v":"1900-01-12"},{"$f":"IFERROR(IF(AND(N15<>\"\",VLOOKUP(DATE($C$5,$C$7,N15),_공휴일날짜,3,FALSE)<>\"\"),VLOOKUP(DATE($C$5,$C$7,N15),_공휴일날짜,3,FALSE),\"\"),\"\")","v":""},null,null,{"$f":"Calendar($C$5,$C$7,17)","v":"1900-01-13"},{"$f":"IFERROR(IF(AND(R15<>\"\",VLOOKUP(DATE($C$5,$C$7,R15),_공휴일날짜,3,FALSE)<>\"\"),VLOOKUP(DATE($C$5,$C$7,R15),_공휴일날짜,3,FALSE),\"\"),\"\")","v":""},null,null,{"$f":"Calendar($C$5,$C$7,18)","v":"1900-01-14"},{"$f":"IFERROR(IF(AND(V15<>\"\",VLOOKUP(DATE($C$5,$C$7,V15),_공휴일날짜,3,FALSE)<>\"\"),VLOOKUP(DATE($C$5,$C$7,V15),_공휴일날짜,3,FALSE),\"\"),\"\")","v":""},null,null,{"$f":"Calendar($C$5,$C$7,19)","v":"1900-01-15"},{"$f":"IFERROR(IF(AND(Z15<>\"\",VLOOKUP(DATE($C$5,$C$7,Z15),_공휴일날짜,3,FALSE)<>\"\"),VLOOKUP(DATE($C$5,$C$7,Z15),_공휴일날짜,3,FALSE),\"\"),\"\")","v":""},null,null,{"$f":"Calendar($C$5,$C$7,20)","v":"1900-01-16"},{"$f":"IFERROR(IF(AND(AD15<>\"\",VLOOKUP(DATE($C$5,$C$7,AD15),_공휴일날짜,3,FALSE)<>\"\"),VLOOKUP(DATE($C$5,$C$7,AD15),_공휴일날짜,3,FALSE),\"\"),\"\")","v":""},null,null,{"$f":"Calendar($C$5,$C$7,21)","v":"1900-01-17"},{"$f":"IFERROR(IF(AND(AH15<>\"\",VLOOKUP(DATE($C$5,$C$7,AH15),_공휴일날짜,3,FALSE)<>\"\"),VLOOKUP(DATE($C$5,$C$7,AH15),_공휴일날짜,3,FALSE),\"\"),\"\")","v":""}]
[]
[null,{"$f":"VLOOKUP($E$17,'달력 설정'!$B$6:$C$17,2,FALSE)","v":"April"},null,null,{"$f":"IF($C$7=1,12,$C$7-1)","v":4},null,null,null,null,null,null,null,null,null,null,null,null,null,null,null,null,null,null,null,null,null,null,null,null,null,null,null,null,null,null,null,null,null,"MEMO"]
[null,"일","월","화","수","목","금","토"]
[null,{"$f":"IF($C$7=1,Calendar($C$5-1,12,1),Calendar($C$5,$C$7-1,1))","v":""},{"$f":"IF($C$7=1,Calendar($C$5-1,12,2),Calendar($C$5,$C$7-1,2))","v":""},{"$f":"IF($C$7=1,Calendar($C$5-1,12,3),Calendar($C$5,$C$7-1,3))","v":"1900-01-01"},{"$f":"IF($C$7=1,Calendar($C$5-1,12,4),Calendar($C$5,$C$7-1,4))","v":"1900-01-02"},{"$f":"IF($C$7=1,Calendar($C$5-1,12,5),Calendar($C$5,$C$7-1,5))","v":"1900-01-03"},{"$f":"IF($C$7=1,Calendar($C$5-1,12,6),Calendar($C$5,$C$7-1,6))","v":"1900-01-04"},{"$f":"IF($C$7=1,Calendar($C$5-1,12,7),Calendar($C$5,$C$7-1,7))","v":"1900-01-05"}]
[null,{"$f":"IF($C$7=1,Calendar($C$5-1,12,8),Calendar($C$5,$C$7-1,8))","v":"1900-01-06"},{"$f":"IF($C$7=1,Calendar($C$5-1,12,9),Calendar($C$5,$C$7-1,9))","v":"1900-01-07"},{"$f":"IF($C$7=1,Calendar($C$5-1,12,10),Calendar($C$5,$C$7-1,10))","v":"1900-01-08"},{"$f":"IF($C$7=1,Calendar($C$5-1,12,11),Calendar($C$5,$C$7-1,11))","v":"1900-01-09"},{"$f":"IF($C$7=1,Calendar($C$5-1,12,12),Calendar($C$5,$C$7-1,12))","v":"1900-01-10"},{"$f":"IF($C$7=1,Calendar($C$5-1,12,13),Calendar($C$5,$C$7-1,13))","v":"1900-01-11"},{"$f":"IF($C$7=1,Calendar($C$5-1,12,14),Calendar($C$5,$C$7-1,14))","v":"1900-01-12"},null,{"$f":"Calendar($C$5,$C$7,22)","v":"1900-01-18"},{"$f":"IFERROR(IF(AND(J20<>\"\",VLOOKUP(DATE($C$5,$C$7,J20),_공휴일날짜,3,FALSE)<>\"\"),VLOOKUP(DATE($C$5,$C$7,J20),_공휴일날짜,3,FALSE),\"\"),\"\")","v":""},null,null,{"$f":"Calendar($C$5,$C$7,23)","v":"1900-01-19"},{"$f":"IFERROR(IF(AND(N20<>\"\",VLOOKUP(DATE($C$5,$C$7,N20),_공휴일날짜,3,FALSE)<>\"\"),VLOOKUP(DATE($C$5,$C$7,N20),_공휴일날짜,3,FALSE),\"\"),\"\")","v":""},null,null,{"$f":"Calendar($C$5,$C$7,24)","v":"1900-01-20"},{"$f":"IFERROR(IF(AND(R20<>\"\",VLOOKUP(DATE($C$5,$C$7,R20),_공휴일날짜,3,FALSE)<>\"\"),VLOOKUP(DATE($C$5,$C$7,R20),_공휴일날짜,3,FALSE),\"\"),\"\")","v":""},null,null,{"$f":"Calendar($C$5,$C$7,25)","v":"1900-01-21"},{"$f":"IFERROR(IF(AND(V20<>\"\",VLOOKUP(DATE($C$5,$C$7,V20),_공휴일날짜,3,FALSE)<>\"\"),VLOOKUP(DATE($C$5,$C$7,V20),_공휴일날짜,3,FALSE),\"\"),\"\")","v":""},null,null,{"$f":"Calendar($C$5,$C$7,26)","v":"1900-01-22"},{"$f":"IFERROR(IF(AND(Z20<>\"\",VLOOKUP(DATE($C$5,$C$7,Z20),_공휴일날짜,3,FALSE)<>\"\"),VLOOKUP(DATE($C$5,$C$7,Z20),_공휴일날짜,3,FALSE),\"\"),\"\")","v":""},null,null,{"$f":"Calendar($C$5,$C$7,27)","v":"1900-01-23"},{"$f":"IFERROR(IF(AND(AD20<>\"\",VLOOKUP(DATE($C$5,$C$7,AD20),_공휴일날짜,3,FALSE)<>\"\"),VLOOKUP(DATE($C$5,$C$7,AD20),_공휴일날짜,3,FALSE),\"\"),\"\")","v":""},null,null,{"$f":"Calendar($C$5,$C$7,28)","v":"1900-01-24"},{"$f":"IFERROR(IF(AND(AH20<>\"\",VLOOKUP(DATE($C$5,$C$7,AH20),_공휴일날짜,3,FALSE)<>\"\"),VLOOKUP(DATE($C$5,$C$7,AH20),_공휴일날짜,3,FALSE),\"\"),\"\")","v":""}]
[null,{"$f":"IF($C$7=1,Calendar($C$5-1,12,15),Calendar($C$5,$C$7-1,15))","v":"1900-01-13"},{"$f":"IF($C$7=1,Calendar($C$5-1,12,16),Calendar($C$5,$C$7-1,16))","v":"1900-01-14"},{"$f":"IF($C$7=1,Calendar($C$5-1,12,17),Calendar($C$5,$C$7-1,17))","v":"1900-01-15"},{"$f":"IF($C$7=1,Calendar($C$5-1,12,18),Calendar($C$5,$C$7-1,18))","v":"1900-01-16"},{"$f":"IF($C$7=1,Calendar($C$5-1,12,19),Calendar($C$5,$C$7-1,19))","v":"1900-01-17"},{"$f":"IF($C$7=1,Calendar($C$5-1,12,20),Calendar($C$5,$C$7-1,20))","v":"1900-01-18"},{"$f":"IF($C$7=1,Calendar($C$5-1,12,21),Calendar($C$5,$C$7-1,21))","v":"1900-01-19"}]
[null,{"$f":"IF($C$7=1,Calendar($C$5-1,12,22),Calendar($C$5,$C$7-1,22))","v":"1900-01-20"},{"$f":"IF($C$7=1,Calendar($C$5-1,12,23),Calendar($C$5,$C$7-1,23))","v":"1900-01-21"},{"$f":"IF($C$7=1,Calendar($C$5-1,12,24),Calendar($C$5,$C$7-1,24))","v":"1900-01-22"},{"$f":"IF($C$7=1,Calendar($C$5-1,12,25),Calendar($C$5,$C$7-1,25))","v":"1900-01-23"},{"$f":"IF($C$7=1,Calendar($C$5-1,12,26),Calendar($C$5,$C$7-1,26))","v":"1900-01-24"},{"$f":"IF($C$7=1,Calendar($C$5-1,12,27),Calendar($C$5,$C$7-1,27))","v":"1900-01-25"},{"$f":"IF($C$7=1,Calendar($C$5-1,12,28),Calendar($C$5,$C$7-1,28))","v":"1900-01-26"}]
[null,{"$f":"IF($C$7=1,Calendar($C$5-1,12,29),Calendar($C$5,$C$7-1,29))","v":"1900-01-27"},{"$f":"IF($C$7=1,Calendar($C$5-1,12,30),Calendar($C$5,$C$7-1,30))","v":"1900-01-28"},{"$f":"IF($C$7=1,Calendar($C$5-1,12,31),Calendar($C$5,$C$7-1,31))","v":"1900-01-29"},{"$f":"IF($C$7=1,Calendar($C$5-1,12,32),Calendar($C$5,$C$7-1,32))","v":"1900-01-30"},{"$f":"IF($C$7=1,Calendar($C$5-1,12,33),Calendar($C$5,$C$7-1,33))","v":""},{"$f":"IF($C$7=1,Calendar($C$5-1,12,34),Calendar($C$5,$C$7-1,34))","v":""},{"$f":"IF($C$7=1,Calendar($C$5-1,12,35),Calendar($C$5,$C$7-1,35))","v":""}]
[null,{"$f":"IF($C$7=1,Calendar($C$5-1,12,36),Calendar($C$5,$C$7-1,36))","v":""},{"$f":"IF($C$7=1,Calendar($C$5-1,12,37),Calendar($C$5,$C$7-1,37))","v":""}]
[null,null,null,null,null,null,null,null,null,{"$f":"Calendar($C$5,$C$7,29)","v":"1900-01-25"},{"$f":"IFERROR(IF(AND(J25<>\"\",VLOOKUP(DATE($C$5,$C$7,J25),_공휴일날짜,3,FALSE)<>\"\"),VLOOKUP(DATE($C$5,$C$7,J25),_공휴일날짜,3,FALSE),\"\"),\"\")","v":""},null,null,{"$f":"Calendar($C$5,$C$7,30)","v":"1900-01-26"},{"$f":"IFERROR(IF(AND(N25<>\"\",VLOOKUP(DATE($C$5,$C$7,N25),_공휴일날짜,3,FALSE)<>\"\"),VLOOKUP(DATE($C$5,$C$7,N25),_공휴일날짜,3,FALSE),\"\"),\"\")","v":""},null,null,{"$f":"Calendar($C$5,$C$7,31)","v":"1900-01-27"},{"$f":"IFERROR(IF(AND(R25<>\"\",VLOOKUP(DATE($C$5,$C$7,R25),_공휴일날짜,3,FALSE)<>\"\"),VLOOKUP(DATE($C$5,$C$7,R25),_공휴일날짜,3,FALSE),\"\"),\"\")","v":""},null,null,{"$f":"Calendar($C$5,$C$7,32)","v":"1900-01-28"},{"$f":"IFERROR(IF(AND(V25<>\"\",VLOOKUP(DATE($C$5,$C$7,V25),_공휴일날짜,3,FALSE)<>\"\"),VLOOKUP(DATE($C$5,$C$7,V25),_공휴일날짜,3,FALSE),\"\"),\"\")","v":""},null,null,{"$f":"Calendar($C$5,$C$7,33)","v":"1900-01-29"},{"$f":"IFERROR(IF(AND(Z25<>\"\",VLOOKUP(DATE($C$5,$C$7,Z25),_공휴일날짜,3,FALSE)<>\"\"),VLOOKUP(DATE($C$5,$C$7,Z25),_공휴일날짜,3,FALSE),\"\"),\"\")","v":""},null,null,{"$f":"Calendar($C$5,$C$7,34)","v":"1900-01-30"},{"$f":"IFERROR(IF(AND(AD25<>\"\",VLOOKUP(DATE($C$5,$C$7,AD25),_공휴일날짜,3,FALSE)<>\"\"),VLOOKUP(DATE($C$5,$C$7,AD25),_공휴일날짜,3,FALSE),\"\"),\"\")","v":""},null,null,{"$f":"Calendar($C$5,$C$7,35)","v":"1900-01-31"},{"$f":"IFERROR(IF(AND(AH25<>\"\",VLOOKUP(DATE($C$5,$C$7,AH25),_공휴일날짜,3,FALSE)<>\"\"),VLOOKUP(DATE($C$5,$C$7,AH25),_공휴일날짜,3,FALSE),\"\"),\"\")","v":""}]
[null,{"$f":"VLOOKUP($E$26,'달력 설정'!$B$6:$C$17,2,FALSE)","v":"June"},null,null,{"$f":"IF($C$7=12,1,$C$7+1)","v":6}]
[null,"일","월","화","수","목","금","토"]
[null,{"$f":"IF($C$7=12,Calendar($C$5+1,1,1),Calendar($C$5,$C$7+1,1))","v":"1900-01-01"},{"$f":"IF($C$7=12,Calendar($C$5+1,1,2),Calendar($C$5,$C$7+1,2))","v":"1900-01-02"},{"$f":"IF($C$7=12,Calendar($C$5+1,1,3),Calendar($C$5,$C$7+1,3))","v":"1900-01-03"},{"$f":"IF($C$7=12,Calendar($C$5+1,1,4),Calendar($C$5,$C$7+1,4))","v":"1900-01-04"},{"$f":"IF($C$7=12,Calendar($C$5+1,1,5),Calendar($C$5,$C$7+1,5))","v":"1900-01-05"},{"$f":"IF($C$7=12,Calendar($C$5+1,1,6),Calendar($C$5,$C$7+1,6))","v":"1900-01-06"},{"$f":"IF($C$7=12,Calendar($C$5+1,1,7),Calendar($C$5,$C$7+1,7))","v":"1900-01-07"}]
[null,{"$f":"IF($C$7=12,Calendar($C$5+1,1,8),Calendar($C$5,$C$7+1,8))","v":"1900-01-08"},{"$f":"IF($C$7=12,Calendar($C$5+1,1,9),Calendar($C$5,$C$7+1,9))","v":"1900-01-09"},{"$f":"IF($C$7=12,Calendar($C$5+1,1,10),Calendar($C$5,$C$7+1,10))","v":"1900-01-10"},{"$f":"IF($C$7=12,Calendar($C$5+1,1,11),Calendar($C$5,$C$7+1,11))","v":"1900-01-11"},{"$f":"IF($C$7=12,Calendar($C$5+1,1,12),Calendar($C$5,$C$7+1,12))","v":"1900-01-12"},{"$f":"IF($C$7=12,Calendar($C$5+1,1,13),Calendar($C$5,$C$7+1,13))","v":"1900-01-13"},{"$f":"IF($C$7=12,Calendar($C$5+1,1,14),Calendar($C$5,$C$7+1,14))","v":"1900-01-14"}]
[null,{"$f":"IF($C$7=12,Calendar($C$5+1,1,15),Calendar($C$5,$C$7+1,15))","v":"1900-01-15"},{"$f":"IF($C$7=12,Calendar($C$5+1,1,16),Calendar($C$5,$C$7+1,16))","v":"1900-01-16"},{"$f":"IF($C$7=12,Calendar($C$5+1,1,17),Calendar($C$5,$C$7+1,17))","v":"1900-01-17"},{"$f":"IF($C$7=12,Calendar($C$5+1,1,18),Calendar($C$5,$C$7+1,18))","v":"1900-01-18"},{"$f":"IF($C$7=12,Calendar($C$5+1,1,19),Calendar($C$5,$C$7+1,19))","v":"1900-01-19"},{"$f":"IF($C$7=12,Calendar($C$5+1,1,20),Calendar($C$5,$C$7+1,20))","v":"1900-01-20"},{"$f":"IF($C$7=12,Calendar($C$5+1,1,21),Calendar($C$5,$C$7+1,21))","v":"1900-01-21"},null,{"$f":"Calendar($C$5,$C$7,36)","v":""},{"$f":"IFERROR(IF(AND(J30<>\"\",VLOOKUP(DATE($C$5,$C$7,J30),_공휴일날짜,3,FALSE)<>\"\"),VLOOKUP(DATE($C$5,$C$7,J30),_공휴일날짜,3,FALSE),\"\"),\"\")","v":""},null,null,{"$f":"Calendar($C$5,$C$7,37)","v":""},{"$f":"IFERROR(IF(AND(N30<>\"\",VLOOKUP(DATE($C$5,$C$7,N30),_공휴일날짜,3,FALSE)<>\"\"),VLOOKUP(DATE($C$5,$C$7,N30),_공휴일날짜,3,FALSE),\"\"),\"\")","v":""}]
[null,{"$f":"IF($C$7=12,Calendar($C$5+1,1,22),Calendar($C$5,$C$7+1,22))","v":"1900-01-22"},{"$f":"IF($C$7=12,Calendar($C$5+1,1,23),Calendar($C$5,$C$7+1,23))","v":"1900-01-23"},{"$f":"IF($C$7=12,Calendar($C$5+1,1,24),Calendar($C$5,$C$7+1,24))","v":"1900-01-24"},{"$f":"IF($C$7=12,Calendar($C$5+1,1,25),Calendar($C$5,$C$7+1,25))","v":"1900-01-25"},{"$f":"IF($C$7=12,Calendar($C$5+1,1,26),Calendar($C$5,$C$7+1,26))","v":"1900-01-26"},{"$f":"IF($C$7=12,Calendar($C$5+1,1,27),Calendar($C$5,$C$7+1,27))","v":"1900-01-27"},{"$f":"IF($C$7=12,Calendar($C$5+1,1,28),Calendar($C$5,$C$7+1,28))","v":"1900-01-28"}]
[null,{"$f":"IF($C$7=12,Calendar($C$5+1,1,29),Calendar($C$5,$C$7+1,29))","v":"1900-01-29"},{"$f":"IF($C$7=12,Calendar($C$5+1,1,30),Calendar($C$5,$C$7+1,30))","v":"1900-01-30"},{"$f":"IF($C$7=12,Calendar($C$5+1,1,31),Calendar($C$5,$C$7+1,31))","v":""},{"$f":"IF($C$7=12,Calendar($C$5+1,1,32),Calendar($C$5,$C$7+1,32))","v":""},{"$f":"IF($C$7=12,Calendar($C$5+1,1,33),Calendar($C$5,$C$7+1,33))","v":""},{"$f":"IF($C$7=12,Calendar($C$5+1,1,34),Calendar($C$5,$C$7+1,34))","v":""},{"$f":"IF($C$7=12,Calendar($C$5+1,1,35),Calendar($C$5,$C$7+1,35))","v":""}]
[null,{"$f":"IF($C$7=12,Calendar($C$5+1,1,36),Calendar($C$5,$C$7+1,36))","v":""},{"$f":"IF($C$7=12,Calendar($C$5+1,1,37),Calendar($C$5,$C$7+1,37))","v":""}]

{"sheet":"6월","index":5,"n_rows":33,"n_cols":39,"rows_kept":33,"cut":false,"hidden":false,"merged":[[2,29,3,32],[2,33,3,36],[4,2,5,6],[4,10,4,12],[4,14,4,16],[4,18,4,20],[4,22,4,24],[4,26,4,28],[4,30,4,32],[4,34,4,36],[0,1,2,7],[2,9,3,12],[2,13,3,16],[2,17,3,20],[2,21,3,24],[2,25,3,28],[5,33,5,36],[6,2,11,6],[6,9,6,12],[6,13,6,16],[6,17,6,20],[6,21,6,24],[6,25,6,28],[6,29,6,32],[6,33,6,36],[8,9,8,12],[5,9,5,12],[5,13,5,16],[5,17,5,20],[5,21,5,24],[5,25,5,28],[5,29,5,32],[6,38,6,43],[7,9,7,12],[7,13,7,16],[7,17,7,20],[7,21,7,24],[7,25,7,28],[7,29,7,32],[7,33,7,36],[7,39,7,43],[8,39,8,43],[9,10,9,12],[9,14,9,16],[9,18,9,20],[9,22,9,24],[9,26,9,28],[9,30,9,32],[9,34,9,36],[9,39,9,43],[8,13,8,16],[8,17,8,20],[8,21,8,24],[8,25,8,28],[8,29,8,32],[8,33,8,36],[12,2,13,6],[12,9,12,12],[12,13,12,16],[12,17,12,20],[12,21,12,24],[12,25,12,28],[10,33,10,36],[10,39,10,43],[11,9,11,12],[11,13,11,16],[11,17,11,20],[11,21,11,24],[11,25,11,28],[11,29,11,32],[11,33,11,36],[11,39,11,43],[10,9,10,12],[10,13,10,16],[10,17,10,20],[10,21,10,24],[10,25,10,28],[10,29,10,32],[13,39,13,43],[14,10,14,12],[14,14,14,16],[14,18,14,20],[14,22,14,24],[14,26,14,28],[14,30,14,32],[14,34,14,36],[12,29,12,32],[12,33,12,36],[12,39,12,43],[13,9,13,12],[13,13,13,16],[13,17,13,20],[13,21,13,24],[13,25,13,28],[13,29,13,32],[13,33,13,36],[15,33,15,36],[16,1,16,3],[16,9,16,12],[16,13,16,16],[16,17,16,20],[16,21,16,24],[16,25,16,28],[16,29,16,32],[16,33,16,36],[15,9,15,12],[15,13,15,16],[15,17,15,20],[15,21,15,24],[15,25,15,28],[15,29,15,32],[16,38,16,43],[17,9,17,12],[17,13,17,16],[17,17,17,20],[17,21,17,24],[17,25,17,28],[17,29,17,32],[17,33,17,36],[17,38,17,43],[18,33,18,36],[18,38,18,43],[19,10,19,12],[19,14,19,16],[19,18,19,20],[19,22,19,24],[19,26,19,28],[19,30,19,32],[19,34,19,36],[19,38,19,43],[18,9,18,12],[18,13,18,16],[18,17,18,20],[18,21,18,24],[18,25,18,28],[18,29,18,32],[20,33,20,36],[20,38,20,43],[21,9,21,12],[21,13,21,16],[21,17,21,20],[21,21,21,24],[21,25,21,28],[21,29,21,32],[21,33,21,36],[21,38,21,43],[20,9,20,12],[20,13,20,16],[20,17,20,20],[20,21,20,24],[20,25,20,28],[20,29,20,32],[22,33,22,36],[22,38,22,43],[23,9,23,12],[23,13,23,16],[23,17,23,20],[23,21,23,24],[23,25,23,28],[23,29,23,32],[23,33,23,36],[23,38,23,43],[22,9,22,12],[22,13,22,16],[22,17,22,20],[22,21,22,24],[22,25,22,28],[22,29,22,32],[24,34,24,36],[24,38,24,43],[25,1,25,3],[25,9,25,12],[25,13,25,16],[25,17,25,20],[25,21,25,24],[25,25,25,28],[25,29,25,32],[25,33,25,36],[24,10,24,12],[24,14,24,16],[24,18,24,20],[24,22,24,24],[24,26,24,28],[24,30,24,32],[25,38,25,43],[26,9,26,12],[26,13,26,16],[26,17,26,20],[26,21,26,24],[26,25,26,28],[26,29,26,32],[26,33,26,36],[26,38,26,43],[27,33,27,36],[27,38,27,43],[28,9,28,12],[28,13,28,16],[28,17,28,20],[28,21,28,24],[28,25,28,28],[28,29,28,32],[28,33,28,36],[28,38,28,43],[27,9,27,12],[27,13,27,16],[27,17,27,20],[27,21,27,24],[27,25,27,28],[27,29,27,32],[33,9,33,12],[33,13,33,16],[31,9,31,12],[31,13,31,16],[31,38,31,43],[32,9,32,12],[32,13,32,16],[32,38,32,43],[29,10,29,12],[29,14,29,16],[29,38,29,43],[30,9,30,12],[30,13,30,16],[30,38,30,43]]}
[]
[]
[null,null,null,null,null,null,null,null,null,"일 Sunday",null,null,null,"월 Monday",null,null,null,"화 Tuesday",null,null,null,"수 Wednesday",null,null,null,"목 Thursday",null,null,null,"금 Friday",null,null,null,"토 Saturday"]
[]
[null,null,{"$f":"'달력 설정'!$B$2","v":2025},null,null,null,null,null,null,{"$f":"Calendar($C$5,$C$7,1)","v":"1900-01-01"},{"$f":"IFERROR(IF(AND(J5<>\"\",VLOOKUP(DATE($C$5,$C$7,J5),_공휴일날짜,3,FALSE)<>\"\"),VLOOKUP(DATE($C$5,$C$7,J5),_공휴일날짜,3,FALSE),\"\"),\"\")","v":""},null,null,{"$f":"Calendar($C$5,$C$7,2)","v":"1900-01-02"},{"$f":"IFERROR(IF(AND(N5<>\"\",VLOOKUP(DATE($C$5,$C$7,N5),_공휴일날짜,3,FALSE)<>\"\"),VLOOKUP(DATE($C$5,$C$7,N5),_공휴일날짜,3,FALSE),\"\"),\"\")","v":""},null,null,{"$f":"Calendar($C$5,$C$7,3)","v":"1900-01-03"},{"$f":"IFERROR(IF(AND(R5<>\"\",VLOOKUP(DATE($C$5,$C$7,R5),_공휴일날짜,3,FALSE)<>\"\"),VLOOKUP(DATE($C$5,$C$7,R5),_공휴일날짜,3,FALSE),\"\"),\"\")","v":""},null,null,{"$f":"Calendar($C$5,$C$7,4)","v":"1900-01-04"},{"$f":"IFERROR(IF(AND(V5<>\"\",VLOOKUP(DATE($C$5,$C$7,V5),_공휴일날짜,3,FALSE)<>\"\"),VLOOKUP(DATE($C$5,$C$7,V5),_공휴일날짜,3,FALSE),\"\"),\"\")","v":""},null,null,{"$f":"Calendar($C$5,$C$7,5)","v":"1900-01-05"},{"$f":"IFERROR(IF(AND(Z5<>\"\",VLOOKUP(DATE($C$5,$C$7,Z5),_공휴일날짜,3,FALSE)<>\"\"),VLOOKUP(DATE($C$5,$C$7,Z5),_공휴일날짜,3,FALSE),\"\"),\"\")","v":""},null,null,{"$f":"Calendar($C$5,$C$7,6)","v":"1900-01-06"},{"$f":"IFERROR(IF(AND(AD5<>\"\",VLOOKUP(DATE($C$5,$C$7,AD5),_공휴일날짜,3,FALSE)<>\"\"),VLOOKUP(DATE($C$5,$C$7,AD5),_공휴일날짜,3,FALSE),\"\"),\"\")","v":"현충일"},null,null,{"$f":"Calendar($C$5,$C$7,7)","v":"1900-01-07"},{"$f":"IFERROR(IF(AND(AH5<>\"\",VLOOKUP(DATE($C$5,$C$7,AH5),_공휴일날짜,3,FALSE)<>\"\"),VLOOKUP(DATE($C$5,$C$7,AH5),_공휴일날짜,3,FALSE),\"\"),\"\")","v":""}]
[]
[null,1,6,null,null,null,null,null,null,null,null,null,null,null,null,null,null,null,null,null,null,null,null,null,null,null,null,null,null,null,null,null,null,null,null,null,null,null,"Do It List"]
[null,null,null,null,null,null,null,null,null,null,null,null,null,null,null,null,null,null,null,null,null,null,null,null,null,null,null,null,null,null,null,null,null,null,null,null,null,null,false]
[null,null,null,null,null,null,null,null,null,null,null,null,null,null,null,null,null,null,null,null,null,null,null,null,null,null,null,null,null,null,null,null,null,null,null,null,null,null,false]
[null,null,null,null,null,null,null,null,null,{"$f":"Calendar($C$5,$C$7,8)","v":"1900-01-08"},{"$f":"IFERROR(IF(AND(J10<>\"\",VLOOKUP(DATE($C$5,$C$7,J10),_공휴일날짜,3,FALSE)<>\"\"),VLOOKUP(DATE($C$5,$C$7,J10),_공휴일날짜,3,FALSE),\"\"),\"\")","v":""},null,null,{"$f":"Calendar($C$5,$C$7,9)","v":"1900-01-09"},{"$f":"IFERROR(IF(AND(N10<>\"\",VLOOKUP(DATE($C$5,$C$7,N10),_공휴일날짜,3,FALSE)<>\"\"),VLOOKUP(DATE($C$5,$C$7,N10),_공휴일날짜,3,FALSE),\"\"),\"\")","v":""},null,null,{"$f":"Calendar($C$5,$C$7,10)","v":"1900-01-10"},{"$f":"IFERROR(IF(AND(R10<>\"\",VLOOKUP(DATE($C$5,$C$7,R10),_공휴일날짜,3,FALSE)<>\"\"),VLOOKUP(DATE($C$5,$C$7,R10),_공휴일날짜,3,FALSE),\"\"),\"\")","v":""},null,null,{"$f":"Calendar($C$5,$C$7,11)","v":"1900-01-11"},{"$f":"IFERROR(IF(AND(V10<>\"\",VLOOKUP(DATE($C$5,$C$7,V10),_공휴일날짜,3,FALSE)<>\"\"),VLOOKUP(DATE($C$5,$C$7,V10),_공휴일날짜,3,FALSE),\"\"),\"\")","v":""},null,null,{"$f":"Calendar($C$5,$C$7,12)","v":"1900-01-12"},{"$f":"IFERROR(IF(AND(Z10<>\"\",VLOOKUP(DATE($C$5,$C$7,Z10),_공휴일날짜,3,FALSE)<>\"\"),VLOOKUP(DATE($C$5,$C$7,Z10),_공휴일날짜,3,FALSE),\"\"),\"\")","v":""},null,null,{"$f":"Calendar($C$5,$C$7,13)","v":"1900-01-13"},{"$f":"IFERROR(IF(AND(AD10<>\"\",VLOOKUP(DATE($C$5,$C$7,AD10),_공휴일날짜,3,FALSE)<>\"\"),VLOOKUP(DATE($C$5,$C$7,AD10),_공휴일날짜,3,FALSE),\"\"),\"\")","v":""},null,null,{"$f":"Calendar($C$5,$C$7,14)","v":"1900-01-14"},{"$f":"IFERROR(IF(AND(AH10<>\"\",VLOOKUP(DATE($C$5,$C$7,AH10),_공휴일날짜,3,FALSE)<>\"\"),VLOOKUP(DATE($C$5,$C$7,AH10),_공휴일날짜,3,FALSE),\"\"),\"\")","v":""},null,null,null,false]
[null,null,null,null,null,null,null,null,null,null,null,null,null,null,null,null,null,null,null,null,null,null,null,null,null,null,null,null,null,null,null,null,null,null,null,null,null,null,false]
[null,null,null,null,null,null,null,null,null,null,null,null,null,null,null,null,null,null,null,null,null,null,null,null,null,null,null,null,null,null,null,null,null,null,null,null,null,null,false]
[null,null,{"$f":"VLOOKUP($C$7,'달력 설정'!$B$6:$C$17,2,FALSE)","v":"June"},null,null,null,null,null,null,null,null,null,null,null,null,null,null,null,null,null,null,null,null,null,null,null,null,null,null,null,null,null,null,null,null,null,null,null,false]
[null,null,null,null,null,null,null,null,null,null,null,null,null,null,null,null,null,null,null,null,null,null,null,null,null,null,null,null,null,null,null,null,null,null,null,null,null,null,false]
[null,null,null,null,null,null,null,null,null,{"$f":"Calendar($C$5,$C$7,15)","v":"1900-01-15"},{"$f":"IFERROR(IF(AND(J15<>\"\",VLOOKUP(DATE($C$5,$C$7,J15),_공휴일날짜,3,FALSE)<>\"\"),VLOOKUP(DATE($C$5,$C$7,J15),_공휴일날짜,3,FALSE),\"\"),\"\")","v":""},null,null,{"$f":"Calendar($C$5,$C$7,16)","v":"1900-01-16"},{"$f":"IFERROR(IF(AND(N15<>\"\",VLOOKUP(DATE($C$5,$C$7,N15),_공휴일날짜,3,FALSE)<>\"\"),VLOOKUP(DATE($C$5,$C$7,N15),_공휴일날짜,3,FALSE),\"\"),\"\")","v":""},null,null,{"$f":"Calendar($C$5,$C$7,17)","v":"1900-01-17"},{"$f":"IFERROR(IF(AND(R15<>\"\",VLOOKUP(DATE($C$5,$C$7,R15),_공휴일날짜,3,FALSE)<>\"\"),VLOOKUP(DATE($C$5,$C$7,R15),_공휴일날짜,3,FALSE),\"\"),\"\")","v":""},null,null,{"$f":"Calendar($C$5,$C$7,18)","v":"1900-01-18"},{"$f":"IFERROR(IF(AND(V15<>\"\",VLOOKUP(DATE($C$5,$C$7,V15),_공휴일날짜,3,FALSE)<>\"\"),VLOOKUP(DATE($C$5,$C$7,V15),_공휴일날짜,3,FALSE),\"\"),\"\")","v":""},null,null,{"$f":"Calendar($C$5,$C$7,19)","v":"1900-01-19"},{"$f":"IFERROR(IF(AND(Z15<>\"\",VLOOKUP(DATE($C$5,$C$7,Z15),_공휴일날짜,3,FALSE)<>\"\"),VLOOKUP(DATE($C$5,$C$7,Z15),_공휴일날짜,3,FALSE),\"\"),\"\")","v":""},null,null,{"$f":"Calendar($C$5,$C$7,20)","v":"1900-01-20"},{"$f":"IFERROR(IF(AND(AD15<>\"\",VLOOKUP(DATE($C$5,$C$7,AD15),_공휴일날짜,3,FALSE)<>\"\"),VLOOKUP(DATE($C$5,$C$7,AD15),_공휴일날짜,3,FALSE),\"\"),\"\")","v":""},null,null,{"$f":"Calendar($C$5,$C$7,21)","v":"1900-01-21"},{"$f":"IFERROR(IF(AND(AH15<>\"\",VLOOKUP(DATE($C$5,$C$7,AH15),_공휴일날짜,3,FALSE)<>\"\"),VLOOKUP(DATE($C$5,$C$7,AH15),_공휴일날짜,3,FALSE),\"\"),\"\")","v":""}]
[]
[null,{"$f":"VLOOKUP($E$17,'달력 설정'!$B$6:$C$17,2,FALSE)","v":"May"},null,null,{"$f":"IF($C$7=1,12,$C$7-1)","v":5},null,null,null,null,null,null,null,null,null,null,null,null,null,null,null,null,null,null,null,null,null,null,null,null,null,null,null,null,null,null,null,null,null,"MEMO"]
[null,"일","월","화","수","목","금","토"]
[null,{"$f":"IF($C$7=1,Calendar($C$5-1,12,1),Calendar($C$5,$C$7-1,1))","v":""},{"$f":"IF($C$7=1,Calendar($C$5-1,12,2),Calendar($C$5,$C$7-1,2))","v":""},{"$f":"IF($C$7=1,Calendar($C$5-1,12,3),Calendar($C$5,$C$7-1,3))","v":""},{"$f":"IF($C$7=1,Calendar($C$5-1,12,4),Calendar($C$5,$C$7-1,4))","v":""},{"$f":"IF($C$7=1,Calendar($C$5-1,12,5),Calendar($C$5,$C$7-1,5))","v":"1900-01-01"},{"$f":"IF($C$7=1,Calendar($C$5-1,12,6),Calendar($C$5,$C$7-1,6))","v":"1900-01-02"},{"$f":"IF($C$7=1,Calendar($C$5-1,12,7),Calendar($C$5,$C$7-1,7))","v":"1900-01-03"}]
[null,{"$f":"IF($C$7=1,Calendar($C$5-1,12,8),Calendar($C$5,$C$7-1,8))","v":"1900-01-04"},{"$f":"IF($C$7=1,Calendar($C$5-1,12,9),Calendar($C$5,$C$7-1,9))","v":"1900-01-05"},{"$f":"IF($C$7=1,Calendar($C$5-1,12,10),Calendar($C$5,$C$7-1,10))","v":"1900-01-06"},{"$f":"IF($C$7=1,Calendar($C$5-1,12,11),Calendar($C$5,$C$7-1,11))","v":"1900-01-07"},{"$f":"IF($C$7=1,Calendar($C$5-1,12,12),Calendar($C$5,$C$7-1,12))","v":"1900-01-08"},{"$f":"IF($C$7=1,Calendar($C$5-1,12,13),Calendar($C$5,$C$7-1,13))","v":"1900-01-09"},{"$f":"IF($C$7=1,Calendar($C$5-1,12,14),Calendar($C$5,$C$7-1,14))","v":"1900-01-10"},null,{"$f":"Calendar($C$5,$C$7,22)","v":"1900-01-22"},{"$f":"IFERROR(IF(AND(J20<>\"\",VLOOKUP(DATE($C$5,$C$7,J20),_공휴일날짜,3,FALSE)<>\"\"),VLOOKUP(DATE($C$5,$C$7,J20),_공휴일날짜,3,FALSE),\"\"),\"\")","v":""},null,null,{"$f":"Calendar($C$5,$C$7,23)","v":"1900-01-23"},{"$f":"IFERROR(IF(AND(N20<>\"\",VLOOKUP(DATE($C$5,$C$7,N20),_공휴일날짜,3,FALSE)<>\"\"),VLOOKUP(DATE($C$5,$C$7,N20),_공휴일날짜,3,FALSE),\"\"),\"\")","v":""},null,null,{"$f":"Calendar($C$5,$C$7,24)","v":"1900-01-24"},{"$f":"IFERROR(IF(AND(R20<>\"\",VLOOKUP(DATE($C$5,$C$7,R20),_공휴일날짜,3,FALSE)<>\"\"),VLOOKUP(DATE($C$5,$C$7,R20),_공휴일날짜,3,FALSE),\"\"),\"\")","v":""},null,null,{"$f":"Calendar($C$5,$C$7,25)","v":"1900-01-25"},{"$f":"IFERROR(IF(AND(V20<>\"\",VLOOKUP(DATE($C$5,$C$7,V20),_공휴일날짜,3,FALSE)<>\"\"),VLOOKUP(DATE($C$5,$C$7,V20),_공휴일날짜,3,FALSE),\"\"),\"\")","v":""},null,null,{"$f":"Calendar($C$5,$C$7,26)","v":"1900-01-26"},{"$f":"IFERROR(IF(AND(Z20<>\"\",VLOOKUP(DATE($C$5,$C$7,Z20),_공휴일날짜,3,FALSE)<>\"\"),VLOOKUP(DATE($C$5,$C$7,Z20),_공휴일날짜,3,FALSE),\"\"),\"\")","v":""},null,null,{"$f":"Calendar($C$5,$C$7,27)","v":"1900-01-27"},{"$f":"IFERROR(IF(AND(AD20<>\"\",VLOOKUP(DATE($C$5,$C$7,AD20),_공휴일날짜,3,FALSE)<>\"\"),VLOOKUP(DATE($C$5,$C$7,AD20),_공휴일날짜,3,FALSE),\"\"),\"\")","v":""},null,null,{"$f":"Calendar($C$5,$C$7,28)","v":"1900-01-28"},{"$f":"IFERROR(IF(AND(AH20<>\"\",VLOOKUP(DATE($C$5,$C$7,AH20),_공휴일날짜,3,FALSE)<>\"\"),VLOOKUP(DATE($C$5,$C$7,AH20),_공휴일날짜,3,FALSE),\"\"),\"\")","v":""}]
[null,{"$f":"IF($C$7=1,Calendar($C$5-1,12,15),Calendar($C$5,$C$7-1,15))","v":"1900-01-11"},{"$f":"IF($C$7=1,Calendar($C$5-1,12,16),Calendar($C$5,$C$7-1,16))","v":"1900-01-12"},{"$f":"IF($C$7=1,Calendar($C$5-1,12,17),Calendar($C$5,$C$7-1,17))","v":"1900-01-13"},{"$f":"IF($C$7=1,Calendar($C$5-1,12,18),Calendar($C$5,$C$7-1,18))","v":"1900-01-14"},{"$f":"IF($C$7=1,Calendar($C$5-1,12,19),Calendar($C$5,$C$7-1,19))","v":"1900-01-15"},{"$f":"IF($C$7=1,Calendar($C$5-1,12,20),Calendar($C$5,$C$7-1,20))","v":"1900-01-16"},{"$f":"IF($C$7=1,Calendar($C$5-1,12,21),Calendar($C$5,$C$7-1,21))","v":"1900-01-17"}]
[null,{"$f":"IF($C$7=1,Calendar($C$5-1,12,22),Calendar($C$5,$C$7-1,22))","v":"1900-01-18"},{"$f":"IF($C$7=1,Calendar($C$5-1,12,23),Calendar($C$5,$C$7-1,23))","v":"1900-01-19"},{"$f":"IF($C$7=1,Calendar($C$5-1,12,24),Calendar($C$5,$C$7-1,24))","v":"1900-01-20"},{"$f":"IF($C$7=1,Calendar($C$5-1,12,25),Calendar($C$5,$C$7-1,25))","v":"1900-01-21"},{"$f":"IF($C$7=1,Calendar($C$5-1,12,26),Calendar($C$5,$C$7-1,26))","v":"1900-01-22"},{"$f":"IF($C$7=1,Calendar($C$5-1,12,27),Calendar($C$5,$C$7-1,27))","v":"1900-01-23"},{"$f":"IF($C$7=1,Calendar($C$5-1,12,28),Calendar($C$5,$C$7-1,28))","v":"1900-01-24"}]
[null,{"$f":"IF($C$7=1,Calendar($C$5-1,12,29),Calendar($C$5,$C$7-1,29))","v":"1900-01-25"},{"$f":"IF($C$7=1,Calendar($C$5-1,12,30),Calendar($C$5,$C$7-1,30))","v":"1900-01-26"},{"$f":"IF($C$7=1,Calendar($C$5-1,12,31),Calendar($C$5,$C$7-1,31))","v":"1900-01-27"},{"$f":"IF($C$7=1,Calendar($C$5-1,12,32),Calendar($C$5,$C$7-1,32))","v":"1900-01-28"},{"$f":"IF($C$7=1,Calendar($C$5-1,12,33),Calendar($C$5,$C$7-1,33))","v":"1900-01-29"},{"$f":"IF($C$7=1,Calendar($C$5-1,12,34),Calendar($C$5,$C$7-1,34))","v":"1900-01-30"},{"$f":"IF($C$7=1,Calendar($C$5-1,12,35),Calendar($C$5,$C$7-1,35))","v":"1900-01-31"}]
[null,{"$f":"IF($C$7=1,Calendar($C$5-1,12,36),Calendar($C$5,$C$7-1,36))","v":""},{"$f":"IF($C$7=1,Calendar($C$5-1,12,37),Calendar($C$5,$C$7-1,37))","v":""}]
[null,null,null,null,null,null,null,null,null,{"$f":"Calendar($C$5,$C$7,29)","v":"1900-01-29"},{"$f":"IFERROR(IF(AND(J25<>\"\",VLOOKUP(DATE($C$5,$C$7,J25),_공휴일날짜,3,FALSE)<>\"\"),VLOOKUP(DATE($C$5,$C$7,J25),_공휴일날짜,3,FALSE),\"\"),\"\")","v":""},null,null,{"$f":"Calendar($C$5,$C$7,30)","v":"1900-01-30"},{"$f":"IFERROR(IF(AND(N25<>\"\",VLOOKUP(DATE($C$5,$C$7,N25),_공휴일날짜,3,FALSE)<>\"\"),VLOOKUP(DATE($C$5,$C$7,N25),_공휴일날짜,3,FALSE),\"\"),\"\")","v":""},null,null,{"$f":"Calendar($C$5,$C$7,31)","v":""},{"$f":"IFERROR(IF(AND(R25<>\"\",VLOOKUP(DATE($C$5,$C$7,R25),_공휴일날짜,3,FALSE)<>\"\"),VLOOKUP(DATE($C$5,$C$7,R25),_공휴일날짜,3,FALSE),\"\"),\"\")","v":""},null,null,{"$f":"Calendar($C$5,$C$7,32)","v":""},{"$f":"IFERROR(IF(AND(V25<>\"\",VLOOKUP(DATE($C$5,$C$7,V25),_공휴일날짜,3,FALSE)<>\"\"),VLOOKUP(DATE($C$5,$C$7,V25),_공휴일날짜,3,FALSE),\"\"),\"\")","v":""},null,null,{"$f":"Calendar($C$5,$C$7,33)","v":""},{"$f":"IFERROR(IF(AND(Z25<>\"\",VLOOKUP(DATE($C$5,$C$7,Z25),_공휴일날짜,3,FALSE)<>\"\"),VLOOKUP(DATE($C$5,$C$7,Z25),_공휴일날짜,3,FALSE),\"\"),\"\")","v":""},null,null,{"$f":"Calendar($C$5,$C$7,34)","v":""},{"$f":"IFERROR(IF(AND(AD25<>\"\",VLOOKUP(DATE($C$5,$C$7,AD25),_공휴일날짜,3,FALSE)<>\"\"),VLOOKUP(DATE($C$5,$C$7,AD25),_공휴일날짜,3,FALSE),\"\"),\"\")","v":""},null,null,{"$f":"Calendar($C$5,$C$7,35)","v":""},{"$f":"IFERROR(IF(AND(AH25<>\"\",VLOOKUP(DATE($C$5,$C$7,AH25),_공휴일날짜,3,FALSE)<>\"\"),VLOOKUP(DATE($C$5,$C$7,AH25),_공휴일날짜,3,FALSE),\"\"),\"\")","v":""}]
[null,{"$f":"VLOOKUP($E$26,'달력 설정'!$B$6:$C$17,2,FALSE)","v":"July"},null,null,{"$f":"IF($C$7=12,1,$C$7+1)","v":7}]
[null,"일","월","화","수","목","금","토"]
[null,{"$f":"IF($C$7=12,Calendar($C$5+1,1,1),Calendar($C$5,$C$7+1,1))","v":""},{"$f":"IF($C$7=12,Calendar($C$5+1,1,2),Calendar($C$5,$C$7+1,2))","v":""},{"$f":"IF($C$7=12,Calendar($C$5+1,1,3),Calendar($C$5,$C$7+1,3))","v":"1900-01-01"},{"$f":"IF($C$7=12,Calendar($C$5+1,1,4),Calendar($C$5,$C$7+1,4))","v":"1900-01-02"},{"$f":"IF($C$7=12,Calendar($C$5+1,1,5),Calendar($C$5,$C$7+1,5))","v":"1900-01-03"},{"$f":"IF($C$7=12,Calendar($C$5+1,1,6),Calendar($C$5,$C$7+1,6))","v":"1900-01-04"},{"$f":"IF($C$7=12,Calendar($C$5+1,1,7),Calendar($C$5,$C$7+1,7))","v":"1900-01-05"}]
[null,{"$f":"IF($C$7=12,Calendar($C$5+1,1,8),Calendar($C$5,$C$7+1,8))","v":"1900-01-06"},{"$f":"IF($C$7=12,Calendar($C$5+1,1,9),Calendar($C$5,$C$7+1,9))","v":"1900-01-07"},{"$f":"IF($C$7=12,Calendar($C$5+1,1,10),Calendar($C$5,$C$7+1,10))","v":"1900-01-08"},{"$f":"IF($C$7=12,Calendar($C$5+1,1,11),Calendar($C$5,$C$7+1,11))","v":"1900-01-09"},{"$f":"IF($C$7=12,Calendar($C$5+1,1,12),Calendar($C$5,$C$7+1,12))","v":"1900-01-10"},{"$f":"IF($C$7=12,Calendar($C$5+1,1,13),Calendar($C$5,$C$7+1,13))","v":"1900-01-11"},{"$f":"IF($C$7=12,Calendar($C$5+1,1,14),Calendar($C$5,$C$7+1,14))","v":"1900-01-12"}]
[null,{"$f":"IF($C$7=12,Calendar($C$5+1,1,15),Calendar($C$5,$C$7+1,15))","v":"1900-01-13"},{"$f":"IF($C$7=12,Calendar($C$5+1,1,16),Calendar($C$5,$C$7+1,16))","v":"1900-01-14"},{"$f":"IF($C$7=12,Calendar($C$5+1,1,17),Calendar($C$5,$C$7+1,17))","v":"1900-01-15"},{"$f":"IF($C$7=12,Calendar($C$5+1,1,18),Calendar($C$5,$C$7+1,18))","v":"1900-01-16"},{"$f":"IF($C$7=12,Calendar($C$5+1,1,19),Calendar($C$5,$C$7+1,19))","v":"1900-01-17"},{"$f":"IF($C$7=12,Calendar($C$5+1,1,20),Calendar($C$5,$C$7+1,20))","v":"1900-01-18"},{"$f":"IF($C$7=12,Calendar($C$5+1,1,21),Calendar($C$5,$C$7+1,21))","v":"1900-01-19"},null,{"$f":"Calendar($C$5,$C$7,36)","v":""},{"$f":"IFERROR(IF(AND(J30<>\"\",VLOOKUP(DATE($C$5,$C$7,J30),_공휴일날짜,3,FALSE)<>\"\"),VLOOKUP(DATE($C$5,$C$7,J30),_공휴일날짜,3,FALSE),\"\"),\"\")","v":""},null,null,{"$f":"Calendar($C$5,$C$7,37)","v":""},{"$f":"IFERROR(IF(AND(N30<>\"\",VLOOKUP(DATE($C$5,$C$7,N30),_공휴일날짜,3,FALSE)<>\"\"),VLOOKUP(DATE($C$5,$C$7,N30),_공휴일날짜,3,FALSE),\"\"),\"\")","v":""}]
[null,{"$f":"IF($C$7=12,Calendar($C$5+1,1,22),Calendar($C$5,$C$7+1,22))","v":"1900-01-20"},{"$f":"IF($C$7=12,Calendar($C$5+1,1,23),Calendar($C$5,$C$7+1,23))","v":"1900-01-21"},{"$f":"IF($C$7=12,Calendar($C$5+1,1,24),Calendar($C$5,$C$7+1,24))","v":"1900-01-22"},{"$f":"IF($C$7=12,Calendar($C$5+1,1,25),Calendar($C$5,$C$7+1,25))","v":"1900-01-23"},{"$f":"IF($C$7=12,Calendar($C$5+1,1,26),Calendar($C$5,$C$7+1,26))","v":"1900-01-24"},{"$f":"IF($C$7=12,Calendar($C$5+1,1,27),Calendar($C$5,$C$7+1,27))","v":"1900-01-25"},{"$f":"IF($C$7=12,Calendar($C$5+1,1,28),Calendar($C$5,$C$7+1,28))","v":"1900-01-26"}]
[null,{"$f":"IF($C$7=12,Calendar($C$5+1,1,29),Calendar($C$5,$C$7+1,29))","v":"1900-01-27"},{"$f":"IF($C$7=12,Calendar($C$5+1,1,30),Calendar($C$5,$C$7+1,30))","v":"1900-01-28"},{"$f":"IF($C$7=12,Calendar($C$5+1,1,31),Calendar($C$5,$C$7+1,31))","v":"1900-01-29"},{"$f":"IF($C$7=12,Calendar($C$5+1,1,32),Calendar($C$5,$C$7+1,32))","v":"1900-01-30"},{"$f":"IF($C$7=12,Calendar($C$5+1,1,33),Calendar($C$5,$C$7+1,33))","v":"1900-01-31"},{"$f":"IF($C$7=12,Calendar($C$5+1,1,34),Calendar($C$5,$C$7+1,34))","v":""},{"$f":"IF($C$7=12,Calendar($C$5+1,1,35),Calendar($C$5,$C$7+1,35))","v":""}]
[null,{"$f":"IF($C$7=12,Calendar($C$5+1,1,36),Calendar($C$5,$C$7+1,36))","v":""},{"$f":"IF($C$7=12,Calendar($C$5+1,1,37),Calendar($C$5,$C$7+1,37))","v":""}]

{"sheet":"7월","index":6,"n_rows":33,"n_cols":39,"rows_kept":33,"cut":false,"hidden":false,"merged":[[2,29,3,32],[2,33,3,36],[4,2,5,6],[4,10,4,12],[4,14,4,16],[4,18,4,20],[4,22,4,24],[4,26,4,28],[4,30,4,32],[4,34,4,36],[0,1,2,7],[2,9,3,12],[2,13,3,16],[2,17,3,20],[2,21,3,24],[2,25,3,28],[5,33,5,36],[6,2,11,6],[6,9,6,12],[6,13,6,16],[6,17,6,20],[6,21,6,24],[6,25,6,28],[6,29,6,32],[6,33,6,36],[8,9,8,12],[5,9,5,12],[5,13,5,16],[5,17,5,20],[5,21,5,24],[5,25,5,28],[5,29,5,32],[6,38,6,43],[7,9,7,12],[7,13,7,16],[7,17,7,20],[7,21,7,24],[7,25,7,28],[7,29,7,32],[7,33,7,36],[7,39,7,43],[8,39,8,43],[9,10,9,12],[9,14,9,16],[9,18,9,20],[9,22,9,24],[9,26,9,28],[9,30,9,32],[9,34,9,36],[9,39,9,43],[8,13,8,16],[8,17,8,20],[8,21,8,24],[8,25,8,28],[8,29,8,32],[8,33,8,36],[12,2,13,6],[12,9,12,12],[12,13,12,16],[12,17,12,20],[12,21,12,24],[12,25,12,28],[10,33,10,36],[10,39,10,43],[11,9,11,12],[11,13,11,16],[11,17,11,20],[11,21,11,24],[11,25,11,28],[11,29,11,32],[11,33,11,36],[11,39,11,43],[10,9,10,12],[10,13,10,16],[10,17,10,20],[10,21,10,24],[10,25,10,28],[10,29,10,32],[13,39,13,43],[14,10,14,12],[14,14,14,16],[14,18,14,20],[14,22,14,24],[14,26,14,28],[14,30,14,32],[14,34,14,36],[12,29,12,32],[12,33,12,36],[12,39,12,43],[13,9,13,12],[13,13,13,16],[13,17,13,20],[13,21,13,24],[13,25,13,28],[13,29,13,32],[13,33,13,36],[15,33,15,36],[16,1,16,3],[16,9,16,12],[16,13,16,16],[16,17,16,20],[16,21,16,24],[16,25,16,28],[16,29,16,32],[16,33,16,36],[15,9,15,12],[15,13,15,16],[15,17,15,20],[15,21,15,24],[15,25,15,28],[15,29,15,32],[16,38,16,43],[17,9,17,12],[17,13,17,16],[17,17,17,20],[17,21,17,24],[17,25,17,28],[17,29,17,32],[17,33,17,36],[17,38,17,43],[18,33,18,36],[18,38,18,43],[19,10,19,12],[19,14,19,16],[19,18,19,20],[19,22,19,24],[19,26,19,28],[19,30,19,32],[19,34,19,36],[19,38,19,43],[18,9,18,12],[18,13,18,16],[18,17,18,20],[18,21,18,24],[18,25,18,28],[18,29,18,32],[20,33,20,36],[20,38,20,43],[21,9,21,12],[21,13,21,16],[21,17,21,20],[21,21,21,24],[21,25,21,28],[21,29,21,32],[21,33,21,36],[21,38,21,43],[20,9,20,12],[20,13,20,16],[20,17,20,20],[20,21,20,24],[20,25,20,28],[20,29,20,32],[22,33,22,36],[22,38,22,43],[23,9,23,12],[23,13,23,16],[23,17,23,20],[23,21,23,24],[23,25,23,28],[23,29,23,32],[23,33,23,36],[23,38,23,43],[22,9,22,12],[22,13,22,16],[22,17,22,20],[22,21,22,24],[22,25,22,28],[22,29,22,32],[24,34,24,36],[24,38,24,43],[25,1,25,3],[25,9,25,12],[25,13,25,16],[25,17,25,20],[25,21,25,24],[25,25,25,28],[25,29,25,32],[25,33,25,36],[24,10,24,12],[24,14,24,16],[24,18,24,20],[24,22,24,24],[24,26,24,28],[24,30,24,32],[25,38,25,43],[26,9,26,12],[26,13,26,16],[26,17,26,20],[26,21,26,24],[26,25,26,28],[26,29,26,32],[26,33,26,36],[26,38,26,43],[27,33,27,36],[27,38,27,43],[28,9,28,12],[28,13,28,16],[28,17,28,20],[28,21,28,24],[28,25,28,28],[28,29,28,32],[28,33,28,36],[28,38,28,43],[27,9,27,12],[27,13,27,16],[27,17,27,20],[27,21,27,24],[27,25,27,28],[27,29,27,32],[33,9,33,12],[33,13,33,16],[31,9,31,12],[31,13,31,16],[31,38,31,43],[32,9,32,12],[32,13,32,16],[32,38,32,43],[29,10,29,12],[29,14,29,16],[29,38,29,43],[30,9,30,12],[30,13,30,16],[30,38,30,43]]}
[]
[]
[null,null,null,null,null,null,null,null,null,"일 Sunday",null,null,null,"월 Monday",null,null,null,"화 Tuesday",null,null,null,"수 Wednesday",null,null,null,"목 Thursday",null,null,null,"금 Friday",null,null,null,"토 Saturday"]
[]
[null,null,{"$f":"'달력 설정'!$B$2","v":2025},null,null,null,null,null,null,{"$f":"Calendar($C$5,$C$7,1)","v":""},{"$f":"IFERROR(IF(AND(J5<>\"\",VLOOKUP(DATE($C$5,$C$7,J5),_공휴일날짜,3,FALSE)<>\"\"),VLOOKUP(DATE($C$5,$C$7,J5),_공휴일날짜,3,FALSE),\"\"),\"\")","v":""},null,null,{"$f":"Calendar($C$5,$C$7,2)","v":""},{"$f":"IFERROR(IF(AND(N5<>\"\",VLOOKUP(DATE($C$5,$C$7,N5),_공휴일날짜,3,FALSE)<>\"\"),VLOOKUP(DATE($C$5,$C$7,N5),_공휴일날짜,3,FALSE),\"\"),\"\")","v":""},null,null,{"$f":"Calendar($C$5,$C$7,3)","v":"1900-01-01"},{"$f":"IFERROR(IF(AND(R5<>\"\",VLOOKUP(DATE($C$5,$C$7,R5),_공휴일날짜,3,FALSE)<>\"\"),VLOOKUP(DATE($C$5,$C$7,R5),_공휴일날짜,3,FALSE),\"\"),\"\")","v":""},null,null,{"$f":"Calendar($C$5,$C$7,4)","v":"1900-01-02"},{"$f":"IFERROR(IF(AND(V5<>\"\",VLOOKUP(DATE($C$5,$C$7,V5),_공휴일날짜,3,FALSE)<>\"\"),VLOOKUP(DATE($C$5,$C$7,V5),_공휴일날짜,3,FALSE),\"\"),\"\")","v":""},null,null,{"$f":"Calendar($C$5,$C$7,5)","v":"1900-01-03"},{"$f":"IFERROR(IF(AND(Z5<>\"\",VLOOKUP(DATE($C$5,$C$7,Z5),_공휴일날짜,3,FALSE)<>\"\"),VLOOKUP(DATE($C$5,$C$7,Z5),_공휴일날짜,3,FALSE),\"\"),\"\")","v":""},null,null,{"$f":"Calendar($C$5,$C$7,6)","v":"1900-01-04"},{"$f":"IFERROR(IF(AND(AD5<>\"\",VLOOKUP(DATE($C$5,$C$7,AD5),_공휴일날짜,3,FALSE)<>\"\"),VLOOKUP(DATE($C$5,$C$7,AD5),_공휴일날짜,3,FALSE),\"\"),\"\")","v":""},null,null,{"$f":"Calendar($C$5,$C$7,7)","v":"1900-01-05"},{"$f":"IFERROR(IF(AND(AH5<>\"\",VLOOKUP(DATE($C$5,$C$7,AH5),_공휴일날짜,3,FALSE)<>\"\"),VLOOKUP(DATE($C$5,$C$7,AH5),_공휴일날짜,3,FALSE),\"\"),\"\")","v":""}]
[]
[null,1,7,null,null,null,null,null,null,null,null,null,null,null,null,null,null,null,null,null,null,null,null,null,null,null,null,null,null,null,null,null,null,null,null,null,null,null,"Do It List"]
[null,null,null,null,null,null,null,null,null,null,null,null,null,null,null,null,null,null,null,null,null,null,null,null,null,null,null,null,null,null,null,null,null,null,null,null,null,null,false]
[null,null,null,null,null,null,null,null,null,null,null,null,null,null,null,null,null,null,null,null,null,null,null,null,null,null,null,null,null,null,null,null,null,null,null,null,null,null,false]
[null,null,null,null,null,null,null,null,null,{"$f":"Calendar($C$5,$C$7,8)","v":"1900-01-06"},{"$f":"IFERROR(IF(AND(J10<>\"\",VLOOKUP(DATE($C$5,$C$7,J10),_공휴일날짜,3,FALSE)<>\"\"),VLOOKUP(DATE($C$5,$C$7,J10),_공휴일날짜,3,FALSE),\"\"),\"\")","v":""},null,null,{"$f":"Calendar($C$5,$C$7,9)","v":"1900-01-07"},{"$f":"IFERROR(IF(AND(N10<>\"\",VLOOKUP(DATE($C$5,$C$7,N10),_공휴일날짜,3,FALSE)<>\"\"),VLOOKUP(DATE($C$5,$C$7,N10),_공휴일날짜,3,FALSE),\"\"),\"\")","v":""},null,null,{"$f":"Calendar($C$5,$C$7,10)","v":"1900-01-08"},{"$f":"IFERROR(IF(AND(R10<>\"\",VLOOKUP(DATE($C$5,$C$7,R10),_공휴일날짜,3,FALSE)<>\"\"),VLOOKUP(DATE($C$5,$C$7,R10),_공휴일날짜,3,FALSE),\"\"),\"\")","v":""},null,null,{"$f":"Calendar($C$5,$C$7,11)","v":"1900-01-09"},{"$f":"IFERROR(IF(AND(V10<>\"\",VLOOKUP(DATE($C$5,$C$7,V10),_공휴일날짜,3,FALSE)<>\"\"),VLOOKUP(DATE($C$5,$C$7,V10),_공휴일날짜,3,FALSE),\"\"),\"\")","v":""},null,null,{"$f":"Calendar($C$5,$C$7,12)","v":"1900-01-10"},{"$f":"IFERROR(IF(AND(Z10<>\"\",VLOOKUP(DATE($C$5,$C$7,Z10),_공휴일날짜,3,FALSE)<>\"\"),VLOOKUP(DATE($C$5,$C$7,Z10),_공휴일날짜,3,FALSE),\"\"),\"\")","v":""},null,null,{"$f":"Calendar($C$5,$C$7,13)","v":"1900-01-11"},{"$f":"IFERROR(IF(AND(AD10<>\"\",VLOOKUP(DATE($C$5,$C$7,AD10),_공휴일날짜,3,FALSE)<>\"\"),VLOOKUP(DATE($C$5,$C$7,AD10),_공휴일날짜,3,FALSE),\"\"),\"\")","v":""},null,null,{"$f":"Calendar($C$5,$C$7,14)","v":"1900-01-12"},{"$f":"IFERROR(IF(AND(AH10<>\"\",VLOOKUP(DATE($C$5,$C$7,AH10),_공휴일날짜,3,FALSE)<>\"\"),VLOOKUP(DATE($C$5,$C$7,AH10),_공휴일날짜,3,FALSE),\"\"),\"\")","v":""},null,null,null,false]
[null,null,null,null,null,null,null,null,null,null,null,null,null,null,null,null,null,null,null,null,null,null,null,null,null,null,null,null,null,null,null,null,null,null,null,null,null,null,false]
[null,null,null,null,null,null,null,null,null,null,null,null,null,null,null,null,null,null,null,null,null,null,null,null,null,null,null,null,null,null,null,null,null,null,null,null,null,null,false]
[null,null,{"$f":"VLOOKUP($C$7,'달력 설정'!$B$6:$C$17,2,FALSE)","v":"July"},null,null,null,null,null,null,null,null,null,null,null,null,null,null,null,null,null,null,null,null,null,null,null,null,null,null,null,null,null,null,null,null,null,null,null,false]
[null,null,null,null,null,null,null,null,null,null,null,null,null,null,null,null,null,null,null,null,null,null,null,null,null,null,null,null,null,null,null,null,null,null,null,null,null,null,false]
[null,null,null,null,null,null,null,null,null,{"$f":"Calendar($C$5,$C$7,15)","v":"1900-01-13"},{"$f":"IFERROR(IF(AND(J15<>\"\",VLOOKUP(DATE($C$5,$C$7,J15),_공휴일날짜,3,FALSE)<>\"\"),VLOOKUP(DATE($C$5,$C$7,J15),_공휴일날짜,3,FALSE),\"\"),\"\")","v":""},null,null,{"$f":"Calendar($C$5,$C$7,16)","v":"1900-01-14"},{"$f":"IFERROR(IF(AND(N15<>\"\",VLOOKUP(DATE($C$5,$C$7,N15),_공휴일날짜,3,FALSE)<>\"\"),VLOOKUP(DATE($C$5,$C$7,N15),_공휴일날짜,3,FALSE),\"\"),\"\")","v":""},null,null,{"$f":"Calendar($C$5,$C$7,17)","v":"1900-01-15"},{"$f":"IFERROR(IF(AND(R15<>\"\",VLOOKUP(DATE($C$5,$C$7,R15),_공휴일날짜,3,FALSE)<>\"\"),VLOOKUP(DATE($C$5,$C$7,R15),_공휴일날짜,3,FALSE),\"\"),\"\")","v":""},null,null,{"$f":"Calendar($C$5,$C$7,18)","v":"1900-01-16"},{"$f":"IFERROR(IF(AND(V15<>\"\",VLOOKUP(DATE($C$5,$C$7,V15),_공휴일날짜,3,FALSE)<>\"\"),VLOOKUP(DATE($C$5,$C$7,V15),_공휴일날짜,3,FALSE),\"\"),\"\")","v":""},null,null,{"$f":"Calendar($C$5,$C$7,19)","v":"1900-01-17"},{"$f":"IFERROR(IF(AND(Z15<>\"\",VLOOKUP(DATE($C$5,$C$7,Z15),_공휴일날짜,3,FALSE)<>\"\"),VLOOKUP(DATE($C$5,$C$7,Z15),_공휴일날짜,3,FALSE),\"\"),\"\")","v":""},null,null,{"$f":"Calendar($C$5,$C$7,20)","v":"1900-01-18"},{"$f":"IFERROR(IF(AND(AD15<>\"\",VLOOKUP(DATE($C$5,$C$7,AD15),_공휴일날짜,3,FALSE)<>\"\"),VLOOKUP(DATE($C$5,$C$7,AD15),_공휴일날짜,3,FALSE),\"\"),\"\")","v":""},null,null,{"$f":"Calendar($C$5,$C$7,21)","v":"1900-01-19"},{"$f":"IFERROR(IF(AND(AH15<>\"\",VLOOKUP(DATE($C$5,$C$7,AH15),_공휴일날짜,3,FALSE)<>\"\"),VLOOKUP(DATE($C$5,$C$7,AH15),_공휴일날짜,3,FALSE),\"\"),\"\")","v":""}]
[]
[null,{"$f":"VLOOKUP($E$17,'달력 설정'!$B$6:$C$17,2,FALSE)","v":"June"},null,null,{"$f":"IF($C$7=1,12,$C$7-1)","v":6},null,null,null,null,null,null,null,null,null,null,null,null,null,null,null,null,null,null,null,null,null,null,null,null,null,null,null,null,null,null,null,null,null,"MEMO"]
[null,"일","월","화","수","목","금","토"]
[null,{"$f":"IF($C$7=1,Calendar($C$5-1,12,1),Calendar($C$5,$C$7-1,1))","v":"1900-01-01"},{"$f":"IF($C$7=1,Calendar($C$5-1,12,2),Calendar($C$5,$C$7-1,2))","v":"1900-01-02"},{"$f":"IF($C$7=1,Calendar($C$5-1,12,3),Calendar($C$5,$C$7-1,3))","v":"1900-01-03"},{"$f":"IF($C$7=1,Calendar($C$5-1,12,4),Calendar($C$5,$C$7-1,4))","v":"1900-01-04"},{"$f":"IF($C$7=1,Calendar($C$5-1,12,5),Calendar($C$5,$C$7-1,5))","v":"1900-01-05"},{"$f":"IF($C$7=1,Calendar($C$5-1,12,6),Calendar($C$5,$C$7-1,6))","v":"1900-01-06"},{"$f":"IF($C$7=1,Calendar($C$5-1,12,7),Calendar($C$5,$C$7-1,7))","v":"1900-01-07"}]
[null,{"$f":"IF($C$7=1,Calendar($C$5-1,12,8),Calendar($C$5,$C$7-1,8))","v":"1900-01-08"},{"$f":"IF($C$7=1,Calendar($C$5-1,12,9),Calendar($C$5,$C$7-1,9))","v":"1900-01-09"},{"$f":"IF($C$7=1,Calendar($C$5-1,12,10),Calendar($C$5,$C$7-1,10))","v":"1900-01-10"},{"$f":"IF($C$7=1,Calendar($C$5-1,12,11),Calendar($C$5,$C$7-1,11))","v":"1900-01-11"},{"$f":"IF($C$7=1,Calendar($C$5-1,12,12),Calendar($C$5,$C$7-1,12))","v":"1900-01-12"},{"$f":"IF($C$7=1,Calendar($C$5-1,12,13),Calendar($C$5,$C$7-1,13))","v":"1900-01-13"},{"$f":"IF($C$7=1,Calendar($C$5-1,12,14),Calendar($C$5,$C$7-1,14))","v":"1900-01-14"},null,{"$f":"Calendar($C$5,$C$7,22)","v":"1900-01-20"},{"$f":"IFERROR(IF(AND(J20<>\"\",VLOOKUP(DATE($C$5,$C$7,J20),_공휴일날짜,3,FALSE)<>\"\"),VLOOKUP(DATE($C$5,$C$7,J20),_공휴일날짜,3,FALSE),\"\"),\"\")","v":""},null,null,{"$f":"Calendar($C$5,$C$7,23)","v":"1900-01-21"},{"$f":"IFERROR(IF(AND(N20<>\"\",VLOOKUP(DATE($C$5,$C$7,N20),_공휴일날짜,3,FALSE)<>\"\"),VLOOKUP(DATE($C$5,$C$7,N20),_공휴일날짜,3,FALSE),\"\"),\"\")","v":""},null,null,{"$f":"Calendar($C$5,$C$7,24)","v":"1900-01-22"},{"$f":"IFERROR(IF(AND(R20<>\"\",VLOOKUP(DATE($C$5,$C$7,R20),_공휴일날짜,3,FALSE)<>\"\"),VLOOKUP(DATE($C$5,$C$7,R20),_공휴일날짜,3,FALSE),\"\"),\"\")","v":""},null,null,{"$f":"Calendar($C$5,$C$7,25)","v":"1900-01-23"},{"$f":"IFERROR(IF(AND(V20<>\"\",VLOOKUP(DATE($C$5,$C$7,V20),_공휴일날짜,3,FALSE)<>\"\"),VLOOKUP(DATE($C$5,$C$7,V20),_공휴일날짜,3,FALSE),\"\"),\"\")","v":""},null,null,{"$f":"Calendar($C$5,$C$7,26)","v":"1900-01-24"},{"$f":"IFERROR(IF(AND(Z20<>\"\",VLOOKUP(DATE($C$5,$C$7,Z20),_공휴일날짜,3,FALSE)<>\"\"),VLOOKUP(DATE($C$5,$C$7,Z20),_공휴일날짜,3,FALSE),\"\"),\"\")","v":""},null,null,{"$f":"Calendar($C$5,$C$7,27)","v":"1900-01-25"},{"$f":"IFERROR(IF(AND(AD20<>\"\",VLOOKUP(DATE($C$5,$C$7,AD20),_공휴일날짜,3,FALSE)<>\"\"),VLOOKUP(DATE($C$5,$C$7,AD20),_공휴일날짜,3,FALSE),\"\"),\"\")","v":""},null,null,{"$f":"Calendar($C$5,$C$7,28)","v":"1900-01-26"},{"$f":"IFERROR(IF(AND(AH20<>\"\",VLOOKUP(DATE($C$5,$C$7,AH20),_공휴일날짜,3,FALSE)<>\"\"),VLOOKUP(DATE($C$5,$C$7,AH20),_공휴일날짜,3,FALSE),\"\"),\"\")","v":""}]
[null,{"$f":"IF($C$7=1,Calendar($C$5-1,12,15),Calendar($C$5,$C$7-1,15))","v":"1900-01-15"},{"$f":"IF($C$7=1,Calendar($C$5-1,12,16),Calendar($C$5,$C$7-1,16))","v":"1900-01-16"},{"$f":"IF($C$7=1,Calendar($C$5-1,12,17),Calendar($C$5,$C$7-1,17))","v":"1900-01-17"},{"$f":"IF($C$7=1,Calendar($C$5-1,12,18),Calendar($C$5,$C$7-1,18))","v":"1900-01-18"},{"$f":"IF($C$7=1,Calendar($C$5-1,12,19),Calendar($C$5,$C$7-1,19))","v":"1900-01-19"},{"$f":"IF($C$7=1,Calendar($C$5-1,12,20),Calendar($C$5,$C$7-1,20))","v":"1900-01-20"},{"$f":"IF($C$7=1,Calendar($C$5-1,12,21),Calendar($C$5,$C$7-1,21))","v":"1900-01-21"}]
[null,{"$f":"IF($C$7=1,Calendar($C$5-1,12,22),Calendar($C$5,$C$7-1,22))","v":"1900-01-22"},{"$f":"IF($C$7=1,Calendar($C$5-1,12,23),Calendar($C$5,$C$7-1,23))","v":"1900-01-23"},{"$f":"IF($C$7=1,Calendar($C$5-1,12,24),Calendar($C$5,$C$7-1,24))","v":"1900-01-24"},{"$f":"IF($C$7=1,Calendar($C$5-1,12,25),Calendar($C$5,$C$7-1,25))","v":"1900-01-25"},{"$f":"IF($C$7=1,Calendar($C$5-1,12,26),Calendar($C$5,$C$7-1,26))","v":"1900-01-26"},{"$f":"IF($C$7=1,Calendar($C$5-1,12,27),Calendar($C$5,$C$7-1,27))","v":"1900-01-27"},{"$f":"IF($C$7=1,Calendar($C$5-1,12,28),Calendar($C$5,$C$7-1,28))","v":"1900-01-28"}]
[null,{"$f":"IF($C$7=1,Calendar($C$5-1,12,29),Calendar($C$5,$C$7-1,29))","v":"1900-01-29"},{"$f":"IF($C$7=1,Calendar($C$5-1,12,30),Calendar($C$5,$C$7-1,30))","v":"1900-01-30"},{"$f":"IF($C$7=1,Calendar($C$5-1,12,31),Calendar($C$5,$C$7-1,31))","v":""},{"$f":"IF($C$7=1,Calendar($C$5-1,12,32),Calendar($C$5,$C$7-1,32))","v":""},{"$f":"IF($C$7=1,Calendar($C$5-1,12,33),Calendar($C$5,$C$7-1,33))","v":""},{"$f":"IF($C$7=1,Calendar($C$5-1,12,34),Calendar($C$5,$C$7-1,34))","v":""},{"$f":"IF($C$7=1,Calendar($C$5-1,12,35),Calendar($C$5,$C$7-1,35))","v":""}]
[null,{"$f":"IF($C$7=1,Calendar($C$5-1,12,36),Calendar($C$5,$C$7-1,36))","v":""},{"$f":"IF($C$7=1,Calendar($C$5-1,12,37),Calendar($C$5,$C$7-1,37))","v":""}]
[null,null,null,null,null,null,null,null,null,{"$f":"Calendar($C$5,$C$7,29)","v":"1900-01-27"},{"$f":"IFERROR(IF(AND(J25<>\"\",VLOOKUP(DATE($C$5,$C$7,J25),_공휴일날짜,3,FALSE)<>\"\"),VLOOKUP(DATE($C$5,$C$7,J25),_공휴일날짜,3,FALSE),\"\"),\"\")","v":""},null,null,{"$f":"Calendar($C$5,$C$7,30)","v":"1900-01-28"},{"$f":"IFERROR(IF(AND(N25<>\"\",VLOOKUP(DATE($C$5,$C$7,N25),_공휴일날짜,3,FALSE)<>\"\"),VLOOKUP(DATE($C$5,$C$7,N25),_공휴일날짜,3,FALSE),\"\"),\"\")","v":""},null,null,{"$f":"Calendar($C$5,$C$7,31)","v":"1900-01-29"},{"$f":"IFERROR(IF(AND(R25<>\"\",VLOOKUP(DATE($C$5,$C$7,R25),_공휴일날짜,3,FALSE)<>\"\"),VLOOKUP(DATE($C$5,$C$7,R25),_공휴일날짜,3,FALSE),\"\"),\"\")","v":""},null,null,{"$f":"Calendar($C$5,$C$7,32)","v":"1900-01-30"},{"$f":"IFERROR(IF(AND(V25<>\"\",VLOOKUP(DATE($C$5,$C$7,V25),_공휴일날짜,3,FALSE)<>\"\"),VLOOKUP(DATE($C$5,$C$7,V25),_공휴일날짜,3,FALSE),\"\"),\"\")","v":""},null,null,{"$f":"Calendar($C$5,$C$7,33)","v":"1900-01-31"},{"$f":"IFERROR(IF(AND(Z25<>\"\",VLOOKUP(DATE($C$5,$C$7,Z25),_공휴일날짜,3,FALSE)<>\"\"),VLOOKUP(DATE($C$5,$C$7,Z25),_공휴일날짜,3,FALSE),\"\"),\"\")","v":""},null,null,{"$f":"Calendar($C$5,$C$7,34)","v":""},{"$f":"IFERROR(IF(AND(AD25<>\"\",VLOOKUP(DATE($C$5,$C$7,AD25),_공휴일날짜,3,FALSE)<>\"\"),VLOOKUP(DATE($C$5,$C$7,AD25),_공휴일날짜,3,FALSE),\"\"),\"\")","v":""},null,null,{"$f":"Calendar($C$5,$C$7,35)","v":""},{"$f":"IFERROR(IF(AND(AH25<>\"\",VLOOKUP(DATE($C$5,$C$7,AH25),_공휴일날짜,3,FALSE)<>\"\"),VLOOKUP(DATE($C$5,$C$7,AH25),_공휴일날짜,3,FALSE),\"\"),\"\")","v":""}]
[null,{"$f":"VLOOKUP($E$26,'달력 설정'!$B$6:$C$17,2,FALSE)","v":"August"},null,null,{"$f":"IF($C$7=12,1,$C$7+1)","v":8}]
[null,"일","월","화","수","목","금","토"]
[null,{"$f":"IF($C$7=12,Calendar($C$5+1,1,1),Calendar($C$5,$C$7+1,1))","v":""},{"$f":"IF($C$7=12,Calendar($C$5+1,1,2),Calendar($C$5,$C$7+1,2))","v":""},{"$f":"IF($C$7=12,Calendar($C$5+1,1,3),Calendar($C$5,$C$7+1,3))","v":""},{"$f":"IF($C$7=12,Calendar($C$5+1,1,4),Calendar($C$5,$C$7+1,4))","v":""},{"$f":"IF($C$7=12,Calendar($C$5+1,1,5),Calendar($C$5,$C$7+1,5))","v":""},{"$f":"IF($C$7=12,Calendar($C$5+1,1,6),Calendar($C$5,$C$7+1,6))","v":"1900-01-01"},{"$f":"IF($C$7=12,Calendar($C$5+1,1,7),Calendar($C$5,$C$7+1,7))","v":"1900-01-02"}]
[null,{"$f":"IF($C$7=12,Calendar($C$5+1,1,8),Calendar($C$5,$C$7+1,8))","v":"1900-01-03"},{"$f":"IF($C$7=12,Calendar($C$5+1,1,9),Calendar($C$5,$C$7+1,9))","v":"1900-01-04"},{"$f":"IF($C$7=12,Calendar($C$5+1,1,10),Calendar($C$5,$C$7+1,10))","v":"1900-01-05"},{"$f":"IF($C$7=12,Calendar($C$5+1,1,11),Calendar($C$5,$C$7+1,11))","v":"1900-01-06"},{"$f":"IF($C$7=12,Calendar($C$5+1,1,12),Calendar($C$5,$C$7+1,12))","v":"1900-01-07"},{"$f":"IF($C$7=12,Calendar($C$5+1,1,13),Calendar($C$5,$C$7+1,13))","v":"1900-01-08"},{"$f":"IF($C$7=12,Calendar($C$5+1,1,14),Calendar($C$5,$C$7+1,14))","v":"1900-01-09"}]
[null,{"$f":"IF($C$7=12,Calendar($C$5+1,1,15),Calendar($C$5,$C$7+1,15))","v":"1900-01-10"},{"$f":"IF($C$7=12,Calendar($C$5+1,1,16),Calendar($C$5,$C$7+1,16))","v":"1900-01-11"},{"$f":"IF($C$7=12,Calendar($C$5+1,1,17),Calendar($C$5,$C$7+1,17))","v":"1900-01-12"},{"$f":"IF($C$7=12,Calendar($C$5+1,1,18),Calendar($C$5,$C$7+1,18))","v":"1900-01-13"},{"$f":"IF($C$7=12,Calendar($C$5+1,1,19),Calendar($C$5,$C$7+1,19))","v":"1900-01-14"},{"$f":"IF($C$7=12,Calendar($C$5+1,1,20),Calendar($C$5,$C$7+1,20))","v":"1900-01-15"},{"$f":"IF($C$7=12,Calendar($C$5+1,1,21),Calendar($C$5,$C$7+1,21))","v":"1900-01-16"},null,{"$f":"Calendar($C$5,$C$7,36)","v":""},{"$f":"IFERROR(IF(AND(J30<>\"\",VLOOKUP(DATE($C$5,$C$7,J30),_공휴일날짜,3,FALSE)<>\"\"),VLOOKUP(DATE($C$5,$C$7,J30),_공휴일날짜,3,FALSE),\"\"),\"\")","v":""},null,null,{"$f":"Calendar($C$5,$C$7,37)","v":""},{"$f":"IFERROR(IF(AND(N30<>\"\",VLOOKUP(DATE($C$5,$C$7,N30),_공휴일날짜,3,FALSE)<>\"\"),VLOOKUP(DATE($C$5,$C$7,N30),_공휴일날짜,3,FALSE),\"\"),\"\")","v":""}]
[null,{"$f":"IF($C$7=12,Calendar($C$5+1,1,22),Calendar($C$5,$C$7+1,22))","v":"1900-01-17"},{"$f":"IF($C$7=12,Calendar($C$5+1,1,23),Calendar($C$5,$C$7+1,23))","v":"1900-01-18"},{"$f":"IF($C$7=12,Calendar($C$5+1,1,24),Calendar($C$5,$C$7+1,24))","v":"1900-01-19"},{"$f":"IF($C$7=12,Calendar($C$5+1,1,25),Calendar($C$5,$C$7+1,25))","v":"1900-01-20"},{"$f":"IF($C$7=12,Calendar($C$5+1,1,26),Calendar($C$5,$C$7+1,26))","v":"1900-01-21"},{"$f":"IF($C$7=12,Calendar($C$5+1,1,27),Calendar($C$5,$C$7+1,27))","v":"1900-01-22"},{"$f":"IF($C$7=12,Calendar($C$5+1,1,28),Calendar($C$5,$C$7+1,28))","v":"1900-01-23"}]
[null,{"$f":"IF($C$7=12,Calendar($C$5+1,1,29),Calendar($C$5,$C$7+1,29))","v":"1900-01-24"},{"$f":"IF($C$7=12,Calendar($C$5+1,1,30),Calendar($C$5,$C$7+1,30))","v":"1900-01-25"},{"$f":"IF($C$7=12,Calendar($C$5+1,1,31),Calendar($C$5,$C$7+1,31))","v":"1900-01-26"},{"$f":"IF($C$7=12,Calendar($C$5+1,1,32),Calendar($C$5,$C$7+1,32))","v":"1900-01-27"},{"$f":"IF($C$7=12,Calendar($C$5+1,1,33),Calendar($C$5,$C$7+1,33))","v":"1900-01-28"},{"$f":"IF($C$7=12,Calendar($C$5+1,1,34),Calendar($C$5,$C$7+1,34))","v":"1900-01-29"},{"$f":"IF($C$7=12,Calendar($C$5+1,1,35),Calendar($C$5,$C$7+1,35))","v":"1900-01-30"}]
[null,{"$f":"IF($C$7=12,Calendar($C$5+1,1,36),Calendar($C$5,$C$7+1,36))","v":"1900-01-31"},{"$f":"IF($C$7=12,Calendar($C$5+1,1,37),Calendar($C$5,$C$7+1,37))","v":""}]

{"sheet":"8월","index":7,"n_rows":33,"n_cols":39,"rows_kept":33,"cut":false,"hidden":false,"merged":[[2,29,3,32],[2,33,3,36],[4,2,5,6],[4,10,4,12],[4,14,4,16],[4,18,4,20],[4,22,4,24],[4,26,4,28],[4,30,4,32],[4,34,4,36],[0,1,2,7],[2,9,3,12],[2,13,3,16],[2,17,3,20],[2,21,3,24],[2,25,3,28],[5,33,5,36],[6,2,11,6],[6,9,6,12],[6,13,6,16],[6,17,6,20],[6,21,6,24],[6,25,6,28],[6,29,6,32],[6,33,6,36],[8,9,8,12],[5,9,5,12],[5,13,5,16],[5,17,5,20],[5,21,5,24],[5,25,5,28],[5,29,5,32],[6,38,6,43],[7,9,7,12],[7,13,7,16],[7,17,7,20],[7,21,7,24],[7,25,7,28],[7,29,7,32],[7,33,7,36],[7,39,7,43],[8,39,8,43],[9,10,9,12],[9,14,9,16],[9,18,9,20],[9,22,9,24],[9,26,9,28],[9,30,9,32],[9,34,9,36],[9,39,9,43],[8,13,8,16],[8,17,8,20],[8,21,8,24],[8,25,8,28],[8,29,8,32],[8,33,8,36],[12,2,13,6],[12,9,12,12],[12,13,12,16],[12,17,12,20],[12,21,12,24],[12,25,12,28],[10,33,10,36],[10,39,10,43],[11,9,11,12],[11,13,11,16],[11,17,11,20],[11,21,11,24],[11,25,11,28],[11,29,11,32],[11,33,11,36],[11,39,11,43],[10,9,10,12],[10,13,10,16],[10,17,10,20],[10,21,10,24],[10,25,10,28],[10,29,10,32],[13,39,13,43],[14,10,14,12],[14,14,14,16],[14,18,14,20],[14,22,14,24],[14,26,14,28],[14,30,14,32],[14,34,14,36],[12,29,12,32],[12,33,12,36],[12,39,12,43],[13,9,13,12],[13,13,13,16],[13,17,13,20],[13,21,13,24],[13,25,13,28],[13,29,13,32],[13,33,13,36],[15,33,15,36],[16,1,16,3],[16,9,16,12],[16,13,16,16],[16,17,16,20],[16,21,16,24],[16,25,16,28],[16,29,16,32],[16,33,16,36],[15,9,15,12],[15,13,15,16],[15,17,15,20],[15,21,15,24],[15,25,15,28],[15,29,15,32],[16,38,16,43],[17,9,17,12],[17,13,17,16],[17,17,17,20],[17,21,17,24],[17,25,17,28],[17,29,17,32],[17,33,17,36],[17,38,17,43],[18,33,18,36],[18,38,18,43],[19,10,19,12],[19,14,19,16],[19,18,19,20],[19,22,19,24],[19,26,19,28],[19,30,19,32],[19,34,19,36],[19,38,19,43],[18,9,18,12],[18,13,18,16],[18,17,18,20],[18,21,18,24],[18,25,18,28],[18,29,18,32],[20,33,20,36],[20,38,20,43],[21,9,21,12],[21,13,21,16],[21,17,21,20],[21,21,21,24],[21,25,21,28],[21,29,21,32],[21,33,21,36],[21,38,21,43],[20,9,20,12],[20,13,20,16],[20,17,20,20],[20,21,20,24],[20,25,20,28],[20,29,20,32],[22,33,22,36],[22,38,22,43],[23,9,23,12],[23,13,23,16],[23,17,23,20],[23,21,23,24],[23,25,23,28],[23,29,23,32],[23,33,23,36],[23,38,23,43],[22,9,22,12],[22,13,22,16],[22,17,22,20],[22,21,22,24],[22,25,22,28],[22,29,22,32],[24,34,24,36],[24,38,24,43],[25,1,25,3],[25,9,25,12],[25,13,25,16],[25,17,25,20],[25,21,25,24],[25,25,25,28],[25,29,25,32],[25,33,25,36],[24,10,24,12],[24,14,24,16],[24,18,24,20],[24,22,24,24],[24,26,24,28],[24,30,24,32],[25,38,25,43],[26,9,26,12],[26,13,26,16],[26,17,26,20],[26,21,26,24],[26,25,26,28],[26,29,26,32],[26,33,26,36],[26,38,26,43],[27,33,27,36],[27,38,27,43],[28,9,28,12],[28,13,28,16],[28,17,28,20],[28,21,28,24],[28,25,28,28],[28,29,28,32],[28,33,28,36],[28,38,28,43],[27,9,27,12],[27,13,27,16],[27,17,27,20],[27,21,27,24],[27,25,27,28],[27,29,27,32],[33,9,33,12],[33,13,33,16],[31,9,31,12],[31,13,31,16],[31,38,31,43],[32,9,32,12],[32,13,32,16],[32,38,32,43],[29,10,29,12],[29,14,29,16],[29,38,29,43],[30,9,30,12],[30,13,30,16],[30,38,30,43]]}
[]
[]
[null,null,null,null,null,null,null,null,null,"일 Sunday",null,null,null,"월 Monday",null,null,null,"화 Tuesday",null,null,null,"수 Wednesday",null,null,null,"목 Thursday",null,null,null,"금 Friday",null,null,null,"토 Saturday"]
[]
[null,null,{"$f":"'달력 설정'!$B$2","v":2025},null,null,null,null,null,null,{"$f":"Calendar($C$5,$C$7,1)","v":""},{"$f":"IFERROR(IF(AND(J5<>\"\",VLOOKUP(DATE($C$5,$C$7,J5),_공휴일날짜,3,FALSE)<>\"\"),VLOOKUP(DATE($C$5,$C$7,J5),_공휴일날짜,3,FALSE),\"\"),\"\")","v":""},null,null,{"$f":"Calendar($C$5,$C$7,2)","v":""},{"$f":"IFERROR(IF(AND(N5<>\"\",VLOOKUP(DATE($C$5,$C$7,N5),_공휴일날짜,3,FALSE)<>\"\"),VLOOKUP(DATE($C$5,$C$7,N5),_공휴일날짜,3,FALSE),\"\"),\"\")","v":""},null,null,{"$f":"Calendar($C$5,$C$7,3)","v":""},{"$f":"IFERROR(IF(AND(R5<>\"\",VLOOKUP(DATE($C$5,$C$7,R5),_공휴일날짜,3,FALSE)<>\"\"),VLOOKUP(DATE($C$5,$C$7,R5),_공휴일날짜,3,FALSE),\"\"),\"\")","v":""},null,null,{"$f":"Calendar($C$5,$C$7,4)","v":""},{"$f":"IFERROR(IF(AND(V5<>\"\",VLOOKUP(DATE($C$5,$C$7,V5),_공휴일날짜,3,FALSE)<>\"\"),VLOOKUP(DATE($C$5,$C$7,V5),_공휴일날짜,3,FALSE),\"\"),\"\")","v":""},null,null,{"$f":"Calendar($C$5,$C$7,5)","v":""},{"$f":"IFERROR(IF(AND(Z5<>\"\",VLOOKUP(DATE($C$5,$C$7,Z5),_공휴일날짜,3,FALSE)<>\"\"),VLOOKUP(DATE($C$5,$C$7,Z5),_공휴일날짜,3,FALSE),\"\"),\"\")","v":""},null,null,{"$f":"Calendar($C$5,$C$7,6)","v":"1900-01-01"},{"$f":"IFERROR(IF(AND(AD5<>\"\",VLOOKUP(DATE($C$5,$C$7,AD5),_공휴일날짜,3,FALSE)<>\"\"),VLOOKUP(DATE($C$5,$C$7,AD5),_공휴일날짜,3,FALSE),\"\"),\"\")","v":""},null,null,{"$f":"Calendar($C$5,$C$7,7)","v":"1900-01-02"},{"$f":"IFERROR(IF(AND(AH5<>\"\",VLOOKUP(DATE($C$5,$C$7,AH5),_공휴일날짜,3,FALSE)<>\"\"),VLOOKUP(DATE($C$5,$C$7,AH5),_공휴일날짜,3,FALSE),\"\"),\"\")","v":""}]
[]
[null,1,8,null,null,null,null,null,null,null,null,null,null,null,null,null,null,null,null,null,null,null,null,null,null,null,null,null,null,null,null,null,null,null,null,null,null,null,"Do It List"]
[null,null,null,null,null,null,null,null,null,null,null,null,null,null,null,null,null,null,null,null,null,null,null,null,null,null,null,null,null,null,null,null,null,null,null,null,null,null,false]
[null,null,null,null,null,null,null,null,null,null,null,null,null,null,null,null,null,null,null,null,null,null,null,null,null,null,null,null,null,null,null,null,null,null,null,null,null,null,false]
[null,null,null,null,null,null,null,null,null,{"$f":"Calendar($C$5,$C$7,8)","v":"1900-01-03"},{"$f":"IFERROR(IF(AND(J10<>\"\",VLOOKUP(DATE($C$5,$C$7,J10),_공휴일날짜,3,FALSE)<>\"\"),VLOOKUP(DATE($C$5,$C$7,J10),_공휴일날짜,3,FALSE),\"\"),\"\")","v":""},null,null,{"$f":"Calendar($C$5,$C$7,9)","v":"1900-01-04"},{"$f":"IFERROR(IF(AND(N10<>\"\",VLOOKUP(DATE($C$5,$C$7,N10),_공휴일날짜,3,FALSE)<>\"\"),VLOOKUP(DATE($C$5,$C$7,N10),_공휴일날짜,3,FALSE),\"\"),\"\")","v":""},null,null,{"$f":"Calendar($C$5,$C$7,10)","v":"1900-01-05"},{"$f":"IFERROR(IF(AND(R10<>\"\",VLOOKUP(DATE($C$5,$C$7,R10),_공휴일날짜,3,FALSE)<>\"\"),VLOOKUP(DATE($C$5,$C$7,R10),_공휴일날짜,3,FALSE),\"\"),\"\")","v":""},null,null,{"$f":"Calendar($C$5,$C$7,11)","v":"1900-01-06"},{"$f":"IFERROR(IF(AND(V10<>\"\",VLOOKUP(DATE($C$5,$C$7,V10),_공휴일날짜,3,FALSE)<>\"\"),VLOOKUP(DATE($C$5,$C$7,V10),_공휴일날짜,3,FALSE),\"\"),\"\")","v":""},null,null,{"$f":"Calendar($C$5,$C$7,12)","v":"1900-01-07"},{"$f":"IFERROR(IF(AND(Z10<>\"\",VLOOKUP(DATE($C$5,$C$7,Z10),_공휴일날짜,3,FALSE)<>\"\"),VLOOKUP(DATE($C$5,$C$7,Z10),_공휴일날짜,3,FALSE),\"\"),\"\")","v":""},null,null,{"$f":"Calendar($C$5,$C$7,13)","v":"1900-01-08"},{"$f":"IFERROR(IF(AND(AD10<>\"\",VLOOKUP(DATE($C$5,$C$7,AD10),_공휴일날짜,3,FALSE)<>\"\"),VLOOKUP(DATE($C$5,$C$7,AD10),_공휴일날짜,3,FALSE),\"\"),\"\")","v":""},null,null,{"$f":"Calendar($C$5,$C$7,14)","v":"1900-01-09"},{"$f":"IFERROR(IF(AND(AH10<>\"\",VLOOKUP(DATE($C$5,$C$7,AH10),_공휴일날짜,3,FALSE)<>\"\"),VLOOKUP(DATE($C$5,$C$7,AH10),_공휴일날짜,3,FALSE),\"\"),\"\")","v":""},null,null,null,false]
[null,null,null,null,null,null,null,null,null,null,null,null,null,null,null,null,null,null,null,null,null,null,null,null,null,null,null,null,null,null,null,null,null,null,null,null,null,null,false]
[null,null,null,null,null,null,null,null,null,null,null,null,null,null,null,null,null,null,null,null,null,null,null,null,null,null,null,null,null,null,null,null,null,null,null,null,null,null,false]
[null,null,{"$f":"VLOOKUP($C$7,'달력 설정'!$B$6:$C$17,2,FALSE)","v":"August"},null,null,null,null,null,null,null,null,null,null,null,null,null,null,null,null,null,null,null,null,null,null,null,null,null,null,null,null,null,null,null,null,null,null,null,false]
[null,null,null,null,null,null,null,null,null,null,null,null,null,null,null,null,null,null,null,null,null,null,null,null,null,null,null,null,null,null,null,null,null,null,null,null,null,null,false]
[null,null,null,null,null,null,null,null,null,{"$f":"Calendar($C$5,$C$7,15)","v":"1900-01-10"},{"$f":"IFERROR(IF(AND(J15<>\"\",VLOOKUP(DATE($C$5,$C$7,J15),_공휴일날짜,3,FALSE)<>\"\"),VLOOKUP(DATE($C$5,$C$7,J15),_공휴일날짜,3,FALSE),\"\"),\"\")","v":""},null,null,{"$f":"Calendar($C$5,$C$7,16)","v":"1900-01-11"},{"$f":"IFERROR(IF(AND(N15<>\"\",VLOOKUP(DATE($C$5,$C$7,N15),_공휴일날짜,3,FALSE)<>\"\"),VLOOKUP(DATE($C$5,$C$7,N15),_공휴일날짜,3,FALSE),\"\"),\"\")","v":""},null,null,{"$f":"Calendar($C$5,$C$7,17)","v":"1900-01-12"},{"$f":"IFERROR(IF(AND(R15<>\"\",VLOOKUP(DATE($C$5,$C$7,R15),_공휴일날짜,3,FALSE)<>\"\"),VLOOKUP(DATE($C$5,$C$7,R15),_공휴일날짜,3,FALSE),\"\"),\"\")","v":""},null,null,{"$f":"Calendar($C$5,$C$7,18)","v":"1900-01-13"},{"$f":"IFERROR(IF(AND(V15<>\"\",VLOOKUP(DATE($C$5,$C$7,V15),_공휴일날짜,3,FALSE)<>\"\"),VLOOKUP(DATE($C$5,$C$7,V15),_공휴일날짜,3,FALSE),\"\"),\"\")","v":""},null,null,{"$f":"Calendar($C$5,$C$7,19)","v":"1900-01-14"},{"$f":"IFERROR(IF(AND(Z15<>\"\",VLOOKUP(DATE($C$5,$C$7,Z15),_공휴일날짜,3,FALSE)<>\"\"),VLOOKUP(DATE($C$5,$C$7,Z15),_공휴일날짜,3,FALSE),\"\"),\"\")","v":""},null,null,{"$f":"Calendar($C$5,$C$7,20)","v":"1900-01-15"},{"$f":"IFERROR(IF(AND(AD15<>\"\",VLOOKUP(DATE($C$5,$C$7,AD15),_공휴일날짜,3,FALSE)<>\"\"),VLOOKUP(DATE($C$5,$C$7,AD15),_공휴일날짜,3,FALSE),\"\"),\"\")","v":"광복절"},null,null,{"$f":"Calendar($C$5,$C$7,21)","v":"1900-01-16"},{"$f":"IFERROR(IF(AND(AH15<>\"\",VLOOKUP(DATE($C$5,$C$7,AH15),_공휴일날짜,3,FALSE)<>\"\"),VLOOKUP(DATE($C$5,$C$7,AH15),_공휴일날짜,3,FALSE),\"\"),\"\")","v":""}]
[]
[null,{"$f":"VLOOKUP($E$17,'달력 설정'!$B$6:$C$17,2,FALSE)","v":"July"},null,null,{"$f":"IF($C$7=1,12,$C$7-1)","v":7},null,null,null,null,null,null,null,null,null,null,null,null,null,null,null,null,null,null,null,null,null,null,null,null,null,null,null,null,null,null,null,null,null,"MEMO"]
[null,"일","월","화","수","목","금","토"]
[null,{"$f":"IF($C$7=1,Calendar($C$5-1,12,1),Calendar($C$5,$C$7-1,1))","v":""},{"$f":"IF($C$7=1,Calendar($C$5-1,12,2),Calendar($C$5,$C$7-1,2))","v":""},{"$f":"IF($C$7=1,Calendar($C$5-1,12,3),Calendar($C$5,$C$7-1,3))","v":"1900-01-01"},{"$f":"IF($C$7=1,Calendar($C$5-1,12,4),Calendar($C$5,$C$7-1,4))","v":"1900-01-02"},{"$f":"IF($C$7=1,Calendar($C$5-1,12,5),Calendar($C$5,$C$7-1,5))","v":"1900-01-03"},{"$f":"IF($C$7=1,Calendar($C$5-1,12,6),Calendar($C$5,$C$7-1,6))","v":"1900-01-04"},{"$f":"IF($C$7=1,Calendar($C$5-1,12,7),Calendar($C$5,$C$7-1,7))","v":"1900-01-05"}]
[null,{"$f":"IF($C$7=1,Calendar($C$5-1,12,8),Calendar($C$5,$C$7-1,8))","v":"1900-01-06"},{"$f":"IF($C$7=1,Calendar($C$5-1,12,9),Calendar($C$5,$C$7-1,9))","v":"1900-01-07"},{"$f":"IF($C$7=1,Calendar($C$5-1,12,10),Calendar($C$5,$C$7-1,10))","v":"1900-01-08"},{"$f":"IF($C$7=1,Calendar($C$5-1,12,11),Calendar($C$5,$C$7-1,11))","v":"1900-01-09"},{"$f":"IF($C$7=1,Calendar($C$5-1,12,12),Calendar($C$5,$C$7-1,12))","v":"1900-01-10"},{"$f":"IF($C$7=1,Calendar($C$5-1,12,13),Calendar($C$5,$C$7-1,13))","v":"1900-01-11"},{"$f":"IF($C$7=1,Calendar($C$5-1,12,14),Calendar($C$5,$C$7-1,14))","v":"1900-01-12"},null,{"$f":"Calendar($C$5,$C$7,22)","v":"1900-01-17"},{"$f":"IFERROR(IF(AND(J20<>\"\",VLOOKUP(DATE($C$5,$C$7,J20),_공휴일날짜,3,FALSE)<>\"\"),VLOOKUP(DATE($C$5,$C$7,J20),_공휴일날짜,3,FALSE),\"\"),\"\")","v":""},null,null,{"$f":"Calendar($C$5,$C$7,23)","v":"1900-01-18"},{"$f":"IFERROR(IF(AND(N20<>\"\",VLOOKUP(DATE($C$5,$C$7,N20),_공휴일날짜,3,FALSE)<>\"\"),VLOOKUP(DATE($C$5,$C$7,N20),_공휴일날짜,3,FALSE),\"\"),\"\")","v":""},null,null,{"$f":"Calendar($C$5,$C$7,24)","v":"1900-01-19"},{"$f":"IFERROR(IF(AND(R20<>\"\",VLOOKUP(DATE($C$5,$C$7,R20),_공휴일날짜,3,FALSE)<>\"\"),VLOOKUP(DATE($C$5,$C$7,R20),_공휴일날짜,3,FALSE),\"\"),\"\")","v":""},null,null,{"$f":"Calendar($C$5,$C$7,25)","v":"1900-01-20"},{"$f":"IFERROR(IF(AND(V20<>\"\",VLOOKUP(DATE($C$5,$C$7,V20),_공휴일날짜,3,FALSE)<>\"\"),VLOOKUP(DATE($C$5,$C$7,V20),_공휴일날짜,3,FALSE),\"\"),\"\")","v":""},null,null,{"$f":"Calendar($C$5,$C$7,26)","v":"1900-01-21"},{"$f":"IFERROR(IF(AND(Z20<>\"\",VLOOKUP(DATE($C$5,$C$7,Z20),_공휴일날짜,3,FALSE)<>\"\"),VLOOKUP(DATE($C$5,$C$7,Z20),_공휴일날짜,3,FALSE),\"\"),\"\")","v":""},null,null,{"$f":"Calendar($C$5,$C$7,27)","v":"1900-01-22"},{"$f":"IFERROR(IF(AND(AD20<>\"\",VLOOKUP(DATE($C$5,$C$7,AD20),_공휴일날짜,3,FALSE)<>\"\"),VLOOKUP(DATE($C$5,$C$7,AD20),_공휴일날짜,3,FALSE),\"\"),\"\")","v":""},null,null,{"$f":"Calendar($C$5,$C$7,28)","v":"1900-01-23"},{"$f":"IFERROR(IF(AND(AH20<>\"\",VLOOKUP(DATE($C$5,$C$7,AH20),_공휴일날짜,3,FALSE)<>\"\"),VLOOKUP(DATE($C$5,$C$7,AH20),_공휴일날짜,3,FALSE),\"\"),\"\")","v":""}]
[null,{"$f":"IF($C$7=1,Calendar($C$5-1,12,15),Calendar($C$5,$C$7-1,15))","v":"1900-01-13"},{"$f":"IF($C$7=1,Calendar($C$5-1,12,16),Calendar($C$5,$C$7-1,16))","v":"1900-01-14"},{"$f":"IF($C$7=1,Calendar($C$5-1,12,17),Calendar($C$5,$C$7-1,17))","v":"1900-01-15"},{"$f":"IF($C$7=1,Calendar($C$5-1,12,18),Calendar($C$5,$C$7-1,18))","v":"1900-01-16"},{"$f":"IF($C$7=1,Calendar($C$5-1,12,19),Calendar($C$5,$C$7-1,19))","v":"1900-01-17"},{"$f":"IF($C$7=1,Calendar($C$5-1,12,20),Calendar($C$5,$C$7-1,20))","v":"1900-01-18"},{"$f":"IF($C$7=1,Calendar($C$5-1,12,21),Calendar($C$5,$C$7-1,21))","v":"1900-01-19"}]
[null,{"$f":"IF($C$7=1,Calendar($C$5-1,12,22),Calendar($C$5,$C$7-1,22))","v":"1900-01-20"},{"$f":"IF($C$7=1,Calendar($C$5-1,12,23),Calendar($C$5,$C$7-1,23))","v":"1900-01-21"},{"$f":"IF($C$7=1,Calendar($C$5-1,12,24),Calendar($C$5,$C$7-1,24))","v":"1900-01-22"},{"$f":"IF($C$7=1,Calendar($C$5-1,12,25),Calendar($C$5,$C$7-1,25))","v":"1900-01-23"},{"$f":"IF($C$7=1,Calendar($C$5-1,12,26),Calendar($C$5,$C$7-1,26))","v":"1900-01-24"},{"$f":"IF($C$7=1,Calendar($C$5-1,12,27),Calendar($C$5,$C$7-1,27))","v":"1900-01-25"},{"$f":"IF($C$7=1,Calendar($C$5-1,12,28),Calendar($C$5,$C$7-1,28))","v":"1900-01-26"}]
[null,{"$f":"IF($C$7=1,Calendar($C$5-1,12,29),Calendar($C$5,$C$7-1,29))","v":"1900-01-27"},{"$f":"IF($C$7=1,Calendar($C$5-1,12,30),Calendar($C$5,$C$7-1,30))","v":"1900-01-28"},{"$f":"IF($C$7=1,Calendar($C$5-1,12,31),Calendar($C$5,$C$7-1,31))","v":"1900-01-29"},{"$f":"IF($C$7=1,Calendar($C$5-1,12,32),Calendar($C$5,$C$7-1,32))","v":"1900-01-30"},{"$f":"IF($C$7=1,Calendar($C$5-1,12,33),Calendar($C$5,$C$7-1,33))","v":"1900-01-31"},{"$f":"IF($C$7=1,Calendar($C$5-1,12,34),Calendar($C$5,$C$7-1,34))","v":""},{"$f":"IF($C$7=1,Calendar($C$5-1,12,35),Calendar($C$5,$C$7-1,35))","v":""}]
[null,{"$f":"IF($C$7=1,Calendar($C$5-1,12,36),Calendar($C$5,$C$7-1,36))","v":""},{"$f":"IF($C$7=1,Calendar($C$5-1,12,37),Calendar($C$5,$C$7-1,37))","v":""}]
[null,null,null,null,null,null,null,null,null,{"$f":"Calendar($C$5,$C$7,29)","v":"1900-01-24"},{"$f":"IFERROR(IF(AND(J25<>\"\",VLOOKUP(DATE($C$5,$C$7,J25),_공휴일날짜,3,FALSE)<>\"\"),VLOOKUP(DATE($C$5,$C$7,J25),_공휴일날짜,3,FALSE),\"\"),\"\")","v":""},null,null,{"$f":"Calendar($C$5,$C$7,30)","v":"1900-01-25"},{"$f":"IFERROR(IF(AND(N25<>\"\",VLOOKUP(DATE($C$5,$C$7,N25),_공휴일날짜,3,FALSE)<>\"\"),VLOOKUP(DATE($C$5,$C$7,N25),_공휴일날짜,3,FALSE),\"\"),\"\")","v":""},null,null,{"$f":"Calendar($C$5,$C$7,31)","v":"1900-01-26"},{"$f":"IFERROR(IF(AND(R25<>\"\",VLOOKUP(DATE($C$5,$C$7,R25),_공휴일날짜,3,FALSE)<>\"\"),VLOOKUP(DATE($C$5,$C$7,R25),_공휴일날짜,3,FALSE),\"\"),\"\")","v":""},null,null,{"$f":"Calendar($C$5,$C$7,32)","v":"1900-01-27"},{"$f":"IFERROR(IF(AND(V25<>\"\",VLOOKUP(DATE($C$5,$C$7,V25),_공휴일날짜,3,FALSE)<>\"\"),VLOOKUP(DATE($C$5,$C$7,V25),_공휴일날짜,3,FALSE),\"\"),\"\")","v":""},null,null,{"$f":"Calendar($C$5,$C$7,33)","v":"1900-01-28"},{"$f":"IFERROR(IF(AND(Z25<>\"\",VLOOKUP(DATE($C$5,$C$7,Z25),_공휴일날짜,3,FALSE)<>\"\"),VLOOKUP(DATE($C$5,$C$7,Z25),_공휴일날짜,3,FALSE),\"\"),\"\")","v":""},null,null,{"$f":"Calendar($C$5,$C$7,34)","v":"1900-01-29"},{"$f":"IFERROR(IF(AND(AD25<>\"\",VLOOKUP(DATE($C$5,$C$7,AD25),_공휴일날짜,3,FALSE)<>\"\"),VLOOKUP(DATE($C$5,$C$7,AD25),_공휴일날짜,3,FALSE),\"\"),\"\")","v":""},null,null,{"$f":"Calendar($C$5,$C$7,35)","v":"1900-01-30"},{"$f":"IFERROR(IF(AND(AH25<>\"\",VLOOKUP(DATE($C$5,$C$7,AH25),_공휴일날짜,3,FALSE)<>\"\"),VLOOKUP(DATE($C$5,$C$7,AH25),_공휴일날짜,3,FALSE),\"\"),\"\")","v":""}]
[null,{"$f":"VLOOKUP($E$26,'달력 설정'!$B$6:$C$17,2,FALSE)","v":"September"},null,null,{"$f":"IF($C$7=12,1,$C$7+1)","v":9}]
[null,"일","월","화","수","목","금","토"]
[null,{"$f":"IF($C$7=12,Calendar($C$5+1,1,1),Calendar($C$5,$C$7+1,1))","v":""},{"$f":"IF($C$7=12,Calendar($C$5+1,1,2),Calendar($C$5,$C$7+1,2))","v":"1900-01-01"},{"$f":"IF($C$7=12,Calendar($C$5+1,1,3),Calendar($C$5,$C$7+1,3))","v":"1900-01-02"},{"$f":"IF($C$7=12,Calendar($C$5+1,1,4),Calendar($C$5,$C$7+1,4))","v":"1900-01-03"},{"$f":"IF($C$7=12,Calendar($C$5+1,1,5),Calendar($C$5,$C$7+1,5))","v":"1900-01-04"},{"$f":"IF($C$7=12,Calendar($C$5+1,1,6),Calendar($C$5,$C$7+1,6))","v":"1900-01-05"},{"$f":"IF($C$7=12,Calendar($C$5+1,1,7),Calendar($C$5,$C$7+1,7))","v":"1900-01-06"}]
[null,{"$f":"IF($C$7=12,Calendar($C$5+1,1,8),Calendar($C$5,$C$7+1,8))","v":"1900-01-07"},{"$f":"IF($C$7=12,Calendar($C$5+1,1,9),Calendar($C$5,$C$7+1,9))","v":"1900-01-08"},{"$f":"IF($C$7=12,Calendar($C$5+1,1,10),Calendar($C$5,$C$7+1,10))","v":"1900-01-09"},{"$f":"IF($C$7=12,Calendar($C$5+1,1,11),Calendar($C$5,$C$7+1,11))","v":"1900-01-10"},{"$f":"IF($C$7=12,Calendar($C$5+1,1,12),Calendar($C$5,$C$7+1,12))","v":"1900-01-11"},{"$f":"IF($C$7=12,Calendar($C$5+1,1,13),Calendar($C$5,$C$7+1,13))","v":"1900-01-12"},{"$f":"IF($C$7=12,Calendar($C$5+1,1,14),Calendar($C$5,$C$7+1,14))","v":"1900-01-13"}]
[null,{"$f":"IF($C$7=12,Calendar($C$5+1,1,15),Calendar($C$5,$C$7+1,15))","v":"1900-01-14"},{"$f":"IF($C$7=12,Calendar($C$5+1,1,16),Calendar($C$5,$C$7+1,16))","v":"1900-01-15"},{"$f":"IF($C$7=12,Calendar($C$5+1,1,17),Calendar($C$5,$C$7+1,17))","v":"1900-01-16"},{"$f":"IF($C$7=12,Calendar($C$5+1,1,18),Calendar($C$5,$C$7+1,18))","v":"1900-01-17"},{"$f":"IF($C$7=12,Calendar($C$5+1,1,19),Calendar($C$5,$C$7+1,19))","v":"1900-01-18"},{"$f":"IF($C$7=12,Calendar($C$5+1,1,20),Calendar($C$5,$C$7+1,20))","v":"1900-01-19"},{"$f":"IF($C$7=12,Calendar($C$5+1,1,21),Calendar($C$5,$C$7+1,21))","v":"1900-01-20"},null,{"$f":"Calendar($C$5,$C$7,36)","v":"1900-01-31"},{"$f":"IFERROR(IF(AND(J30<>\"\",VLOOKUP(DATE($C$5,$C$7,J30),_공휴일날짜,3,FALSE)<>\"\"),VLOOKUP(DATE($C$5,$C$7,J30),_공휴일날짜,3,FALSE),\"\"),\"\")","v":""},null,null,{"$f":"Calendar($C$5,$C$7,37)","v":""},{"$f":"IFERROR(IF(AND(N30<>\"\",VLOOKUP(DATE($C$5,$C$7,N30),_공휴일날짜,3,FALSE)<>\"\"),VLOOKUP(DATE($C$5,$C$7,N30),_공휴일날짜,3,FALSE),\"\"),\"\")","v":""}]
[null,{"$f":"IF($C$7=12,Calendar($C$5+1,1,22),Calendar($C$5,$C$7+1,22))","v":"1900-01-21"},{"$f":"IF($C$7=12,Calendar($C$5+1,1,23),Calendar($C$5,$C$7+1,23))","v":"1900-01-22"},{"$f":"IF($C$7=12,Calendar($C$5+1,1,24),Calendar($C$5,$C$7+1,24))","v":"1900-01-23"},{"$f":"IF($C$7=12,Calendar($C$5+1,1,25),Calendar($C$5,$C$7+1,25))","v":"1900-01-24"},{"$f":"IF($C$7=12,Calendar($C$5+1,1,26),Calendar($C$5,$C$7+1,26))","v":"1900-01-25"},{"$f":"IF($C$7=12,Calendar($C$5+1,1,27),Calendar($C$5,$C$7+1,27))","v":"1900-01-26"},{"$f":"IF($C$7=12,Calendar($C$5+1,1,28),Calendar($C$5,$C$7+1,28))","v":"1900-01-27"}]
[null,{"$f":"IF($C$7=12,Calendar($C$5+1,1,29),Calendar($C$5,$C$7+1,29))","v":"1900-01-28"},{"$f":"IF($C$7=12,Calendar($C$5+1,1,30),Calendar($C$5,$C$7+1,30))","v":"1900-01-29"},{"$f":"IF($C$7=12,Calendar($C$5+1,1,31),Calendar($C$5,$C$7+1,31))","v":"1900-01-30"},{"$f":"IF($C$7=12,Calendar($C$5+1,1,32),Calendar($C$5,$C$7+1,32))","v":""},{"$f":"IF($C$7=12,Calendar($C$5+1,1,33),Calendar($C$5,$C$7+1,33))","v":""},{"$f":"IF($C$7=12,Calendar($C$5+1,1,34),Calendar($C$5,$C$7+1,34))","v":""},{"$f":"IF($C$7=12,Calendar($C$5+1,1,35),Calendar($C$5,$C$7+1,35))","v":""}]
[null,{"$f":"IF($C$7=12,Calendar($C$5+1,1,36),Calendar($C$5,$C$7+1,36))","v":""},{"$f":"IF($C$7=12,Calendar($C$5+1,1,37),Calendar($C$5,$C$7+1,37))","v":""}]

{"sheet":"9월","index":8,"n_rows":33,"n_cols":39,"rows_kept":33,"cut":false,"hidden":false,"merged":[[2,29,3,32],[2,33,3,36],[4,2,5,6],[4,10,4,12],[4,14,4,16],[4,18,4,20],[4,22,4,24],[4,26,4,28],[4,30,4,32],[4,34,4,36],[0,1,2,7],[2,9,3,12],[2,13,3,16],[2,17,3,20],[2,21,3,24],[2,25,3,28],[5,33,5,36],[6,2,11,6],[6,9,6,12],[6,13,6,16],[6,17,6,20],[6,21,6,24],[6,25,6,28],[6,29,6,32],[6,33,6,36],[8,9,8,12],[5,9,5,12],[5,13,5,16],[5,17,5,20],[5,21,5,24],[5,25,5,28],[5,29,5,32],[6,38,6,43],[7,9,7,12],[7,13,7,16],[7,17,7,20],[7,21,7,24],[7,25,7,28],[7,29,7,32],[7,33,7,36],[7,39,7,43],[8,39,8,43],[9,10,9,12],[9,14,9,16],[9,18,9,20],[9,22,9,24],[9,26,9,28],[9,30,9,32],[9,34,9,36],[9,39,9,43],[8,13,8,16],[8,17,8,20],[8,21,8,24],[8,25,8,28],[8,29,8,32],[8,33,8,36],[12,2,13,6],[12,9,12,12],[12,13,12,16],[12,17,12,20],[12,21,12,24],[12,25,12,28],[10,33,10,36],[10,39,10,43],[11,9,11,12],[11,13,11,16],[11,17,11,20],[11,21,11,24],[11,25,11,28],[11,29,11,32],[11,33,11,36],[11,39,11,43],[10,9,10,12],[10,13,10,16],[10,17,10,20],[10,21,10,24],[10,25,10,28],[10,29,10,32],[13,39,13,43],[14,10,14,12],[14,14,14,16],[14,18,14,20],[14,22,14,24],[14,26,14,28],[14,30,14,32],[14,34,14,36],[12,29,12,32],[12,33,12,36],[12,39,12,43],[13,9,13,12],[13,13,13,16],[13,17,13,20],[13,21,13,24],[13,25,13,28],[13,29,13,32],[13,33,13,36],[15,33,15,36],[16,1,16,3],[16,9,16,12],[16,13,16,16],[16,17,16,20],[16,21,16,24],[16,25,16,28],[16,29,16,32],[16,33,16,36],[15,9,15,12],[15,13,15,16],[15,17,15,20],[15,21,15,24],[15,25,15,28],[15,29,15,32],[16,38,16,43],[17,9,17,12],[17,13,17,16],[17,17,17,20],[17,21,17,24],[17,25,17,28],[17,29,17,32],[17,33,17,36],[17,38,17,43],[18,33,18,36],[18,38,18,43],[19,10,19,12],[19,14,19,16],[19,18,19,20],[19,22,19,24],[19,26,19,28],[19,30,19,32],[19,34,19,36],[19,38,19,43],[18,9,18,12],[18,13,18,16],[18,17,18,20],[18,21,18,24],[18,25,18,28],[18,29,18,32],[20,33,20,36],[20,38,20,43],[21,9,21,12],[21,13,21,16],[21,17,21,20],[21,21,21,24],[21,25,21,28],[21,29,21,32],[21,33,21,36],[21,38,21,43],[20,9,20,12],[20,13,20,16],[20,17,20,20],[20,21,20,24],[20,25,20,28],[20,29,20,32],[22,33,22,36],[22,38,22,43],[23,9,23,12],[23,13,23,16],[23,17,23,20],[23,21,23,24],[23,25,23,28],[23,29,23,32],[23,33,23,36],[23,38,23,43],[22,9,22,12],[22,13,22,16],[22,17,22,20],[22,21,22,24],[22,25,22,28],[22,29,22,32],[24,34,24,36],[24,38,24,43],[25,1,25,3],[25,9,25,12],[25,13,25,16],[25,17,25,20],[25,21,25,24],[25,25,25,28],[25,29,25,32],[25,33,25,36],[24,10,24,12],[24,14,24,16],[24,18,24,20],[24,22,24,24],[24,26,24,28],[24,30,24,32],[25,38,25,43],[26,9,26,12],[26,13,26,16],[26,17,26,20],[26,21,26,24],[26,25,26,28],[26,29,26,32],[26,33,26,36],[26,38,26,43],[27,33,27,36],[27,38,27,43],[28,9,28,12],[28,13,28,16],[28,17,28,20],[28,21,28,24],[28,25,28,28],[28,29,28,32],[28,33,28,36],[28,38,28,43],[27,9,27,12],[27,13,27,16],[27,17,27,20],[27,21,27,24],[27,25,27,28],[27,29,27,32],[33,9,33,12],[33,13,33,16],[31,9,31,12],[31,13,31,16],[31,38,31,43],[32,9,32,12],[32,13,32,16],[32,38,32,43],[29,10,29,12],[29,14,29,16],[29,38,29,43],[30,9,30,12],[30,13,30,16],[30,38,30,43]]}
[]
[]
[null,null,null,null,null,null,null,null,null,"일 Sunday",null,null,null,"월 Monday",null,null,null,"화 Tuesday",null,null,null,"수 Wednesday",null,null,null,"목 Thursday",null,null,null,"금 Friday",null,null,null,"토 Saturday"]
[]
[null,null,{"$f":"'달력 설정'!$B$2","v":2025},null,null,null,null,null,null,{"$f":"Calendar($C$5,$C$7,1)","v":""},{"$f":"IFERROR(IF(AND(J5<>\"\",VLOOKUP(DATE($C$5,$C$7,J5),_공휴일날짜,3,FALSE)<>\"\"),VLOOKUP(DATE($C$5,$C$7,J5),_공휴일날짜,3,FALSE),\"\"),\"\")","v":""},null,null,{"$f":"Calendar($C$5,$C$7,2)","v":"1900-01-01"},{"$f":"IFERROR(IF(AND(N5<>\"\",VLOOKUP(DATE($C$5,$C$7,N5),_공휴일날짜,3,FALSE)<>\"\"),VLOOKUP(DATE($C$5,$C$7,N5),_공휴일날짜,3,FALSE),\"\"),\"\")","v":""},null,null,{"$f":"Calendar($C$5,$C$7,3)","v":"1900-01-02"},{"$f":"IFERROR(IF(AND(R5<>\"\",VLOOKUP(DATE($C$5,$C$7,R5),_공휴일날짜,3,FALSE)<>\"\"),VLOOKUP(DATE($C$5,$C$7,R5),_공휴일날짜,3,FALSE),\"\"),\"\")","v":""},null,null,{"$f":"Calendar($C$5,$C$7,4)","v":"1900-01-03"},{"$f":"IFERROR(IF(AND(V5<>\"\",VLOOKUP(DATE($C$5,$C$7,V5),_공휴일날짜,3,FALSE)<>\"\"),VLOOKUP(DATE($C$5,$C$7,V5),_공휴일날짜,3,FALSE),\"\"),\"\")","v":""},null,null,{"$f":"Calendar($C$5,$C$7,5)","v":"1900-01-04"},{"$f":"IFERROR(IF(AND(Z5<>\"\",VLOOKUP(DATE($C$5,$C$7,Z5),_공휴일날짜,3,FALSE)<>\"\"),VLOOKUP(DATE($C$5,$C$7,Z5),_공휴일날짜,3,FALSE),\"\"),\"\")","v":""},null,null,{"$f":"Calendar($C$5,$C$7,6)","v":"1900-01-05"},{"$f":"IFERROR(IF(AND(AD5<>\"\",VLOOKUP(DATE($C$5,$C$7,AD5),_공휴일날짜,3,FALSE)<>\"\"),VLOOKUP(DATE($C$5,$C$7,AD5),_공휴일날짜,3,FALSE),\"\"),\"\")","v":""},null,null,{"$f":"Calendar($C$5,$C$7,7)","v":"1900-01-06"},{"$f":"IFERROR(IF(AND(AH5<>\"\",VLOOKUP(DATE($C$5,$C$7,AH5),_공휴일날짜,3,FALSE)<>\"\"),VLOOKUP(DATE($C$5,$C$7,AH5),_공휴일날짜,3,FALSE),\"\"),\"\")","v":""}]
[]
[null,1,9,null,null,null,null,null,null,null,null,null,null,null,null,null,null,null,null,null,null,null,null,null,null,null,null,null,null,null,null,null,null,null,null,null,null,null,"Do It List"]
[null,null,null,null,null,null,null,null,null,null,null,null,null,null,null,null,null,null,null,null,null,null,null,null,null,null,null,null,null,null,null,null,null,null,null,null,null,null,false]
[null,null,null,null,null,null,null,null,null,null,null,null,null,null,null,null,null,null,null,null,null,null,null,null,null,null,null,null,null,null,null,null,null,null,null,null,null,null,false]
[null,null,null,null,null,null,null,null,null,{"$f":"Calendar($C$5,$C$7,8)","v":"1900-01-07"},{"$f":"IFERROR(IF(AND(J10<>\"\",VLOOKUP(DATE($C$5,$C$7,J10),_공휴일날짜,3,FALSE)<>\"\"),VLOOKUP(DATE($C$5,$C$7,J10),_공휴일날짜,3,FALSE),\"\"),\"\")","v":""},null,null,{"$f":"Calendar($C$5,$C$7,9)","v":"1900-01-08"},{"$f":"IFERROR(IF(AND(N10<>\"\",VLOOKUP(DATE($C$5,$C$7,N10),_공휴일날짜,3,FALSE)<>\"\"),VLOOKUP(DATE($C$5,$C$7,N10),_공휴일날짜,3,FALSE),\"\"),\"\")","v":""},null,null,{"$f":"Calendar($C$5,$C$7,10)","v":"1900-01-09"},{"$f":"IFERROR(IF(AND(R10<>\"\",VLOOKUP(DATE($C$5,$C$7,R10),_공휴일날짜,3,FALSE)<>\"\"),VLOOKUP(DATE($C$5,$C$7,R10),_공휴일날짜,3,FALSE),\"\"),\"\")","v":""},null,null,{"$f":"Calendar($C$5,$C$7,11)","v":"1900-01-10"},{"$f":"IFERROR(IF(AND(V10<>\"\",VLOOKUP(DATE($C$5,$C$7,V10),_공휴일날짜,3,FALSE)<>\"\"),VLOOKUP(DATE($C$5,$C$7,V10),_공휴일날짜,3,FALSE),\"\"),\"\")","v":""},null,null,{"$f":"Calendar($C$5,$C$7,12)","v":"1900-01-11"},{"$f":"IFERROR(IF(AND(Z10<>\"\",VLOOKUP(DATE($C$5,$C$7,Z10),_공휴일날짜,3,FALSE)<>\"\"),VLOOKUP(DATE($C$5,$C$7,Z10),_공휴일날짜,3,FALSE),\"\"),\"\")","v":""},null,null,{"$f":"Calendar($C$5,$C$7,13)","v":"1900-01-12"},{"$f":"IFERROR(IF(AND(AD10<>\"\",VLOOKUP(DATE($C$5,$C$7,AD10),_공휴일날짜,3,FALSE)<>\"\"),VLOOKUP(DATE($C$5,$C$7,AD10),_공휴일날짜,3,FALSE),\"\"),\"\")","v":""},null,null,{"$f":"Calendar($C$5,$C$7,14)","v":"1900-01-13"},{"$f":"IFERROR(IF(AND(AH10<>\"\",VLOOKUP(DATE($C$5,$C$7,AH10),_공휴일날짜,3,FALSE)<>\"\"),VLOOKUP(DATE($C$5,$C$7,AH10),_공휴일날짜,3,FALSE),\"\"),\"\")","v":""},null,null,null,false]
[null,null,null,null,null,null,null,null,null,null,null,null,null,null,null,null,null,null,null,null,null,null,null,null,null,null,null,null,null,null,null,null,null,null,null,null,null,null,false]
[null,null,null,null,null,null,null,null,null,null,null,null,null,null,null,null,null,null,null,null,null,null,null,null,null,null,null,null,null,null,null,null,null,null,null,null,null,null,false]
[null,null,{"$f":"VLOOKUP($C$7,'달력 설정'!$B$6:$C$17,2,FALSE)","v":"September"},null,null,null,null,null,null,null,null,null,null,null,null,null,null,null,null,null,null,null,null,null,null,null,null,null,null,null,null,null,null,null,null,null,null,null,false]
[null,null,null,null,null,null,null,null,null,null,null,null,null,null,null,null,null,null,null,null,null,null,null,null,null,null,null,null,null,null,null,null,null,null,null,null,null,null,false]
[null,null,null,null,null,null,null,null,null,{"$f":"Calendar($C$5,$C$7,15)","v":"1900-01-14"},{"$f":"IFERROR(IF(AND(J15<>\"\",VLOOKUP(DATE($C$5,$C$7,J15),_공휴일날짜,3,FALSE)<>\"\"),VLOOKUP(DATE($C$5,$C$7,J15),_공휴일날짜,3,FALSE),\"\"),\"\")","v":""},null,null,{"$f":"Calendar($C$5,$C$7,16)","v":"1900-01-15"},{"$f":"IFERROR(IF(AND(N15<>\"\",VLOOKUP(DATE($C$5,$C$7,N15),_공휴일날짜,3,FALSE)<>\"\"),VLOOKUP(DATE($C$5,$C$7,N15),_공휴일날짜,3,FALSE),\"\"),\"\")","v":""},null,null,{"$f":"Calendar($C$5,$C$7,17)","v":"1900-01-16"},{"$f":"IFERROR(IF(AND(R15<>\"\",VLOOKUP(DATE($C$5,$C$7,R15),_공휴일날짜,3,FALSE)<>\"\"),VLOOKUP(DATE($C$5,$C$7,R15),_공휴일날짜,3,FALSE),\"\"),\"\")","v":""},null,null,{"$f":"Calendar($C$5,$C$7,18)","v":"1900-01-17"},{"$f":"IFERROR(IF(AND(V15<>\"\",VLOOKUP(DATE($C$5,$C$7,V15),_공휴일날짜,3,FALSE)<>\"\"),VLOOKUP(DATE($C$5,$C$7,V15),_공휴일날짜,3,FALSE),\"\"),\"\")","v":""},null,null,{"$f":"Calendar($C$5,$C$7,19)","v":"1900-01-18"},{"$f":"IFERROR(IF(AND(Z15<>\"\",VLOOKUP(DATE($C$5,$C$7,Z15),_공휴일날짜,3,FALSE)<>\"\"),VLOOKUP(DATE($C$5,$C$7,Z15),_공휴일날짜,3,FALSE),\"\"),\"\")","v":""},null,null,{"$f":"Calendar($C$5,$C$7,20)","v":"1900-01-19"},{"$f":"IFERROR(IF(AND(AD15<>\"\",VLOOKUP(DATE($C$5,$C$7,AD15),_공휴일날짜,3,FALSE)<>\"\"),VLOOKUP(DATE($C$5,$C$7,AD15),_공휴일날짜,3,FALSE),\"\"),\"\")","v":""},null,null,{"$f":"Calendar($C$5,$C$7,21)","v":"1900-01-20"},{"$f":"IFERROR(IF(AND(AH15<>\"\",VLOOKUP(DATE($C$5,$C$7,AH15),_공휴일날짜,3,FALSE)<>\"\"),VLOOKUP(DATE($C$5,$C$7,AH15),_공휴일날짜,3,FALSE),\"\"),\"\")","v":""}]
[]
[null,{"$f":"VLOOKUP($E$17,'달력 설정'!$B$6:$C$17,2,FALSE)","v":"August"},null,null,{"$f":"IF($C$7=1,12,$C$7-1)","v":8},null,null,null,null,null,null,null,null,null,null,null,null,null,null,null,null,null,null,null,null,null,null,null,null,null,null,null,null,null,null,null,null,null,"MEMO"]
[null,"일","월","화","수","목","금","토"]
[null,{"$f":"IF($C$7=1,Calendar($C$5-1,12,1),Calendar($C$5,$C$7-1,1))","v":""},{"$f":"IF($C$7=1,Calendar($C$5-1,12,2),Calendar($C$5,$C$7-1,2))","v":""},{"$f":"IF($C$7=1,Calendar($C$5-1,12,3),Calendar($C$5,$C$7-1,3))","v":""},{"$f":"IF($C$7=1,Calendar($C$5-1,12,4),Calendar($C$5,$C$7-1,4))","v":""},{"$f":"IF($C$7=1,Calendar($C$5-1,12,5),Calendar($C$5,$C$7-1,5))","v":""},{"$f":"IF($C$7=1,Calendar($C$5-1,12,6),Calendar($C$5,$C$7-1,6))","v":"1900-01-01"},{"$f":"IF($C$7=1,Calendar($C$5-1,12,7),Calendar($C$5,$C$7-1,7))","v":"1900-01-02"}]
[null,{"$f":"IF($C$7=1,Calendar($C$5-1,12,8),Calendar($C$5,$C$7-1,8))","v":"1900-01-03"},{"$f":"IF($C$7=1,Calendar($C$5-1,12,9),Calendar($C$5,$C$7-1,9))","v":"1900-01-04"},{"$f":"IF($C$7=1,Calendar($C$5-1,12,10),Calendar($C$5,$C$7-1,10))","v":"1900-01-05"},{"$f":"IF($C$7=1,Calendar($C$5-1,12,11),Calendar($C$5,$C$7-1,11))","v":"1900-01-06"},{"$f":"IF($C$7=1,Calendar($C$5-1,12,12),Calendar($C$5,$C$7-1,12))","v":"1900-01-07"},{"$f":"IF($C$7=1,Calendar($C$5-1,12,13),Calendar($C$5,$C$7-1,13))","v":"1900-01-08"},{"$f":"IF($C$7=1,Calendar($C$5-1,12,14),Calendar($C$5,$C$7-1,14))","v":"1900-01-09"},null,{"$f":"Calendar($C$5,$C$7,22)","v":"1900-01-21"},{"$f":"IFERROR(IF(AND(J20<>\"\",VLOOKUP(DATE($C$5,$C$7,J20),_공휴일날짜,3,FALSE)<>\"\"),VLOOKUP(DATE($C$5,$C$7,J20),_공휴일날짜,3,FALSE),\"\"),\"\")","v":""},null,null,{"$f":"Calendar($C$5,$C$7,23)","v":"1900-01-22"},{"$f":"IFERROR(IF(AND(N20<>\"\",VLOOKUP(DATE($C$5,$C$7,N20),_공휴일날짜,3,FALSE)<>\"\"),VLOOKUP(DATE($C$5,$C$7,N20),_공휴일날짜,3,FALSE),\"\"),\"\")","v":""},null,null,{"$f":"Calendar($C$5,$C$7,24)","v":"1900-01-23"},{"$f":"IFERROR(IF(AND(R20<>\"\",VLOOKUP(DATE($C$5,$C$7,R20),_공휴일날짜,3,FALSE)<>\"\"),VLOOKUP(DATE($C$5,$C$7,R20),_공휴일날짜,3,FALSE),\"\"),\"\")","v":""},null,null,{"$f":"Calendar($C$5,$C$7,25)","v":"1900-01-24"},{"$f":"IFERROR(IF(AND(V20<>\"\",VLOOKUP(DATE($C$5,$C$7,V20),_공휴일날짜,3,FALSE)<>\"\"),VLOOKUP(DATE($C$5,$C$7,V20),_공휴일날짜,3,FALSE),\"\"),\"\")","v":""},null,null,{"$f":"Calendar($C$5,$C$7,26)","v":"1900-01-25"},{"$f":"IFERROR(IF(AND(Z20<>\"\",VLOOKUP(DATE($C$5,$C$7,Z20),_공휴일날짜,3,FALSE)<>\"\"),VLOOKUP(DATE($C$5,$C$7,Z20),_공휴일날짜,3,FALSE),\"\"),\"\")","v":""},null,null,{"$f":"Calendar($C$5,$C$7,27)","v":"1900-01-26"},{"$f":"IFERROR(IF(AND(AD20<>\"\",VLOOKUP(DATE($C$5,$C$7,AD20),_공휴일날짜,3,FALSE)<>\"\"),VLOOKUP(DATE($C$5,$C$7,AD20),_공휴일날짜,3,FALSE),\"\"),\"\")","v":""},null,null,{"$f":"Calendar($C$5,$C$7,28)","v":"1900-01-27"},{"$f":"IFERROR(IF(AND(AH20<>\"\",VLOOKUP(DATE($C$5,$C$7,AH20),_공휴일날짜,3,FALSE)<>\"\"),VLOOKUP(DATE($C$5,$C$7,AH20),_공휴일날짜,3,FALSE),\"\"),\"\")","v":""}]
[null,{"$f":"IF($C$7=1,Calendar($C$5-1,12,15),Calendar($C$5,$C$7-1,15))","v":"1900-01-10"},{"$f":"IF($C$7=1,Calendar($C$5-1,12,16),Calendar($C$5,$C$7-1,16))","v":"1900-01-11"},{"$f":"IF($C$7=1,Calendar($C$5-1,12,17),Calendar($C$5,$C$7-1,17))","v":"1900-01-12"},{"$f":"IF($C$7=1,Calendar($C$5-1,12,18),Calendar($C$5,$C$7-1,18))","v":"1900-01-13"},{"$f":"IF($C$7=1,Calendar($C$5-1,12,19),Calendar($C$5,$C$7-1,19))","v":"1900-01-14"},{"$f":"IF($C$7=1,Calendar($C$5-1,12,20),Calendar($C$5,$C$7-1,20))","v":"1900-01-15"},{"$f":"IF($C$7=1,Calendar($C$5-1,12,21),Calendar($C$5,$C$7-1,21))","v":"1900-01-16"}]
[null,{"$f":"IF($C$7=1,Calendar($C$5-1,12,22),Calendar($C$5,$C$7-1,22))","v":"1900-01-17"},{"$f":"IF($C$7=1,Calendar($C$5-1,12,23),Calendar($C$5,$C$7-1,23))","v":"1900-01-18"},{"$f":"IF($C$7=1,Calendar($C$5-1,12,24),Calendar($C$5,$C$7-1,24))","v":"1900-01-19"},{"$f":"IF($C$7=1,Calendar($C$5-1,12,25),Calendar($C$5,$C$7-1,25))","v":"1900-01-20"},{"$f":"IF($C$7=1,Calendar($C$5-1,12,26),Calendar($C$5,$C$7-1,26))","v":"1900-01-21"},{"$f":"IF($C$7=1,Calendar($C$5-1,12,27),Calendar($C$5,$C$7-1,27))","v":"1900-01-22"},{"$f":"IF($C$7=1,Calendar($C$5-1,12,28),Calendar($C$5,$C$7-1,28))","v":"1900-01-23"}]
[null,{"$f":"IF($C$7=1,Calendar($C$5-1,12,29),Calendar($C$5,$C$7-1,29))","v":"1900-01-24"},{"$f":"IF($C$7=1,Calendar($C$5-1,12,30),Calendar($C$5,$C$7-1,30))","v":"1900-01-25"},{"$f":"IF($C$7=1,Calendar($C$5-1,12,31),Calendar($C$5,$C$7-1,31))","v":"1900-01-26"},{"$f":"IF($C$7=1,Calendar($C$5-1,12,32),Calendar($C$5,$C$7-1,32))","v":"1900-01-27"},{"$f":"IF($C$7=1,Calendar($C$5-1,12,33),Calendar($C$5,$C$7-1,33))","v":"1900-01-28"},{"$f":"IF($C$7=1,Calendar($C$5-1,12,34),Calendar($C$5,$C$7-1,34))","v":"1900-01-29"},{"$f":"IF($C$7=1,Calendar($C$5-1,12,35),Calendar($C$5,$C$7-1,35))","v":"1900-01-30"}]
[null,{"$f":"IF($C$7=1,Calendar($C$5-1,12,36),Calendar($C$5,$C$7-1,36))","v":"1900-01-31"},{"$f":"IF($C$7=1,Calendar($C$5-1,12,37),Calendar($C$5,$C$7-1,37))","v":""}]
[null,null,null,null,null,null,null,null,null,{"$f":"Calendar($C$5,$C$7,29)","v":"1900-01-28"},{"$f":"IFERROR(IF(AND(J25<>\"\",VLOOKUP(DATE($C$5,$C$7,J25),_공휴일날짜,3,FALSE)<>\"\"),VLOOKUP(DATE($C$5,$C$7,J25),_공휴일날짜,3,FALSE),\"\"),\"\")","v":""},null,null,{"$f":"Calendar($C$5,$C$7,30)","v":"1900-01-29"},{"$f":"IFERROR(IF(AND(N25<>\"\",VLOOKUP(DATE($C$5,$C$7,N25),_공휴일날짜,3,FALSE)<>\"\"),VLOOKUP(DATE($C$5,$C$7,N25),_공휴일날짜,3,FALSE),\"\"),\"\")","v":""},null,null,{"$f":"Calendar($C$5,$C$7,31)","v":"1900-01-30"},{"$f":"IFERROR(IF(AND(R25<>\"\",VLOOKUP(DATE($C$5,$C$7,R25),_공휴일날짜,3,FALSE)<>\"\"),VLOOKUP(DATE($C$5,$C$7,R25),_공휴일날짜,3,FALSE),\"\"),\"\")","v":""},null,null,{"$f":"Calendar($C$5,$C$7,32)","v":""},{"$f":"IFERROR(IF(AND(V25<>\"\",VLOOKUP(DATE($C$5,$C$7,V25),_공휴일날짜,3,FALSE)<>\"\"),VLOOKUP(DATE($C$5,$C$7,V25),_공휴일날짜,3,FALSE),\"\"),\"\")","v":""},null,null,{"$f":"Calendar($C$5,$C$7,33)","v":""},{"$f":"IFERROR(IF(AND(Z25<>\"\",VLOOKUP(DATE($C$5,$C$7,Z25),_공휴일날짜,3,FALSE)<>\"\"),VLOOKUP(DATE($C$5,$C$7,Z25),_공휴일날짜,3,FALSE),\"\"),\"\")","v":""},null,null,{"$f":"Calendar($C$5,$C$7,34)","v":""},{"$f":"IFERROR(IF(AND(AD25<>\"\",VLOOKUP(DATE($C$5,$C$7,AD25),_공휴일날짜,3,FALSE)<>\"\"),VLOOKUP(DATE($C$5,$C$7,AD25),_공휴일날짜,3,FALSE),\"\"),\"\")","v":""},null,null,{"$f":"Calendar($C$5,$C$7,35)","v":""},{"$f":"IFERROR(IF(AND(AH25<>\"\",VLOOKUP(DATE($C$5,$C$7,AH25),_공휴일날짜,3,FALSE)<>\"\"),VLOOKUP(DATE($C$5,$C$7,AH25),_공휴일날짜,3,FALSE),\"\"),\"\")","v":""}]
[null,{"$f":"VLOOKUP($E$26,'달력 설정'!$B$6:$C$17,2,FALSE)","v":"October"},null,null,{"$f":"IF($C$7=12,1,$C$7+1)","v":10}]
[null,"일","월","화","수","목","금","토"]
[null,{"$f":"IF($C$7=12,Calendar($C$5+1,1,1),Calendar($C$5,$C$7+1,1))","v":""},{"$f":"IF($C$7=12,Calendar($C$5+1,1,2),Calendar($C$5,$C$7+1,2))","v":""},{"$f":"IF($C$7=12,Calendar($C$5+1,1,3),Calendar($C$5,$C$7+1,3))","v":""},{"$f":"IF($C$7=12,Calendar($C$5+1,1,4),Calendar($C$5,$C$7+1,4))","v":"1900-01-01"},{"$f":"IF($C$7=12,Calendar($C$5+1,1,5),Calendar($C$5,$C$7+1,5))","v":"1900-01-02"},{"$f":"IF($C$7=12,Calendar($C$5+1,1,6),Calendar($C$5,$C$7+1,6))","v":"1900-01-03"},{"$f":"IF($C$7=12,Calendar($C$5+1,1,7),Calendar($C$5,$C$7+1,7))","v":"1900-01-04"}]
[null,{"$f":"IF($C$7=12,Calendar($C$5+1,1,8),Calendar($C$5,$C$7+1,8))","v":"1900-01-05"},{"$f":"IF($C$7=12,Calendar($C$5+1,1,9),Calendar($C$5,$C$7+1,9))","v":"1900-01-06"},{"$f":"IF($C$7=12,Calendar($C$5+1,1,10),Calendar($C$5,$C$7+1,10))","v":"1900-01-07"},{"$f":"IF($C$7=12,Calendar($C$5+1,1,11),Calendar($C$5,$C$7+1,11))","v":"1900-01-08"},{"$f":"IF($C$7=12,Calendar($C$5+1,1,12),Calendar($C$5,$C$7+1,12))","v":"1900-01-09"},{"$f":"IF($C$7=12,Calendar($C$5+1,1,13),Calendar($C$5,$C$7+1,13))","v":"1900-01-10"},{"$f":"IF($C$7=12,Calendar($C$5+1,1,14),Calendar($C$5,$C$7+1,14))","v":"1900-01-11"}]
[null,{"$f":"IF($C$7=12,Calendar($C$5+1,1,15),Calendar($C$5,$C$7+1,15))","v":"1900-01-12"},{"$f":"IF($C$7=12,Calendar($C$5+1,1,16),Calendar($C$5,$C$7+1,16))","v":"1900-01-13"},{"$f":"IF($C$7=12,Calendar($C$5+1,1,17),Calendar($C$5,$C$7+1,17))","v":"1900-01-14"},{"$f":"IF($C$7=12,Calendar($C$5+1,1,18),Calendar($C$5,$C$7+1,18))","v":"1900-01-15"},{"$f":"IF($C$7=12,Calendar($C$5+1,1,19),Calendar($C$5,$C$7+1,19))","v":"1900-01-16"},{"$f":"IF($C$7=12,Calendar($C$5+1,1,20),Calendar($C$5,$C$7+1,20))","v":"1900-01-17"},{"$f":"IF($C$7=12,Calendar($C$5+1,1,21),Calendar($C$5,$C$7+1,21))","v":"1900-01-18"},null,{"$f":"Calendar($C$5,$C$7,36)","v":""},{"$f":"IFERROR(IF(AND(J30<>\"\",VLOOKUP(DATE($C$5,$C$7,J30),_공휴일날짜,3,FALSE)<>\"\"),VLOOKUP(DATE($C$5,$C$7,J30),_공휴일날짜,3,FALSE),\"\"),\"\")","v":""},null,null,{"$f":"Calendar($C$5,$C$7,37)","v":""},{"$f":"IFERROR(IF(AND(N30<>\"\",VLOOKUP(DATE($C$5,$C$7,N30),_공휴일날짜,3,FALSE)<>\"\"),VLOOKUP(DATE($C$5,$C$7,N30),_공휴일날짜,3,FALSE),\"\"),\"\")","v":""}]
[null,{"$f":"IF($C$7=12,Calendar($C$5+1,1,22),Calendar($C$5,$C$7+1,22))","v":"1900-01-19"},{"$f":"IF($C$7=12,Calendar($C$5+1,1,23),Calendar($C$5,$C$7+1,23))","v":"1900-01-20"},{"$f":"IF($C$7=12,Calendar($C$5+1,1,24),Calendar($C$5,$C$7+1,24))","v":"1900-01-21"},{"$f":"IF($C$7=12,Calendar($C$5+1,1,25),Calendar($C$5,$C$7+1,25))","v":"1900-01-22"},{"$f":"IF($C$7=12,Calendar($C$5+1,1,26),Calendar($C$5,$C$7+1,26))","v":"1900-01-23"},{"$f":"IF($C$7=12,Calendar($C$5+1,1,27),Calendar($C$5,$C$7+1,27))","v":"1900-01-24"},{"$f":"IF($C$7=12,Calendar($C$5+1,1,28),Calendar($C$5,$C$7+1,28))","v":"1900-01-25"}]
[null,{"$f":"IF($C$7=12,Calendar($C$5+1,1,29),Calendar($C$5,$C$7+1,29))","v":"1900-01-26"},{"$f":"IF($C$7=12,Calendar($C$5+1,1,30),Calendar($C$5,$C$7+1,30))","v":"1900-01-27"},{"$f":"IF($C$7=12,Calendar($C$5+1,1,31),Calendar($C$5,$C$7+1,31))","v":"1900-01-28"},{"$f":"IF($C$7=12,Calendar($C$5+1,1,32),Calendar($C$5,$C$7+1,32))","v":"1900-01-29"},{"$f":"IF($C$7=12,Calendar($C$5+1,1,33),Calendar($C$5,$C$7+1,33))","v":"1900-01-30"},{"$f":"IF($C$7=12,Calendar($C$5+1,1,34),Calendar($C$5,$C$7+1,34))","v":"1900-01-31"},{"$f":"IF($C$7=12,Calendar($C$5+1,1,35),Calendar($C$5,$C$7+1,35))","v":""}]
[null,{"$f":"IF($C$7=12,Calendar($C$5+1,1,36),Calendar($C$5,$C$7+1,36))","v":""},{"$f":"IF($C$7=12,Calendar($C$5+1,1,37),Calendar($C$5,$C$7+1,37))","v":""}]

{"sheet":"10월","index":9,"n_rows":33,"n_cols":39,"rows_kept":33,"cut":false,"hidden":false,"merged":[[2,29,3,32],[2,33,3,36],[4,2,5,6],[4,10,4,12],[4,14,4,16],[4,18,4,20],[4,22,4,24],[4,26,4,28],[4,30,4,32],[4,34,4,36],[0,1,2,7],[2,9,3,12],[2,13,3,16],[2,17,3,20],[2,21,3,24],[2,25,3,28],[5,33,5,36],[6,2,11,6],[6,9,6,12],[6,13,6,16],[6,17,6,20],[6,21,6,24],[6,25,6,28],[6,29,6,32],[6,33,6,36],[8,9,8,12],[5,9,5,12],[5,13,5,16],[5,17,5,20],[5,21,5,24],[5,25,5,28],[5,29,5,32],[6,38,6,43],[7,9,7,12],[7,13,7,16],[7,17,7,20],[7,21,7,24],[7,25,7,28],[7,29,7,32],[7,33,7,36],[7,39,7,43],[8,39,8,43],[9,10,9,12],[9,14,9,16],[9,18,9,20],[9,22,9,24],[9,26,9,28],[9,30,9,32],[9,34,9,36],[9,39,9,43],[8,13,8,16],[8,17,8,20],[8,21,8,24],[8,25,8,28],[8,29,8,32],[8,33,8,36],[12,2,13,6],[12,9,12,12],[12,13,12,16],[12,17,12,20],[12,21,12,24],[12,25,12,28],[10,33,10,36],[10,39,10,43],[11,9,11,12],[11,13,11,16],[11,17,11,20],[11,21,11,24],[11,25,11,28],[11,29,11,32],[11,33,11,36],[11,39,11,43],[10,9,10,12],[10,13,10,16],[10,17,10,20],[10,21,10,24],[10,25,10,28],[10,29,10,32],[13,39,13,43],[14,10,14,12],[14,14,14,16],[14,18,14,20],[14,22,14,24],[14,26,14,28],[14,30,14,32],[14,34,14,36],[12,29,12,32],[12,33,12,36],[12,39,12,43],[13,9,13,12],[13,13,13,16],[13,17,13,20],[13,21,13,24],[13,25,13,28],[13,29,13,32],[13,33,13,36],[15,33,15,36],[16,1,16,3],[16,9,16,12],[16,13,16,16],[16,17,16,20],[16,21,16,24],[16,25,16,28],[16,29,16,32],[16,33,16,36],[15,9,15,12],[15,13,15,16],[15,17,15,20],[15,21,15,24],[15,25,15,28],[15,29,15,32],[16,38,16,43],[17,9,17,12],[17,13,17,16],[17,17,17,20],[17,21,17,24],[17,25,17,28],[17,29,17,32],[17,33,17,36],[17,38,17,43],[18,33,18,36],[18,38,18,43],[19,10,19,12],[19,14,19,16],[19,18,19,20],[19,22,19,24],[19,26,19,28],[19,30,19,32],[19,34,19,36],[19,38,19,43],[18,9,18,12],[18,13,18,16],[18,17,18,20],[18,21,18,24],[18,25,18,28],[18,29,18,32],[20,33,20,36],[20,38,20,43],[21,9,21,12],[21,13,21,16],[21,17,21,20],[21,21,21,24],[21,25,21,28],[21,29,21,32],[21,33,21,36],[21,38,21,43],[20,9,20,12],[20,13,20,16],[20,17,20,20],[20,21,20,24],[20,25,20,28],[20,29,20,32],[22,33,22,36],[22,38,22,43],[23,9,23,12],[23,13,23,16],[23,17,23,20],[23,21,23,24],[23,25,23,28],[23,29,23,32],[23,33,23,36],[23,38,23,43],[22,9,22,12],[22,13,22,16],[22,17,22,20],[22,21,22,24],[22,25,22,28],[22,29,22,32],[24,34,24,36],[24,38,24,43],[25,1,25,3],[25,9,25,12],[25,13,25,16],[25,17,25,20],[25,21,25,24],[25,25,25,28],[25,29,25,32],[25,33,25,36],[24,10,24,12],[24,14,24,16],[24,18,24,20],[24,22,24,24],[24,26,24,28],[24,30,24,32],[25,38,25,43],[26,9,26,12],[26,13,26,16],[26,17,26,20],[26,21,26,24],[26,25,26,28],[26,29,26,32],[26,33,26,36],[26,38,26,43],[27,33,27,36],[27,38,27,43],[28,9,28,12],[28,13,28,16],[28,17,28,20],[28,21,28,24],[28,25,28,28],[28,29,28,32],[28,33,28,36],[28,38,28,43],[27,9,27,12],[27,13,27,16],[27,17,27,20],[27,21,27,24],[27,25,27,28],[27,29,27,32],[33,9,33,12],[33,13,33,16],[31,9,31,12],[31,13,31,16],[31,38,31,43],[32,9,32,12],[32,13,32,16],[32,38,32,43],[29,10,29,12],[29,14,29,16],[29,38,29,43],[30,9,30,12],[30,13,30,16],[30,38,30,43]]}
[]
[]
[null,null,null,null,null,null,null,null,null,"일 Sunday",null,null,null,"월 Monday",null,null,null,"화 Tuesday",null,null,null,"수 Wednesday",null,null,null,"목 Thursday",null,null,null,"금 Friday",null,null,null,"토 Saturday"]
[]
[null,null,{"$f":"'달력 설정'!$B$2","v":2025},null,null,null,null,null,null,{"$f":"Calendar($C$5,$C$7,1)","v":""},{"$f":"IFERROR(IF(AND(J5<>\"\",VLOOKUP(DATE($C$5,$C$7,J5),_공휴일날짜,3,FALSE)<>\"\"),VLOOKUP(DATE($C$5,$C$7,J5),_공휴일날짜,3,FALSE),\"\"),\"\")","v":""},null,null,{"$f":"Calendar($C$5,$C$7,2)","v":""},{"$f":"IFERROR(IF(AND(N5<>\"\",VLOOKUP(DATE($C$5,$C$7,N5),_공휴일날짜,3,FALSE)<>\"\"),VLOOKUP(DATE($C$5,$C$7,N5),_공휴일날짜,3,FALSE),\"\"),\"\")","v":""},null,null,{"$f":"Calendar($C$5,$C$7,3)","v":""},{"$f":"IFERROR(IF(AND(R5<>\"\",VLOOKUP(DATE($C$5,$C$7,R5),_공휴일날짜,3,FALSE)<>\"\"),VLOOKUP(DATE($C$5,$C$7,R5),_공휴일날짜,3,FALSE),\"\"),\"\")","v":""},null,null,{"$f":"Calendar($C$5,$C$7,4)","v":"1900-01-01"},{"$f":"IFERROR(IF(AND(V5<>\"\",VLOOKUP(DATE($C$5,$C$7,V5),_공휴일날짜,3,FALSE)<>\"\"),VLOOKUP(DATE($C$5,$C$7,V5),_공휴일날짜,3,FALSE),\"\"),\"\")","v":""},null,null,{"$f":"Calendar($C$5,$C$7,5)","v":"1900-01-02"},{"$f":"IFERROR(IF(AND(Z5<>\"\",VLOOKUP(DATE($C$5,$C$7,Z5),_공휴일날짜,3,FALSE)<>\"\"),VLOOKUP(DATE($C$5,$C$7,Z5),_공휴일날짜,3,FALSE),\"\"),\"\")","v":""},null,null,{"$f":"Calendar($C$5,$C$7,6)","v":"1900-01-03"},{"$f":"IFERROR(IF(AND(AD5<>\"\",VLOOKUP(DATE($C$5,$C$7,AD5),_공휴일날짜,3,FALSE)<>\"\"),VLOOKUP(DATE($C$5,$C$7,AD5),_공휴일날짜,3,FALSE),\"\"),\"\")","v":"개천절"},null,null,{"$f":"Calendar($C$5,$C$7,7)","v":"1900-01-04"},{"$f":"IFERROR(IF(AND(AH5<>\"\",VLOOKUP(DATE($C$5,$C$7,AH5),_공휴일날짜,3,FALSE)<>\"\"),VLOOKUP(DATE($C$5,$C$7,AH5),_공휴일날짜,3,FALSE),\"\"),\"\")","v":""}]
[]
[null,1,10,null,null,null,null,null,null,null,null,null,null,null,null,null,null,null,null,null,null,null,null,null,null,null,null,null,null,null,null,null,null,null,null,null,null,null,"Do It List"]
[null,null,null,null,null,null,null,null,null,null,null,null,null,null,null,null,null,null,null,null,null,null,null,null,null,null,null,null,null,null,null,null,null,null,null,null,null,null,false]
[null,null,null,null,null,null,null,null,null,null,null,null,null,null,null,null,null,null,null,null,null,null,null,null,null,null,null,null,null,null,null,null,null,null,null,null,null,null,false]
[null,null,null,null,null,null,null,null,null,{"$f":"Calendar($C$5,$C$7,8)","v":"1900-01-05"},{"$f":"IFERROR(IF(AND(J10<>\"\",VLOOKUP(DATE($C$5,$C$7,J10),_공휴일날짜,3,FALSE)<>\"\"),VLOOKUP(DATE($C$5,$C$7,J10),_공휴일날짜,3,FALSE),\"\"),\"\")","v":""},null,null,{"$f":"Calendar($C$5,$C$7,9)","v":"1900-01-06"},{"$f":"IFERROR(IF(AND(N10<>\"\",VLOOKUP(DATE($C$5,$C$7,N10),_공휴일날짜,3,FALSE)<>\"\"),VLOOKUP(DATE($C$5,$C$7,N10),_공휴일날짜,3,FALSE),\"\"),\"\")","v":"추석"},null,null,{"$f":"Calendar($C$5,$C$7,10)","v":"1900-01-07"},{"$f":"IFERROR(IF(AND(R10<>\"\",VLOOKUP(DATE($C$5,$C$7,R10),_공휴일날짜,3,FALSE)<>\"\"),VLOOKUP(DATE($C$5,$C$7,R10),_공휴일날짜,3,FALSE),\"\"),\"\")","v":""},null,null,{"$f":"Calendar($C$5,$C$7,11)","v":"1900-01-08"},{"$f":"IFERROR(IF(AND(V10<>\"\",VLOOKUP(DATE($C$5,$C$7,V10),_공휴일날짜,3,FALSE)<>\"\"),VLOOKUP(DATE($C$5,$C$7,V10),_공휴일날짜,3,FALSE),\"\"),\"\")","v":"대체 휴일"},null,null,{"$f":"Calendar($C$5,$C$7,12)","v":"1900-01-09"},{"$f":"IFERROR(IF(AND(Z10<>\"\",VLOOKUP(DATE($C$5,$C$7,Z10),_공휴일날짜,3,FALSE)<>\"\"),VLOOKUP(DATE($C$5,$C$7,Z10),_공휴일날짜,3,FALSE),\"\"),\"\")","v":"한글날"},null,null,{"$f":"Calendar($C$5,$C$7,13)","v":"1900-01-10"},{"$f":"IFERROR(IF(AND(AD10<>\"\",VLOOKUP(DATE($C$5,$C$7,AD10),_공휴일날짜,3,FALSE)<>\"\"),VLOOKUP(DATE($C$5,$C$7,AD10),_공휴일날짜,3,FALSE),\"\"),\"\")","v":""},null,null,{"$f":"Calendar($C$5,$C$7,14)","v":"1900-01-11"},{"$f":"IFERROR(IF(AND(AH10<>\"\",VLOOKUP(DATE($C$5,$C$7,AH10),_공휴일날짜,3,FALSE)<>\"\"),VLOOKUP(DATE($C$5,$C$7,AH10),_공휴일날짜,3,FALSE),\"\"),\"\")","v":""},null,null,null,false]
[null,null,null,null,null,null,null,null,null,null,null,null,null,null,null,null,null,null,null,null,null,null,null,null,null,null,null,null,null,null,null,null,null,null,null,null,null,null,false]
[null,null,null,null,null,null,null,null,null,null,null,null,null,null,null,null,null,null,null,null,null,null,null,null,null,null,null,null,null,null,null,null,null,null,null,null,null,null,false]
[null,null,{"$f":"VLOOKUP($C$7,'달력 설정'!$B$6:$C$17,2,FALSE)","v":"October"},null,null,null,null,null,null,null,null,null,null,null,null,null,null,null,null,null,null,null,null,null,null,null,null,null,null,null,null,null,null,null,null,null,null,null,false]
[null,null,null,null,null,null,null,null,null,null,null,null,null,null,null,null,null,null,null,null,null,null,null,null,null,null,null,null,null,null,null,null,null,null,null,null,null,null,false]
[null,null,null,null,null,null,null,null,null,{"$f":"Calendar($C$5,$C$7,15)","v":"1900-01-12"},{"$f":"IFERROR(IF(AND(J15<>\"\",VLOOKUP(DATE($C$5,$C$7,J15),_공휴일날짜,3,FALSE)<>\"\"),VLOOKUP(DATE($C$5,$C$7,J15),_공휴일날짜,3,FALSE),\"\"),\"\")","v":""},null,null,{"$f":"Calendar($C$5,$C$7,16)","v":"1900-01-13"},{"$f":"IFERROR(IF(AND(N15<>\"\",VLOOKUP(DATE($C$5,$C$7,N15),_공휴일날짜,3,FALSE)<>\"\"),VLOOKUP(DATE($C$5,$C$7,N15),_공휴일날짜,3,FALSE),\"\"),\"\")","v":""},null,null,{"$f":"Calendar($C$5,$C$7,17)","v":"1900-01-14"},{"$f":"IFERROR(IF(AND(R15<>\"\",VLOOKUP(DATE($C$5,$C$7,R15),_공휴일날짜,3,FALSE)<>\"\"),VLOOKUP(DATE($C$5,$C$7,R15),_공휴일날짜,3,FALSE),\"\"),\"\")","v":""},null,null,{"$f":"Calendar($C$5,$C$7,18)","v":"1900-01-15"},{"$f":"IFERROR(IF(AND(V15<>\"\",VLOOKUP(DATE($C$5,$C$7,V15),_공휴일날짜,3,FALSE)<>\"\"),VLOOKUP(DATE($C$5,$C$7,V15),_공휴일날짜,3,FALSE),\"\"),\"\")","v":""},null,null,{"$f":"Calendar($C$5,$C$7,19)","v":"1900-01-16"},{"$f":"IFERROR(IF(AND(Z15<>\"\",VLOOKUP(DATE($C$5,$C$7,Z15),_공휴일날짜,3,FALSE)<>\"\"),VLOOKUP(DATE($C$5,$C$7,Z15),_공휴일날짜,3,FALSE),\"\"),\"\")","v":""},null,null,{"$f":"Calendar($C$5,$C$7,20)","v":"1900-01-17"},{"$f":"IFERROR(IF(AND(AD15<>\"\",VLOOKUP(DATE($C$5,$C$7,AD15),_공휴일날짜,3,FALSE)<>\"\"),VLOOKUP(DATE($C$5,$C$7,AD15),_공휴일날짜,3,FALSE),\"\"),\"\")","v":""},null,null,{"$f":"Calendar($C$5,$C$7,21)","v":"1900-01-18"},{"$f":"IFERROR(IF(AND(AH15<>\"\",VLOOKUP(DATE($C$5,$C$7,AH15),_공휴일날짜,3,FALSE)<>\"\"),VLOOKUP(DATE($C$5,$C$7,AH15),_공휴일날짜,3,FALSE),\"\"),\"\")","v":""}]
[]
[null,{"$f":"VLOOKUP($E$17,'달력 설정'!$B$6:$C$17,2,FALSE)","v":"September"},null,null,{"$f":"IF($C$7=1,12,$C$7-1)","v":9},null,null,null,null,null,null,null,null,null,null,null,null,null,null,null,null,null,null,null,null,null,null,null,null,null,null,null,null,null,null,null,null,null,"MEMO"]
[null,"일","월","화","수","목","금","토"]
[null,{"$f":"IF($C$7=1,Calendar($C$5-1,12,1),Calendar($C$5,$C$7-1,1))","v":""},{"$f":"IF($C$7=1,Calendar($C$5-1,12,2),Calendar($C$5,$C$7-1,2))","v":"1900-01-01"},{"$f":"IF($C$7=1,Calendar($C$5-1,12,3),Calendar($C$5,$C$7-1,3))","v":"1900-01-02"},{"$f":"IF($C$7=1,Calendar($C$5-1,12,4),Calendar($C$5,$C$7-1,4))","v":"1900-01-03"},{"$f":"IF($C$7=1,Calendar($C$5-1,12,5),Calendar($C$5,$C$7-1,5))","v":"1900-01-04"},{"$f":"IF($C$7=1,Calendar($C$5-1,12,6),Calendar($C$5,$C$7-1,6))","v":"1900-01-05"},{"$f":"IF($C$7=1,Calendar($C$5-1,12,7),Calendar($C$5,$C$7-1,7))","v":"1900-01-06"}]
[null,{"$f":"IF($C$7=1,Calendar($C$5-1,12,8),Calendar($C$5,$C$7-1,8))","v":"1900-01-07"},{"$f":"IF($C$7=1,Calendar($C$5-1,12,9),Calendar($C$5,$C$7-1,9))","v":"1900-01-08"},{"$f":"IF($C$7=1,Calendar($C$5-1,12,10),Calendar($C$5,$C$7-1,10))","v":"1900-01-09"},{"$f":"IF($C$7=1,Calendar($C$5-1,12,11),Calendar($C$5,$C$7-1,11))","v":"1900-01-10"},{"$f":"IF($C$7=1,Calendar($C$5-1,12,12),Calendar($C$5,$C$7-1,12))","v":"1900-01-11"},{"$f":"IF($C$7=1,Calendar($C$5-1,12,13),Calendar($C$5,$C$7-1,13))","v":"1900-01-12"},{"$f":"IF($C$7=1,Calendar($C$5-1,12,14),Calendar($C$5,$C$7-1,14))","v":"1900-01-13"},null,{"$f":"Calendar($C$5,$C$7,22)","v":"1900-01-19"},{"$f":"IFERROR(IF(AND(J20<>\"\",VLOOKUP(DATE($C$5,$C$7,J20),_공휴일날짜,3,FALSE)<>\"\"),VLOOKUP(DATE($C$5,$C$7,J20),_공휴일날짜,3,FALSE),\"\"),\"\")","v":""},null,null,{"$f":"Calendar($C$5,$C$7,23)","v":"1900-01-20"},{"$f":"IFERROR(IF(AND(N20<>\"\",VLOOKUP(DATE($C$5,$C$7,N20),_공휴일날짜,3,FALSE)<>\"\"),VLOOKUP(DATE($C$5,$C$7,N20),_공휴일날짜,3,FALSE),\"\"),\"\")","v":""},null,null,{"$f":"Calendar($C$5,$C$7,24)","v":"1900-01-21"},{"$f":"IFERROR(IF(AND(R20<>\"\",VLOOKUP(DATE($C$5,$C$7,R20),_공휴일날짜,3,FALSE)<>\"\"),VLOOKUP(DATE($C$5,$C$7,R20),_공휴일날짜,3,FALSE),\"\"),\"\")","v":""},null,null,{"$f":"Calendar($C$5,$C$7,25)","v":"1900-01-22"},{"$f":"IFERROR(IF(AND(V20<>\"\",VLOOKUP(DATE($C$5,$C$7,V20),_공휴일날짜,3,FALSE)<>\"\"),VLOOKUP(DATE($C$5,$C$7,V20),_공휴일날짜,3,FALSE),\"\"),\"\")","v":""},null,null,{"$f":"Calendar($C$5,$C$7,26)","v":"1900-01-23"},{"$f":"IFERROR(IF(AND(Z20<>\"\",VLOOKUP(DATE($C$5,$C$7,Z20),_공휴일날짜,3,FALSE)<>\"\"),VLOOKUP(DATE($C$5,$C$7,Z20),_공휴일날짜,3,FALSE),\"\"),\"\")","v":""},null,null,{"$f":"Calendar($C$5,$C$7,27)","v":"1900-01-24"},{"$f":"IFERROR(IF(AND(AD20<>\"\",VLOOKUP(DATE($C$5,$C$7,AD20),_공휴일날짜,3,FALSE)<>\"\"),VLOOKUP(DATE($C$5,$C$7,AD20),_공휴일날짜,3,FALSE),\"\"),\"\")","v":""},null,null,{"$f":"Calendar($C$5,$C$7,28)","v":"1900-01-25"},{"$f":"IFERROR(IF(AND(AH20<>\"\",VLOOKUP(DATE($C$5,$C$7,AH20),_공휴일날짜,3,FALSE)<>\"\"),VLOOKUP(DATE($C$5,$C$7,AH20),_공휴일날짜,3,FALSE),\"\"),\"\")","v":""}]
[null,{"$f":"IF($C$7=1,Calendar($C$5-1,12,15),Calendar($C$5,$C$7-1,15))","v":"1900-01-14"},{"$f":"IF($C$7=1,Calendar($C$5-1,12,16),Calendar($C$5,$C$7-1,16))","v":"1900-01-15"},{"$f":"IF($C$7=1,Calendar($C$5-1,12,17),Calendar($C$5,$C$7-1,17))","v":"1900-01-16"},{"$f":"IF($C$7=1,Calendar($C$5-1,12,18),Calendar($C$5,$C$7-1,18))","v":"1900-01-17"},{"$f":"IF($C$7=1,Calendar($C$5-1,12,19),Calendar($C$5,$C$7-1,19))","v":"1900-01-18"},{"$f":"IF($C$7=1,Calendar($C$5-1,12,20),Calendar($C$5,$C$7-1,20))","v":"1900-01-19"},{"$f":"IF($C$7=1,Calendar($C$5-1,12,21),Calendar($C$5,$C$7-1,21))","v":"1900-01-20"}]
[null,{"$f":"IF($C$7=1,Calendar($C$5-1,12,22),Calendar($C$5,$C$7-1,22))","v":"1900-01-21"},{"$f":"IF($C$7=1,Calendar($C$5-1,12,23),Calendar($C$5,$C$7-1,23))","v":"1900-01-22"},{"$f":"IF($C$7=1,Calendar($C$5-1,12,24),Calendar($C$5,$C$7-1,24))","v":"1900-01-23"},{"$f":"IF($C$7=1,Calendar($C$5-1,12,25),Calendar($C$5,$C$7-1,25))","v":"1900-01-24"},{"$f":"IF($C$7=1,Calendar($C$5-1,12,26),Calendar($C$5,$C$7-1,26))","v":"1900-01-25"},{"$f":"IF($C$7=1,Calendar($C$5-1,12,27),Calendar($C$5,$C$7-1,27))","v":"1900-01-26"},{"$f":"IF($C$7=1,Calendar($C$5-1,12,28),Calendar($C$5,$C$7-1,28))","v":"1900-01-27"}]
[null,{"$f":"IF($C$7=1,Calendar($C$5-1,12,29),Calendar($C$5,$C$7-1,29))","v":"1900-01-28"},{"$f":"IF($C$7=1,Calendar($C$5-1,12,30),Calendar($C$5,$C$7-1,30))","v":"1900-01-29"},{"$f":"IF($C$7=1,Calendar($C$5-1,12,31),Calendar($C$5,$C$7-1,31))","v":"1900-01-30"},{"$f":"IF($C$7=1,Calendar($C$5-1,12,32),Calendar($C$5,$C$7-1,32))","v":""},{"$f":"IF($C$7=1,Calendar($C$5-1,12,33),Calendar($C$5,$C$7-1,33))","v":""},{"$f":"IF($C$7=1,Calendar($C$5-1,12,34),Calendar($C$5,$C$7-1,34))","v":""},{"$f":"IF($C$7=1,Calendar($C$5-1,12,35),Calendar($C$5,$C$7-1,35))","v":""}]
[null,{"$f":"IF($C$7=1,Calendar($C$5-1,12,36),Calendar($C$5,$C$7-1,36))","v":""},{"$f":"IF($C$7=1,Calendar($C$5-1,12,37),Calendar($C$5,$C$7-1,37))","v":""}]
[null,null,null,null,null,null,null,null,null,{"$f":"Calendar($C$5,$C$7,29)","v":"1900-01-26"},{"$f":"IFERROR(IF(AND(J25<>\"\",VLOOKUP(DATE($C$5,$C$7,J25),_공휴일날짜,3,FALSE)<>\"\"),VLOOKUP(DATE($C$5,$C$7,J25),_공휴일날짜,3,FALSE),\"\"),\"\")","v":""},null,null,{"$f":"Calendar($C$5,$C$7,30)","v":"1900-01-27"},{"$f":"IFERROR(IF(AND(N25<>\"\",VLOOKUP(DATE($C$5,$C$7,N25),_공휴일날짜,3,FALSE)<>\"\"),VLOOKUP(DATE($C$5,$C$7,N25),_공휴일날짜,3,FALSE),\"\"),\"\")","v":""},null,null,{"$f":"Calendar($C$5,$C$7,31)","v":"1900-01-28"},{"$f":"IFERROR(IF(AND(R25<>\"\",VLOOKUP(DATE($C$5,$C$7,R25),_공휴일날짜,3,FALSE)<>\"\"),VLOOKUP(DATE($C$5,$C$7,R25),_공휴일날짜,3,FALSE),\"\"),\"\")","v":""},null,null,{"$f":"Calendar($C$5,$C$7,32)","v":"1900-01-29"},{"$f":"IFERROR(IF(AND(V25<>\"\",VLOOKUP(DATE($C$5,$C$7,V25),_공휴일날짜,3,FALSE)<>\"\"),VLOOKUP(DATE($C$5,$C$7,V25),_공휴일날짜,3,FALSE),\"\"),\"\")","v":""},null,null,{"$f":"Calendar($C$5,$C$7,33)","v":"1900-01-30"},{"$f":"IFERROR(IF(AND(Z25<>\"\",VLOOKUP(DATE($C$5,$C$7,Z25),_공휴일날짜,3,FALSE)<>\"\"),VLOOKUP(DATE($C$5,$C$7,Z25),_공휴일날짜,3,FALSE),\"\"),\"\")","v":""},null,null,{"$f":"Calendar($C$5,$C$7,34)","v":"1900-01-31"},{"$f":"IFERROR(IF(AND(AD25<>\"\",VLOOKUP(DATE($C$5,$C$7,AD25),_공휴일날짜,3,FALSE)<>\"\"),VLOOKUP(DATE($C$5,$C$7,AD25),_공휴일날짜,3,FALSE),\"\"),\"\")","v":""},null,null,{"$f":"Calendar($C$5,$C$7,35)","v":""},{"$f":"IFERROR(IF(AND(AH25<>\"\",VLOOKUP(DATE($C$5,$C$7,AH25),_공휴일날짜,3,FALSE)<>\"\"),VLOOKUP(DATE($C$5,$C$7,AH25),_공휴일날짜,3,FALSE),\"\"),\"\")","v":""}]
[null,{"$f":"VLOOKUP($E$26,'달력 설정'!$B$6:$C$17,2,FALSE)","v":"November"},null,null,{"$f":"IF($C$7=12,1,$C$7+1)","v":11}]
[null,"일","월","화","수","목","금","토"]
[null,{"$f":"IF($C$7=12,Calendar($C$5+1,1,1),Calendar($C$5,$C$7+1,1))","v":""},{"$f":"IF($C$7=12,Calendar($C$5+1,1,2),Calendar($C$5,$C$7+1,2))","v":""},{"$f":"IF($C$7=12,Calendar($C$5+1,1,3),Calendar($C$5,$C$7+1,3))","v":""},{"$f":"IF($C$7=12,Calendar($C$5+1,1,4),Calendar($C$5,$C$7+1,4))","v":""},{"$f":"IF($C$7=12,Calendar($C$5+1,1,5),Calendar($C$5,$C$7+1,5))","v":""},{"$f":"IF($C$7=12,Calendar($C$5+1,1,6),Calendar($C$5,$C$7+1,6))","v":""},{"$f":"IF($C$7=12,Calendar($C$5+1,1,7),Calendar($C$5,$C$7+1,7))","v":"1900-01-01"}]
[null,{"$f":"IF($C$7=12,Calendar($C$5+1,1,8),Calendar($C$5,$C$7+1,8))","v":"1900-01-02"},{"$f":"IF($C$7=12,Calendar($C$5+1,1,9),Calendar($C$5,$C$7+1,9))","v":"1900-01-03"},{"$f":"IF($C$7=12,Calendar($C$5+1,1,10),Calendar($C$5,$C$7+1,10))","v":"1900-01-04"},{"$f":"IF($C$7=12,Calendar($C$5+1,1,11),Calendar($C$5,$C$7+1,11))","v":"1900-01-05"},{"$f":"IF($C$7=12,Calendar($C$5+1,1,12),Calendar($C$5,$C$7+1,12))","v":"1900-01-06"},{"$f":"IF($C$7=12,Calendar($C$5+1,1,13),Calendar($C$5,$C$7+1,13))","v":"1900-01-07"},{"$f":"IF($C$7=12,Calendar($C$5+1,1,14),Calendar($C$5,$C$7+1,14))","v":"1900-01-08"}]
[null,{"$f":"IF($C$7=12,Calendar($C$5+1,1,15),Calendar($C$5,$C$7+1,15))","v":"1900-01-09"},{"$f":"IF($C$7=12,Calendar($C$5+1,1,16),Calendar($C$5,$C$7+1,16))","v":"1900-01-10"},{"$f":"IF($C$7=12,Calendar($C$5+1,1,17),Calendar($C$5,$C$7+1,17))","v":"1900-01-11"},{"$f":"IF($C$7=12,Calendar($C$5+1,1,18),Calendar($C$5,$C$7+1,18))","v":"1900-01-12"},{"$f":"IF($C$7=12,Calendar($C$5+1,1,19),Calendar($C$5,$C$7+1,19))","v":"1900-01-13"},{"$f":"IF($C$7=12,Calendar($C$5+1,1,20),Calendar($C$5,$C$7+1,20))","v":"1900-01-14"},{"$f":"IF($C$7=12,Calendar($C$5+1,1,21),Calendar($C$5,$C$7+1,21))","v":"1900-01-15"},null,{"$f":"Calendar($C$5,$C$7,36)","v":""},{"$f":"IFERROR(IF(AND(J30<>\"\",VLOOKUP(DATE($C$5,$C$7,J30),_공휴일날짜,3,FALSE)<>\"\"),VLOOKUP(DATE($C$5,$C$7,J30),_공휴일날짜,3,FALSE),\"\"),\"\")","v":""},null,null,{"$f":"Calendar($C$5,$C$7,37)","v":""},{"$f":"IFERROR(IF(AND(N30<>\"\",VLOOKUP(DATE($C$5,$C$7,N30),_공휴일날짜,3,FALSE)<>\"\"),VLOOKUP(DATE($C$5,$C$7,N30),_공휴일날짜,3,FALSE),\"\"),\"\")","v":""}]
[null,{"$f":"IF($C$7=12,Calendar($C$5+1,1,22),Calendar($C$5,$C$7+1,22))","v":"1900-01-16"},{"$f":"IF($C$7=12,Calendar($C$5+1,1,23),Calendar($C$5,$C$7+1,23))","v":"1900-01-17"},{"$f":"IF($C$7=12,Calendar($C$5+1,1,24),Calendar($C$5,$C$7+1,24))","v":"1900-01-18"},{"$f":"IF($C$7=12,Calendar($C$5+1,1,25),Calendar($C$5,$C$7+1,25))","v":"1900-01-19"},{"$f":"IF($C$7=12,Calendar($C$5+1,1,26),Calendar($C$5,$C$7+1,26))","v":"1900-01-20"},{"$f":"IF($C$7=12,Calendar($C$5+1,1,27),Calendar($C$5,$C$7+1,27))","v":"1900-01-21"},{"$f":"IF($C$7=12,Calendar($C$5+1,1,28),Calendar($C$5,$C$7+1,28))","v":"1900-01-22"}]
[null,{"$f":"IF($C$7=12,Calendar($C$5+1,1,29),Calendar($C$5,$C$7+1,29))","v":"1900-01-23"},{"$f":"IF($C$7=12,Calendar($C$5+1,1,30),Calendar($C$5,$C$7+1,30))","v":"1900-01-24"},{"$f":"IF($C$7=12,Calendar($C$5+1,1,31),Calendar($C$5,$C$7+1,31))","v":"1900-01-25"},{"$f":"IF($C$7=12,Calendar($C$5+1,1,32),Calendar($C$5,$C$7+1,32))","v":"1900-01-26"},{"$f":"IF($C$7=12,Calendar($C$5+1,1,33),Calendar($C$5,$C$7+1,33))","v":"1900-01-27"},{"$f":"IF($C$7=12,Calendar($C$5+1,1,34),Calendar($C$5,$C$7+1,34))","v":"1900-01-28"},{"$f":"IF($C$7=12,Calendar($C$5+1,1,35),Calendar($C$5,$C$7+1,35))","v":"1900-01-29"}]
[null,{"$f":"IF($C$7=12,Calendar($C$5+1,1,36),Calendar($C$5,$C$7+1,36))","v":"1900-01-30"},{"$f":"IF($C$7=12,Calendar($C$5+1,1,37),Calendar($C$5,$C$7+1,37))","v":""}]

{"sheet":"11월","index":10,"n_rows":33,"n_cols":39,"rows_kept":33,"cut":false,"hidden":false,"merged":[[2,29,3,32],[2,33,3,36],[4,2,5,6],[4,10,4,12],[4,14,4,16],[4,18,4,20],[4,22,4,24],[4,26,4,28],[4,30,4,32],[4,34,4,36],[0,1,2,7],[2,9,3,12],[2,13,3,16],[2,17,3,20],[2,21,3,24],[2,25,3,28],[5,33,5,36],[6,2,11,6],[6,9,6,12],[6,13,6,16],[6,17,6,20],[6,21,6,24],[6,25,6,28],[6,29,6,32],[6,33,6,36],[8,9,8,12],[5,9,5,12],[5,13,5,16],[5,17,5,20],[5,21,5,24],[5,25,5,28],[5,29,5,32],[6,38,6,43],[7,9,7,12],[7,13,7,16],[7,17,7,20],[7,21,7,24],[7,25,7,28],[7,29,7,32],[7,33,7,36],[7,39,7,43],[8,39,8,43],[9,10,9,12],[9,14,9,16],[9,18,9,20],[9,22,9,24],[9,26,9,28],[9,30,9,32],[9,34,9,36],[9,39,9,43],[8,13,8,16],[8,17,8,20],[8,21,8,24],[8,25,8,28],[8,29,8,32],[8,33,8,36],[12,2,13,6],[12,9,12,12],[12,13,12,16],[12,17,12,20],[12,21,12,24],[12,25,12,28],[10,33,10,36],[10,39,10,43],[11,9,11,12],[11,13,11,16],[11,17,11,20],[11,21,11,24],[11,25,11,28],[11,29,11,32],[11,33,11,36],[11,39,11,43],[10,9,10,12],[10,13,10,16],[10,17,10,20],[10,21,10,24],[10,25,10,28],[10,29,10,32],[13,39,13,43],[14,10,14,12],[14,14,14,16],[14,18,14,20],[14,22,14,24],[14,26,14,28],[14,30,14,32],[14,34,14,36],[12,29,12,32],[12,33,12,36],[12,39,12,43],[13,9,13,12],[13,13,13,16],[13,17,13,20],[13,21,13,24],[13,25,13,28],[13,29,13,32],[13,33,13,36],[15,33,15,36],[16,1,16,3],[16,9,16,12],[16,13,16,16],[16,17,16,20],[16,21,16,24],[16,25,16,28],[16,29,16,32],[16,33,16,36],[15,9,15,12],[15,13,15,16],[15,17,15,20],[15,21,15,24],[15,25,15,28],[15,29,15,32],[16,38,16,43],[17,9,17,12],[17,13,17,16],[17,17,17,20],[17,21,17,24],[17,25,17,28],[17,29,17,32],[17,33,17,36],[17,38,17,43],[18,33,18,36],[18,38,18,43],[19,10,19,12],[19,14,19,16],[19,18,19,20],[19,22,19,24],[19,26,19,28],[19,30,19,32],[19,34,19,36],[19,38,19,43],[18,9,18,12],[18,13,18,16],[18,17,18,20],[18,21,18,24],[18,25,18,28],[18,29,18,32],[20,33,20,36],[20,38,20,43],[21,9,21,12],[21,13,21,16],[21,17,21,20],[21,21,21,24],[21,25,21,28],[21,29,21,32],[21,33,21,36],[21,38,21,43],[20,9,20,12],[20,13,20,16],[20,17,20,20],[20,21,20,24],[20,25,20,28],[20,29,20,32],[22,33,22,36],[22,38,22,43],[23,9,23,12],[23,13,23,16],[23,17,23,20],[23,21,23,24],[23,25,23,28],[23,29,23,32],[23,33,23,36],[23,38,23,43],[22,9,22,12],[22,13,22,16],[22,17,22,20],[22,21,22,24],[22,25,22,28],[22,29,22,32],[24,34,24,36],[24,38,24,43],[25,1,25,3],[25,9,25,12],[25,13,25,16],[25,17,25,20],[25,21,25,24],[25,25,25,28],[25,29,25,32],[25,33,25,36],[24,10,24,12],[24,14,24,16],[24,18,24,20],[24,22,24,24],[24,26,24,28],[24,30,24,32],[25,38,25,43],[26,9,26,12],[26,13,26,16],[26,17,26,20],[26,21,26,24],[26,25,26,28],[26,29,26,32],[26,33,26,36],[26,38,26,43],[27,33,27,36],[27,38,27,43],[28,9,28,12],[28,13,28,16],[28,17,28,20],[28,21,28,24],[28,25,28,28],[28,29,28,32],[28,33,28,36],[28,38,28,43],[27,9,27,12],[27,13,27,16],[27,17,27,20],[27,21,27,24],[27,25,27,28],[27,29,27,32],[33,9,33,12],[33,13,33,16],[31,9,31,12],[31,13,31,16],[31,38,31,43],[32,9,32,12],[32,13,32,16],[32,38,32,43],[29,10,29,12],[29,14,29,16],[29,38,29,43],[30,9,30,12],[30,13,30,16],[30,38,30,43]]}
[]
[]
[null,null,null,null,null,null,null,null,null,"일 Sunday",null,null,null,"월 Monday",null,null,null,"화 Tuesday",null,null,null,"수 Wednesday",null,null,null,"목 Thursday",null,null,null,"금 Friday",null,null,null,"토 Saturday"]
[]
[null,null,{"$f":"'달력 설정'!$B$2","v":2025},null,null,null,null,null,null,{"$f":"Calendar($C$5,$C$7,1)","v":""},{"$f":"IFERROR(IF(AND(J5<>\"\",VLOOKUP(DATE($C$5,$C$7,J5),_공휴일날짜,3,FALSE)<>\"\"),VLOOKUP(DATE($C$5,$C$7,J5),_공휴일날짜,3,FALSE),\"\"),\"\")","v":""},null,null,{"$f":"Calendar($C$5,$C$7,2)","v":""},{"$f":"IFERROR(IF(AND(N5<>\"\",VLOOKUP(DATE($C$5,$C$7,N5),_공휴일날짜,3,FALSE)<>\"\"),VLOOKUP(DATE($C$5,$C$7,N5),_공휴일날짜,3,FALSE),\"\"),\"\")","v":""},null,null,{"$f":"Calendar($C$5,$C$7,3)","v":""},{"$f":"IFERROR(IF(AND(R5<>\"\",VLOOKUP(DATE($C$5,$C$7,R5),_공휴일날짜,3,FALSE)<>\"\"),VLOOKUP(DATE($C$5,$C$7,R5),_공휴일날짜,3,FALSE),\"\"),\"\")","v":""},null,null,{"$f":"Calendar($C$5,$C$7,4)","v":""},{"$f":"IFERROR(IF(AND(V5<>\"\",VLOOKUP(DATE($C$5,$C$7,V5),_공휴일날짜,3,FALSE)<>\"\"),VLOOKUP(DATE($C$5,$C$7,V5),_공휴일날짜,3,FALSE),\"\"),\"\")","v":""},null,null,{"$f":"Calendar($C$5,$C$7,5)","v":""},{"$f":"IFERROR(IF(AND(Z5<>\"\",VLOOKUP(DATE($C$5,$C$7,Z5),_공휴일날짜,3,FALSE)<>\"\"),VLOOKUP(DATE($C$5,$C$7,Z5),_공휴일날짜,3,FALSE),\"\"),\"\")","v":""},null,null,{"$f":"Calendar($C$5,$C$7,6)","v":""},{"$f":"IFERROR(IF(AND(AD5<>\"\",VLOOKUP(DATE($C$5,$C$7,AD5),_공휴일날짜,3,FALSE)<>\"\"),VLOOKUP(DATE($C$5,$C$7,AD5),_공휴일날짜,3,FALSE),\"\"),\"\")","v":""},null,null,{"$f":"Calendar($C$5,$C$7,7)","v":"1900-01-01"},{"$f":"IFERROR(IF(AND(AH5<>\"\",VLOOKUP(DATE($C$5,$C$7,AH5),_공휴일날짜,3,FALSE)<>\"\"),VLOOKUP(DATE($C$5,$C$7,AH5),_공휴일날짜,3,FALSE),\"\"),\"\")","v":""}]
[]
[null,1,11,null,null,null,null,null,null,null,null,null,null,null,null,null,null,null,null,null,null,null,null,null,null,null,null,null,null,null,null,null,null,null,null,null,null,null,"Do It List"]
[null,null,null,null,null,null,null,null,null,null,null,null,null,null,null,null,null,null,null,null,null,null,null,null,null,null,null,null,null,null,null,null,null,null,null,null,null,null,false]
[null,null,null,null,null,null,null,null,null,null,null,null,null,null,null,null,null,null,null,null,null,null,null,null,null,null,null,null,null,null,null,null,null,null,null,null,null,null,false]
[null,null,null,null,null,null,null,null,null,{"$f":"Calendar($C$5,$C$7,8)","v":"1900-01-02"},{"$f":"IFERROR(IF(AND(J10<>\"\",VLOOKUP(DATE($C$5,$C$7,J10),_공휴일날짜,3,FALSE)<>\"\"),VLOOKUP(DATE($C$5,$C$7,J10),_공휴일날짜,3,FALSE),\"\"),\"\")","v":""},null,null,{"$f":"Calendar($C$5,$C$7,9)","v":"1900-01-03"},{"$f":"IFERROR(IF(AND(N10<>\"\",VLOOKUP(DATE($C$5,$C$7,N10),_공휴일날짜,3,FALSE)<>\"\"),VLOOKUP(DATE($C$5,$C$7,N10),_공휴일날짜,3,FALSE),\"\"),\"\")","v":""},null,null,{"$f":"Calendar($C$5,$C$7,10)","v":"1900-01-04"},{"$f":"IFERROR(IF(AND(R10<>\"\",VLOOKUP(DATE($C$5,$C$7,R10),_공휴일날짜,3,FALSE)<>\"\"),VLOOKUP(DATE($C$5,$C$7,R10),_공휴일날짜,3,FALSE),\"\"),\"\")","v":""},null,null,{"$f":"Calendar($C$5,$C$7,11)","v":"1900-01-05"},{"$f":"IFERROR(IF(AND(V10<>\"\",VLOOKUP(DATE($C$5,$C$7,V10),_공휴일날짜,3,FALSE)<>\"\"),VLOOKUP(DATE($C$5,$C$7,V10),_공휴일날짜,3,FALSE),\"\"),\"\")","v":""},null,null,{"$f":"Calendar($C$5,$C$7,12)","v":"1900-01-06"},{"$f":"IFERROR(IF(AND(Z10<>\"\",VLOOKUP(DATE($C$5,$C$7,Z10),_공휴일날짜,3,FALSE)<>\"\"),VLOOKUP(DATE($C$5,$C$7,Z10),_공휴일날짜,3,FALSE),\"\"),\"\")","v":""},null,null,{"$f":"Calendar($C$5,$C$7,13)","v":"1900-01-07"},{"$f":"IFERROR(IF(AND(AD10<>\"\",VLOOKUP(DATE($C$5,$C$7,AD10),_공휴일날짜,3,FALSE)<>\"\"),VLOOKUP(DATE($C$5,$C$7,AD10),_공휴일날짜,3,FALSE),\"\"),\"\")","v":""},null,null,{"$f":"Calendar($C$5,$C$7,14)","v":"1900-01-08"},{"$f":"IFERROR(IF(AND(AH10<>\"\",VLOOKUP(DATE($C$5,$C$7,AH10),_공휴일날짜,3,FALSE)<>\"\"),VLOOKUP(DATE($C$5,$C$7,AH10),_공휴일날짜,3,FALSE),\"\"),\"\")","v":""},null,null,null,false]
[null,null,null,null,null,null,null,null,null,null,null,null,null,null,null,null,null,null,null,null,null,null,null,null,null,null,null,null,null,null,null,null,null,null,null,null,null,null,false]
[null,null,null,null,null,null,null,null,null,null,null,null,null,null,null,null,null,null,null,null,null,null,null,null,null,null,null,null,null,null,null,null,null,null,null,null,null,null,false]
[null,null,{"$f":"VLOOKUP($C$7,'달력 설정'!$B$6:$C$17,2,FALSE)","v":"November"},null,null,null,null,null,null,null,null,null,null,null,null,null,null,null,null,null,null,null,null,null,null,null,null,null,null,null,null,null,null,null,null,null,null,null,false]
[null,null,null,null,null,null,null,null,null,null,null,null,null,null,null,null,null,null,null,null,null,null,null,null,null,null,null,null,null,null,null,null,null,null,null,null,null,null,false]
[null,null,null,null,null,null,null,null,null,{"$f":"Calendar($C$5,$C$7,15)","v":"1900-01-09"},{"$f":"IFERROR(IF(AND(J15<>\"\",VLOOKUP(DATE($C$5,$C$7,J15),_공휴일날짜,3,FALSE)<>\"\"),VLOOKUP(DATE($C$5,$C$7,J15),_공휴일날짜,3,FALSE),\"\"),\"\")","v":""},null,null,{"$f":"Calendar($C$5,$C$7,16)","v":"1900-01-10"},{"$f":"IFERROR(IF(AND(N15<>\"\",VLOOKUP(DATE($C$5,$C$7,N15),_공휴일날짜,3,FALSE)<>\"\"),VLOOKUP(DATE($C$5,$C$7,N15),_공휴일날짜,3,FALSE),\"\"),\"\")","v":""},null,null,{"$f":"Calendar($C$5,$C$7,17)","v":"1900-01-11"},{"$f":"IFERROR(IF(AND(R15<>\"\",VLOOKUP(DATE($C$5,$C$7,R15),_공휴일날짜,3,FALSE)<>\"\"),VLOOKUP(DATE($C$5,$C$7,R15),_공휴일날짜,3,FALSE),\"\"),\"\")","v":""},null,null,{"$f":"Calendar($C$5,$C$7,18)","v":"1900-01-12"},{"$f":"IFERROR(IF(AND(V15<>\"\",VLOOKUP(DATE($C$5,$C$7,V15),_공휴일날짜,3,FALSE)<>\"\"),VLOOKUP(DATE($C$5,$C$7,V15),_공휴일날짜,3,FALSE),\"\"),\"\")","v":""},null,null,{"$f":"Calendar($C$5,$C$7,19)","v":"1900-01-13"},{"$f":"IFERROR(IF(AND(Z15<>\"\",VLOOKUP(DATE($C$5,$C$7,Z15),_공휴일날짜,3,FALSE)<>\"\"),VLOOKUP(DATE($C$5,$C$7,Z15),_공휴일날짜,3,FALSE),\"\"),\"\")","v":""},null,null,{"$f":"Calendar($C$5,$C$7,20)","v":"1900-01-14"},{"$f":"IFERROR(IF(AND(AD15<>\"\",VLOOKUP(DATE($C$5,$C$7,AD15),_공휴일날짜,3,FALSE)<>\"\"),VLOOKUP(DATE($C$5,$C$7,AD15),_공휴일날짜,3,FALSE),\"\"),\"\")","v":""},null,null,{"$f":"Calendar($C$5,$C$7,21)","v":"1900-01-15"},{"$f":"IFERROR(IF(AND(AH15<>\"\",VLOOKUP(DATE($C$5,$C$7,AH15),_공휴일날짜,3,FALSE)<>\"\"),VLOOKUP(DATE($C$5,$C$7,AH15),_공휴일날짜,3,FALSE),\"\"),\"\")","v":""}]
[]
[null,{"$f":"VLOOKUP($E$17,'달력 설정'!$B$6:$C$17,2,FALSE)","v":"October"},null,null,{"$f":"IF($C$7=1,12,$C$7-1)","v":10},null,null,null,null,null,null,null,null,null,null,null,null,null,null,null,null,null,null,null,null,null,null,null,null,null,null,null,null,null,null,null,null,null,"MEMO"]
[null,"일","월","화","수","목","금","토"]
[null,{"$f":"IF($C$7=1,Calendar($C$5-1,12,1),Calendar($C$5,$C$7-1,1))","v":""},{"$f":"IF($C$7=1,Calendar($C$5-1,12,2),Calendar($C$5,$C$7-1,2))","v":""},{"$f":"IF($C$7=1,Calendar($C$5-1,12,3),Calendar($C$5,$C$7-1,3))","v":""},{"$f":"IF($C$7=1,Calendar($C$5-1,12,4),Calendar($C$5,$C$7-1,4))","v":"1900-01-01"},{"$f":"IF($C$7=1,Calendar($C$5-1,12,5),Calendar($C$5,$C$7-1,5))","v":"1900-01-02"},{"$f":"IF($C$7=1,Calendar($C$5-1,12,6),Calendar($C$5,$C$7-1,6))","v":"1900-01-03"},{"$f":"IF($C$7=1,Calendar($C$5-1,12,7),Calendar($C$5,$C$7-1,7))","v":"1900-01-04"}]
[null,{"$f":"IF($C$7=1,Calendar($C$5-1,12,8),Calendar($C$5,$C$7-1,8))","v":"1900-01-05"},{"$f":"IF($C$7=1,Calendar($C$5-1,12,9),Calendar($C$5,$C$7-1,9))","v":"1900-01-06"},{"$f":"IF($C$7=1,Calendar($C$5-1,12,10),Calendar($C$5,$C$7-1,10))","v":"1900-01-07"},{"$f":"IF($C$7=1,Calendar($C$5-1,12,11),Calendar($C$5,$C$7-1,11))","v":"1900-01-08"},{"$f":"IF($C$7=1,Calendar($C$5-1,12,12),Calendar($C$5,$C$7-1,12))","v":"1900-01-09"},{"$f":"IF($C$7=1,Calendar($C$5-1,12,13),Calendar($C$5,$C$7-1,13))","v":"1900-01-10"},{"$f":"IF($C$7=1,Calendar($C$5-1,12,14),Calendar($C$5,$C$7-1,14))","v":"1900-01-11"},null,{"$f":"Calendar($C$5,$C$7,22)","v":"1900-01-16"},{"$f":"IFERROR(IF(AND(J20<>\"\",VLOOKUP(DATE($C$5,$C$7,J20),_공휴일날짜,3,FALSE)<>\"\"),VLOOKUP(DATE($C$5,$C$7,J20),_공휴일날짜,3,FALSE),\"\"),\"\")","v":""},null,null,{"$f":"Calendar($C$5,$C$7,23)","v":"1900-01-17"},{"$f":"IFERROR(IF(AND(N20<>\"\",VLOOKUP(DATE($C$5,$C$7,N20),_공휴일날짜,3,FALSE)<>\"\"),VLOOKUP(DATE($C$5,$C$7,N20),_공휴일날짜,3,FALSE),\"\"),\"\")","v":""},null,null,{"$f":"Calendar($C$5,$C$7,24)","v":"1900-01-18"},{"$f":"IFERROR(IF(AND(R20<>\"\",VLOOKUP(DATE($C$5,$C$7,R20),_공휴일날짜,3,FALSE)<>\"\"),VLOOKUP(DATE($C$5,$C$7,R20),_공휴일날짜,3,FALSE),\"\"),\"\")","v":""},null,null,{"$f":"Calendar($C$5,$C$7,25)","v":"1900-01-19"},{"$f":"IFERROR(IF(AND(V20<>\"\",VLOOKUP(DATE($C$5,$C$7,V20),_공휴일날짜,3,FALSE)<>\"\"),VLOOKUP(DATE($C$5,$C$7,V20),_공휴일날짜,3,FALSE),\"\"),\"\")","v":""},null,null,{"$f":"Calendar($C$5,$C$7,26)","v":"1900-01-20"},{"$f":"IFERROR(IF(AND(Z20<>\"\",VLOOKUP(DATE($C$5,$C$7,Z20),_공휴일날짜,3,FALSE)<>\"\"),VLOOKUP(DATE($C$5,$C$7,Z20),_공휴일날짜,3,FALSE),\"\"),\"\")","v":""},null,null,{"$f":"Calendar($C$5,$C$7,27)","v":"1900-01-21"},{"$f":"IFERROR(IF(AND(AD20<>\"\",VLOOKUP(DATE($C$5,$C$7,AD20),_공휴일날짜,3,FALSE)<>\"\"),VLOOKUP(DATE($C$5,$C$7,AD20),_공휴일날짜,3,FALSE),\"\"),\"\")","v":""},null,null,{"$f":"Calendar($C$5,$C$7,28)","v":"1900-01-22"},{"$f":"IFERROR(IF(AND(AH20<>\"\",VLOOKUP(DATE($C$5,$C$7,AH20),_공휴일날짜,3,FALSE)<>\"\"),VLOOKUP(DATE($C$5,$C$7,AH20),_공휴일날짜,3,FALSE),\"\"),\"\")","v":""}]
[null,{"$f":"IF($C$7=1,Calendar($C$5-1,12,15),Calendar($C$5,$C$7-1,15))","v":"1900-01-12"},{"$f":"IF($C$7=1,Calendar($C$5-1,12,16),Calendar($C$5,$C$7-1,16))","v":"1900-01-13"},{"$f":"IF($C$7=1,Calendar($C$5-1,12,17),Calendar($C$5,$C$7-1,17))","v":"1900-01-14"},{"$f":"IF($C$7=1,Calendar($C$5-1,12,18),Calendar($C$5,$C$7-1,18))","v":"1900-01-15"},{"$f":"IF($C$7=1,Calendar($C$5-1,12,19),Calendar($C$5,$C$7-1,19))","v":"1900-01-16"},{"$f":"IF($C$7=1,Calendar($C$5-1,12,20),Calendar($C$5,$C$7-1,20))","v":"1900-01-17"},{"$f":"IF($C$7=1,Calendar($C$5-1,12,21),Calendar($C$5,$C$7-1,21))","v":"1900-01-18"}]
[null,{"$f":"IF($C$7=1,Calendar($C$5-1,12,22),Calendar($C$5,$C$7-1,22))","v":"1900-01-19"},{"$f":"IF($C$7=1,Calendar($C$5-1,12,23),Calendar($C$5,$C$7-1,23))","v":"1900-01-20"},{"$f":"IF($C$7=1,Calendar($C$5-1,12,24),Calendar($C$5,$C$7-1,24))","v":"1900-01-21"},{"$f":"IF($C$7=1,Calendar($C$5-1,12,25),Calendar($C$5,$C$7-1,25))","v":"1900-01-22"},{"$f":"IF($C$7=1,Calendar($C$5-1,12,26),Calendar($C$5,$C$7-1,26))","v":"1900-01-23"},{"$f":"IF($C$7=1,Calendar($C$5-1,12,27),Calendar($C$5,$C$7-1,27))","v":"1900-01-24"},{"$f":"IF($C$7=1,Calendar($C$5-1,12,28),Calendar($C$5,$C$7-1,28))","v":"1900-01-25"}]
[null,{"$f":"IF($C$7=1,Calendar($C$5-1,12,29),Calendar($C$5,$C$7-1,29))","v":"1900-01-26"},{"$f":"IF($C$7=1,Calendar($C$5-1,12,30),Calendar($C$5,$C$7-1,30))","v":"1900-01-27"},{"$f":"IF($C$7=1,Calendar($C$5-1,12,31),Calendar($C$5,$C$7-1,31))","v":"1900-01-28"},{"$f":"IF($C$7=1,Calendar($C$5-1,12,32),Calendar($C$5,$C$7-1,32))","v":"1900-01-29"},{"$f":"IF($C$7=1,Calendar($C$5-1,12,33),Calendar($C$5,$C$7-1,33))","v":"1900-01-30"},{"$f":"IF($C$7=1,Calendar($C$5-1,12,34),Calendar($C$5,$C$7-1,34))","v":"1900-01-31"},{"$f":"IF($C$7=1,Calendar($C$5-1,12,35),Calendar($C$5,$C$7-1,35))","v":""}]
[null,{"$f":"IF($C$7=1,Calendar($C$5-1,12,36),Calendar($C$5,$C$7-1,36))","v":""},{"$f":"IF($C$7=1,Calendar($C$5-1,12,37),Calendar($C$5,$C$7-1,37))","v":""}]
[null,null,null,null,null,null,null,null,null,{"$f":"Calendar($C$5,$C$7,29)","v":"1900-01-23"},{"$f":"IFERROR(IF(AND(J25<>\"\",VLOOKUP(DATE($C$5,$C$7,J25),_공휴일날짜,3,FALSE)<>\"\"),VLOOKUP(DATE($C$5,$C$7,J25),_공휴일날짜,3,FALSE),\"\"),\"\")","v":""},null,null,{"$f":"Calendar($C$5,$C$7,30)","v":"1900-01-24"},{"$f":"IFERROR(IF(AND(N25<>\"\",VLOOKUP(DATE($C$5,$C$7,N25),_공휴일날짜,3,FALSE)<>\"\"),VLOOKUP(DATE($C$5,$C$7,N25),_공휴일날짜,3,FALSE),\"\"),\"\")","v":""},null,null,{"$f":"Calendar($C$5,$C$7,31)","v":"1900-01-25"},{"$f":"IFERROR(IF(AND(R25<>\"\",VLOOKUP(DATE($C$5,$C$7,R25),_공휴일날짜,3,FALSE)<>\"\"),VLOOKUP(DATE($C$5,$C$7,R25),_공휴일날짜,3,FALSE),\"\"),\"\")","v":""},null,null,{"$f":"Calendar($C$5,$C$7,32)","v":"1900-01-26"},{"$f":"IFERROR(IF(AND(V25<>\"\",VLOOKUP(DATE($C$5,$C$7,V25),_공휴일날짜,3,FALSE)<>\"\"),VLOOKUP(DATE($C$5,$C$7,V25),_공휴일날짜,3,FALSE),\"\"),\"\")","v":""},null,null,{"$f":"Calendar($C$5,$C$7,33)","v":"1900-01-27"},{"$f":"IFERROR(IF(AND(Z25<>\"\",VLOOKUP(DATE($C$5,$C$7,Z25),_공휴일날짜,3,FALSE)<>\"\"),VLOOKUP(DATE($C$5,$C$7,Z25),_공휴일날짜,3,FALSE),\"\"),\"\")","v":""},null,null,{"$f":"Calendar($C$5,$C$7,34)","v":"1900-01-28"},{"$f":"IFERROR(IF(AND(AD25<>\"\",VLOOKUP(DATE($C$5,$C$7,AD25),_공휴일날짜,3,FALSE)<>\"\"),VLOOKUP(DATE($C$5,$C$7,AD25),_공휴일날짜,3,FALSE),\"\"),\"\")","v":""},null,null,{"$f":"Calendar($C$5,$C$7,35)","v":"1900-01-29"},{"$f":"IFERROR(IF(AND(AH25<>\"\",VLOOKUP(DATE($C$5,$C$7,AH25),_공휴일날짜,3,FALSE)<>\"\"),VLOOKUP(DATE($C$5,$C$7,AH25),_공휴일날짜,3,FALSE),\"\"),\"\")","v":""}]
[null,{"$f":"VLOOKUP($E$26,'달력 설정'!$B$6:$C$17,2,FALSE)","v":"December"},null,null,{"$f":"IF($C$7=12,1,$C$7+1)","v":12}]
[null,"일","월","화","수","목","금","토"]
[null,{"$f":"IF($C$7=12,Calendar($C$5+1,1,1),Calendar($C$5,$C$7+1,1))","v":""},{"$f":"IF($C$7=12,Calendar($C$5+1,1,2),Calendar($C$5,$C$7+1,2))","v":"1900-01-01"},{"$f":"IF($C$7=12,Calendar($C$5+1,1,3),Calendar($C$5,$C$7+1,3))","v":"1900-01-02"},{"$f":"IF($C$7=12,Calendar($C$5+1,1,4),Calendar($C$5,$C$7+1,4))","v":"1900-01-03"},{"$f":"IF($C$7=12,Calendar($C$5+1,1,5),Calendar($C$5,$C$7+1,5))","v":"1900-01-04"},{"$f":"IF($C$7=12,Calendar($C$5+1,1,6),Calendar($C$5,$C$7+1,6))","v":"1900-01-05"},{"$f":"IF($C$7=12,Calendar($C$5+1,1,7),Calendar($C$5,$C$7+1,7))","v":"1900-01-06"}]
[null,{"$f":"IF($C$7=12,Calendar($C$5+1,1,8),Calendar($C$5,$C$7+1,8))","v":"1900-01-07"},{"$f":"IF($C$7=12,Calendar($C$5+1,1,9),Calendar($C$5,$C$7+1,9))","v":"1900-01-08"},{"$f":"IF($C$7=12,Calendar($C$5+1,1,10),Calendar($C$5,$C$7+1,10))","v":"1900-01-09"},{"$f":"IF($C$7=12,Calendar($C$5+1,1,11),Calendar($C$5,$C$7+1,11))","v":"1900-01-10"},{"$f":"IF($C$7=12,Calendar($C$5+1,1,12),Calendar($C$5,$C$7+1,12))","v":"1900-01-11"},{"$f":"IF($C$7=12,Calendar($C$5+1,1,13),Calendar($C$5,$C$7+1,13))","v":"1900-01-12"},{"$f":"IF($C$7=12,Calendar($C$5+1,1,14),Calendar($C$5,$C$7+1,14))","v":"1900-01-13"}]
[null,{"$f":"IF($C$7=12,Calendar($C$5+1,1,15),Calendar($C$5,$C$7+1,15))","v":"1900-01-14"},{"$f":"IF($C$7=12,Calendar($C$5+1,1,16),Calendar($C$5,$C$7+1,16))","v":"1900-01-15"},{"$f":"IF($C$7=12,Calendar($C$5+1,1,17),Calendar($C$5,$C$7+1,17))","v":"1900-01-16"},{"$f":"IF($C$7=12,Calendar($C$5+1,1,18),Calendar($C$5,$C$7+1,18))","v":"1900-01-17"},{"$f":"IF($C$7=12,Calendar($C$5+1,1,19),Calendar($C$5,$C$7+1,19))","v":"1900-01-18"},{"$f":"IF($C$7=12,Calendar($C$5+1,1,20),Calendar($C$5,$C$7+1,20))","v":"1900-01-19"},{"$f":"IF($C$7=12,Calendar($C$5+1,1,21),Calendar($C$5,$C$7+1,21))","v":"1900-01-20"},null,{"$f":"Calendar($C$5,$C$7,36)","v":"1900-01-30"},{"$f":"IFERROR(IF(AND(J30<>\"\",VLOOKUP(DATE($C$5,$C$7,J30),_공휴일날짜,3,FALSE)<>\"\"),VLOOKUP(DATE($C$5,$C$7,J30),_공휴일날짜,3,FALSE),\"\"),\"\")","v":""},null,null,{"$f":"Calendar($C$5,$C$7,37)","v":""},{"$f":"IFERROR(IF(AND(N30<>\"\",VLOOKUP(DATE($C$5,$C$7,N30),_공휴일날짜,3,FALSE)<>\"\"),VLOOKUP(DATE($C$5,$C$7,N30),_공휴일날짜,3,FALSE),\"\"),\"\")","v":""}]
[null,{"$f":"IF($C$7=12,Calendar($C$5+1,1,22),Calendar($C$5,$C$7+1,22))","v":"1900-01-21"},{"$f":"IF($C$7=12,Calendar($C$5+1,1,23),Calendar($C$5,$C$7+1,23))","v":"1900-01-22"},{"$f":"IF($C$7=12,Calendar($C$5+1,1,24),Calendar($C$5,$C$7+1,24))","v":"1900-01-23"},{"$f":"IF($C$7=12,Calendar($C$5+1,1,25),Calendar($C$5,$C$7+1,25))","v":"1900-01-24"},{"$f":"IF($C$7=12,Calendar($C$5+1,1,26),Calendar($C$5,$C$7+1,26))","v":"1900-01-25"},{"$f":"IF($C$7=12,Calendar($C$5+1,1,27),Calendar($C$5,$C$7+1,27))","v":"1900-01-26"},{"$f":"IF($C$7=12,Calendar($C$5+1,1,28),Calendar($C$5,$C$7+1,28))","v":"1900-01-27"}]
[null,{"$f":"IF($C$7=12,Calendar($C$5+1,1,29),Calendar($C$5,$C$7+1,29))","v":"1900-01-28"},{"$f":"IF($C$7=12,Calendar($C$5+1,1,30),Calendar($C$5,$C$7+1,30))","v":"1900-01-29"},{"$f":"IF($C$7=12,Calendar($C$5+1,1,31),Calendar($C$5,$C$7+1,31))","v":"1900-01-30"},{"$f":"IF($C$7=12,Calendar($C$5+1,1,32),Calendar($C$5,$C$7+1,32))","v":"1900-01-31"},{"$f":"IF($C$7=12,Calendar($C$5+1,1,33),Calendar($C$5,$C$7+1,33))","v":""},{"$f":"IF($C$7=12,Calendar($C$5+1,1,34),Calendar($C$5,$C$7+1,34))","v":""},{"$f":"IF($C$7=12,Calendar($C$5+1,1,35),Calendar($C$5,$C$7+1,35))","v":""}]
[null,{"$f":"IF($C$7=12,Calendar($C$5+1,1,36),Calendar($C$5,$C$7+1,36))","v":""},{"$f":"IF($C$7=12,Calendar($C$5+1,1,37),Calendar($C$5,$C$7+1,37))","v":""}]

{"sheet":"12월","index":11,"n_rows":33,"n_cols":39,"rows_kept":33,"cut":false,"hidden":false,"merged":[[2,29,3,32],[2,33,3,36],[4,2,5,6],[4,10,4,12],[4,14,4,16],[4,18,4,20],[4,22,4,24],[4,26,4,28],[4,30,4,32],[4,34,4,36],[0,1,2,7],[2,9,3,12],[2,13,3,16],[2,17,3,20],[2,21,3,24],[2,25,3,28],[5,33,5,36],[6,2,11,6],[6,9,6,12],[6,13,6,16],[6,17,6,20],[6,21,6,24],[6,25,6,28],[6,29,6,32],[6,33,6,36],[8,9,8,12],[5,9,5,12],[5,13,5,16],[5,17,5,20],[5,21,5,24],[5,25,5,28],[5,29,5,32],[6,38,6,43],[7,9,7,12],[7,13,7,16],[7,17,7,20],[7,21,7,24],[7,25,7,28],[7,29,7,32],[7,33,7,36],[7,39,7,43],[8,39,8,43],[9,10,9,12],[9,14,9,16],[9,18,9,20],[9,22,9,24],[9,26,9,28],[9,30,9,32],[9,34,9,36],[9,39,9,43],[8,13,8,16],[8,17,8,20],[8,21,8,24],[8,25,8,28],[8,29,8,32],[8,33,8,36],[12,2,13,6],[12,9,12,12],[12,13,12,16],[12,17,12,20],[12,21,12,24],[12,25,12,28],[10,33,10,36],[10,39,10,43],[11,9,11,12],[11,13,11,16],[11,17,11,20],[11,21,11,24],[11,25,11,28],[11,29,11,32],[11,33,11,36],[11,39,11,43],[10,9,10,12],[10,13,10,16],[10,17,10,20],[10,21,10,24],[10,25,10,28],[10,29,10,32],[13,39,13,43],[14,10,14,12],[14,14,14,16],[14,18,14,20],[14,22,14,24],[14,26,14,28],[14,30,14,32],[14,34,14,36],[12,29,12,32],[12,33,12,36],[12,39,12,43],[13,9,13,12],[13,13,13,16],[13,17,13,20],[13,21,13,24],[13,25,13,28],[13,29,13,32],[13,33,13,36],[15,33,15,36],[16,1,16,3],[16,9,16,12],[16,13,16,16],[16,17,16,20],[16,21,16,24],[16,25,16,28],[16,29,16,32],[16,33,16,36],[15,9,15,12],[15,13,15,16],[15,17,15,20],[15,21,15,24],[15,25,15,28],[15,29,15,32],[16,38,16,43],[17,9,17,12],[17,13,17,16],[17,17,17,20],[17,21,17,24],[17,25,17,28],[17,29,17,32],[17,33,17,36],[17,38,17,43],[18,33,18,36],[18,38,18,43],[19,10,19,12],[19,14,19,16],[19,18,19,20],[19,22,19,24],[19,26,19,28],[19,30,19,32],[19,34,19,36],[19,38,19,43],[18,9,18,12],[18,13,18,16],[18,17,18,20],[18,21,18,24],[18,25,18,28],[18,29,18,32],[20,33,20,36],[20,38,20,43],[21,9,21,12],[21,13,21,16],[21,17,21,20],[21,21,21,24],[21,25,21,28],[21,29,21,32],[21,33,21,36],[21,38,21,43],[20,9,20,12],[20,13,20,16],[20,17,20,20],[20,21,20,24],[20,25,20,28],[20,29,20,32],[22,33,22,36],[22,38,22,43],[23,9,23,12],[23,13,23,16],[23,17,23,20],[23,21,23,24],[23,25,23,28],[23,29,23,32],[23,33,23,36],[23,38,23,43],[22,9,22,12],[22,13,22,16],[22,17,22,20],[22,21,22,24],[22,25,22,28],[22,29,22,32],[24,34,24,36],[24,38,24,43],[25,1,25,3],[25,9,25,12],[25,13,25,16],[25,17,25,20],[25,21,25,24],[25,25,25,28],[25,29,25,32],[25,33,25,36],[24,10,24,12],[24,14,24,16],[24,18,24,20],[24,22,24,24],[24,26,24,28],[24,30,24,32],[25,38,25,43],[26,9,26,12],[26,13,26,16],[26,17,26,20],[26,21,26,24],[26,25,26,28],[26,29,26,32],[26,33,26,36],[26,38,26,43],[27,33,27,36],[27,38,27,43],[28,9,28,12],[28,13,28,16],[28,17,28,20],[28,21,28,24],[28,25,28,28],[28,29,28,32],[28,33,28,36],[28,38,28,43],[27,9,27,12],[27,13,27,16],[27,17,27,20],[27,21,27,24],[27,25,27,28],[27,29,27,32],[33,9,33,12],[33,13,33,16],[31,9,31,12],[31,13,31,16],[31,38,31,43],[32,9,32,12],[32,13,32,16],[32,38,32,43],[29,10,29,12],[29,14,29,16],[29,38,29,43],[30,9,30,12],[30,13,30,16],[30,38,30,43]]}
[]
[]
[null,null,null,null,null,null,null,null,null,"일 Sunday",null,null,null,"월 Monday",null,null,null,"화 Tuesday",null,null,null,"수 Wednesday",null,null,null,"목 Thursday",null,null,null,"금 Friday",null,null,null,"토 Saturday"]
[]
[null,null,{"$f":"'달력 설정'!$B$2","v":2025},null,null,null,null,null,null,{"$f":"Calendar($C$5,$C$7,1)","v":""},{"$f":"IFERROR(IF(AND(J5<>\"\",VLOOKUP(DATE($C$5,$C$7,J5),_공휴일날짜,3,FALSE)<>\"\"),VLOOKUP(DATE($C$5,$C$7,J5),_공휴일날짜,3,FALSE),\"\"),\"\")","v":""},null,null,{"$f":"Calendar($C$5,$C$7,2)","v":"1900-01-01"},{"$f":"IFERROR(IF(AND(N5<>\"\",VLOOKUP(DATE($C$5,$C$7,N5),_공휴일날짜,3,FALSE)<>\"\"),VLOOKUP(DATE($C$5,$C$7,N5),_공휴일날짜,3,FALSE),\"\"),\"\")","v":""},null,null,{"$f":"Calendar($C$5,$C$7,3)","v":"1900-01-02"},{"$f":"IFERROR(IF(AND(R5<>\"\",VLOOKUP(DATE($C$5,$C$7,R5),_공휴일날짜,3,FALSE)<>\"\"),VLOOKUP(DATE($C$5,$C$7,R5),_공휴일날짜,3,FALSE),\"\"),\"\")","v":""},null,null,{"$f":"Calendar($C$5,$C$7,4)","v":"1900-01-03"},{"$f":"IFERROR(IF(AND(V5<>\"\",VLOOKUP(DATE($C$5,$C$7,V5),_공휴일날짜,3,FALSE)<>\"\"),VLOOKUP(DATE($C$5,$C$7,V5),_공휴일날짜,3,FALSE),\"\"),\"\")","v":""},null,null,{"$f":"Calendar($C$5,$C$7,5)","v":"1900-01-04"},{"$f":"IFERROR(IF(AND(Z5<>\"\",VLOOKUP(DATE($C$5,$C$7,Z5),_공휴일날짜,3,FALSE)<>\"\"),VLOOKUP(DATE($C$5,$C$7,Z5),_공휴일날짜,3,FALSE),\"\"),\"\")","v":""},null,null,{"$f":"Calendar($C$5,$C$7,6)","v":"1900-01-05"},{"$f":"IFERROR(IF(AND(AD5<>\"\",VLOOKUP(DATE($C$5,$C$7,AD5),_공휴일날짜,3,FALSE)<>\"\"),VLOOKUP(DATE($C$5,$C$7,AD5),_공휴일날짜,3,FALSE),\"\"),\"\")","v":""},null,null,{"$f":"Calendar($C$5,$C$7,7)","v":"1900-01-06"},{"$f":"IFERROR(IF(AND(AH5<>\"\",VLOOKUP(DATE($C$5,$C$7,AH5),_공휴일날짜,3,FALSE)<>\"\"),VLOOKUP(DATE($C$5,$C$7,AH5),_공휴일날짜,3,FALSE),\"\"),\"\")","v":""}]
[]
[null,1,12,null,null,null,null,null,null,null,null,null,null,null,null,null,null,null,null,null,null,null,null,null,null,null,null,null,null,null,null,null,null,null,null,null,null,null,"Do It List"]
[null,null,null,null,null,null,null,null,null,null,null,null,null,null,null,null,null,null,null,null,null,null,null,null,null,null,null,null,null,null,null,null,null,null,null,null,null,null,false]
[null,null,null,null,null,null,null,null,null,null,null,null,null,null,null,null,null,null,null,null,null,null,null,null,null,null,null,null,null,null,null,null,null,null,null,null,null,null,false]
[null,null,null,null,null,null,null,null,null,{"$f":"Calendar($C$5,$C$7,8)","v":"1900-01-07"},{"$f":"IFERROR(IF(AND(J10<>\"\",VLOOKUP(DATE($C$5,$C$7,J10),_공휴일날짜,3,FALSE)<>\"\"),VLOOKUP(DATE($C$5,$C$7,J10),_공휴일날짜,3,FALSE),\"\"),\"\")","v":""},null,null,{"$f":"Calendar($C$5,$C$7,9)","v":"1900-01-08"},{"$f":"IFERROR(IF(AND(N10<>\"\",VLOOKUP(DATE($C$5,$C$7,N10),_공휴일날짜,3,FALSE)<>\"\"),VLOOKUP(DATE($C$5,$C$7,N10),_공휴일날짜,3,FALSE),\"\"),\"\")","v":""},null,null,{"$f":"Calendar($C$5,$C$7,10)","v":"1900-01-09"},{"$f":"IFERROR(IF(AND(R10<>\"\",VLOOKUP(DATE($C$5,$C$7,R10),_공휴일날짜,3,FALSE)<>\"\"),VLOOKUP(DATE($C$5,$C$7,R10),_공휴일날짜,3,FALSE),\"\"),\"\")","v":""},null,null,{"$f":"Calendar($C$5,$C$7,11)","v":"1900-01-10"},{"$f":"IFERROR(IF(AND(V10<>\"\",VLOOKUP(DATE($C$5,$C$7,V10),_공휴일날짜,3,FALSE)<>\"\"),VLOOKUP(DATE($C$5,$C$7,V10),_공휴일날짜,3,FALSE),\"\"),\"\")","v":""},null,null,{"$f":"Calendar($C$5,$C$7,12)","v":"1900-01-11"},{"$f":"IFERROR(IF(AND(Z10<>\"\",VLOOKUP(DATE($C$5,$C$7,Z10),_공휴일날짜,3,FALSE)<>\"\"),VLOOKUP(DATE($C$5,$C$7,Z10),_공휴일날짜,3,FALSE),\"\"),\"\")","v":""},null,null,{"$f":"Calendar($C$5,$C$7,13)","v":"1900-01-12"},{"$f":"IFERROR(IF(AND(AD10<>\"\",VLOOKUP(DATE($C$5,$C$7,AD10),_공휴일날짜,3,FALSE)<>\"\"),VLOOKUP(DATE($C$5,$C$7,AD10),_공휴일날짜,3,FALSE),\"\"),\"\")","v":""},null,null,{"$f":"Calendar($C$5,$C$7,14)","v":"1900-01-13"},{"$f":"IFERROR(IF(AND(AH10<>\"\",VLOOKUP(DATE($C$5,$C$7,AH10),_공휴일날짜,3,FALSE)<>\"\"),VLOOKUP(DATE($C$5,$C$7,AH10),_공휴일날짜,3,FALSE),\"\"),\"\")","v":""},null,null,null,false]
[null,null,null,null,null,null,null,null,null,null,null,null,null,null,null,null,null,null,null,null,null,null,null,null,null,null,null,null,null,null,null,null,null,null,null,null,null,null,false]
[null,null,null,null,null,null,null,null,null,null,null,null,null,null,null,null,null,null,null,null,null,null,null,null,null,null,null,null,null,null,null,null,null,null,null,null,null,null,false]
[null,null,{"$f":"VLOOKUP($C$7,'달력 설정'!$B$6:$C$17,2,FALSE)","v":"December"},null,null,null,null,null,null,null,null,null,null,null,null,null,null,null,null,null,null,null,null,null,null,null,null,null,null,null,null,null,null,null,null,null,null,null,false]
[null,null,null,null,null,null,null,null,null,null,null,null,null,null,null,null,null,null,null,null,null,null,null,null,null,null,null,null,null,null,null,null,null,null,null,null,null,null,false]
[null,null,null,null,null,null,null,null,null,{"$f":"Calendar($C$5,$C$7,15)","v":"1900-01-14"},{"$f":"IFERROR(IF(AND(J15<>\"\",VLOOKUP(DATE($C$5,$C$7,J15),_공휴일날짜,3,FALSE)<>\"\"),VLOOKUP(DATE($C$5,$C$7,J15),_공휴일날짜,3,FALSE),\"\"),\"\")","v":""},null,null,{"$f":"Calendar($C$5,$C$7,16)","v":"1900-01-15"},{"$f":"IFERROR(IF(AND(N15<>\"\",VLOOKUP(DATE($C$5,$C$7,N15),_공휴일날짜,3,FALSE)<>\"\"),VLOOKUP(DATE($C$5,$C$7,N15),_공휴일날짜,3,FALSE),\"\"),\"\")","v":""},null,null,{"$f":"Calendar($C$5,$C$7,17)","v":"1900-01-16"},{"$f":"IFERROR(IF(AND(R15<>\"\",VLOOKUP(DATE($C$5,$C$7,R15),_공휴일날짜,3,FALSE)<>\"\"),VLOOKUP(DATE($C$5,$C$7,R15),_공휴일날짜,3,FALSE),\"\"),\"\")","v":""},null,null,{"$f":"Calendar($C$5,$C$7,18)","v":"1900-01-17"},{"$f":"IFERROR(IF(AND(V15<>\"\",VLOOKUP(DATE($C$5,$C$7,V15),_공휴일날짜,3,FALSE)<>\"\"),VLOOKUP(DATE($C$5,$C$7,V15),_공휴일날짜,3,FALSE),\"\"),\"\")","v":""},null,null,{"$f":"Calendar($C$5,$C$7,19)","v":"1900-01-18"},{"$f":"IFERROR(IF(AND(Z15<>\"\",VLOOKUP(DATE($C$5,$C$7,Z15),_공휴일날짜,3,FALSE)<>\"\"),VLOOKUP(DATE($C$5,$C$7,Z15),_공휴일날짜,3,FALSE),\"\"),\"\")","v":""},null,null,{"$f":"Calendar($C$5,$C$7,20)","v":"1900-01-19"},{"$f":"IFERROR(IF(AND(AD15<>\"\",VLOOKUP(DATE($C$5,$C$7,AD15),_공휴일날짜,3,FALSE)<>\"\"),VLOOKUP(DATE($C$5,$C$7,AD15),_공휴일날짜,3,FALSE),\"\"),\"\")","v":""},null,null,{"$f":"Calendar($C$5,$C$7,21)","v":"1900-01-20"},{"$f":"IFERROR(IF(AND(AH15<>\"\",VLOOKUP(DATE($C$5,$C$7,AH15),_공휴일날짜,3,FALSE)<>\"\"),VLOOKUP(DATE($C$5,$C$7,AH15),_공휴일날짜,3,FALSE),\"\"),\"\")","v":""}]
[]
[null,{"$f":"VLOOKUP($E$17,'달력 설정'!$B$6:$C$17,2,FALSE)","v":"November"},null,null,{"$f":"IF($C$7=1,12,$C$7-1)","v":11},null,null,null,null,null,null,null,null,null,null,null,null,null,null,null,null,null,null,null,null,null,null,null,null,null,null,null,null,null,null,null,null,null,"MEMO"]
[null,"일","월","화","수","목","금","토"]
[null,{"$f":"IF($C$7=1,Calendar($C$5-1,12,1),Calendar($C$5,$C$7-1,1))","v":""},{"$f":"IF($C$7=1,Calendar($C$5-1,12,2),Calendar($C$5,$C$7-1,2))","v":""},{"$f":"IF($C$7=1,Calendar($C$5-1,12,3),Calendar($C$5,$C$7-1,3))","v":""},{"$f":"IF($C$7=1,Calendar($C$5-1,12,4),Calendar($C$5,$C$7-1,4))","v":""},{"$f":"IF($C$7=1,Calendar($C$5-1,12,5),Calendar($C$5,$C$7-1,5))","v":""},{"$f":"IF($C$7=1,Calendar($C$5-1,12,6),Calendar($C$5,$C$7-1,6))","v":""},{"$f":"IF($C$7=1,Calendar($C$5-1,12,7),Calendar($C$5,$C$7-1,7))","v":"1900-01-01"}]
[null,{"$f":"IF($C$7=1,Calendar($C$5-1,12,8),Calendar($C$5,$C$7-1,8))","v":"1900-01-02"},{"$f":"IF($C$7=1,Calendar($C$5-1,12,9),Calendar($C$5,$C$7-1,9))","v":"1900-01-03"},{"$f":"IF($C$7=1,Calendar($C$5-1,12,10),Calendar($C$5,$C$7-1,10))","v":"1900-01-04"},{"$f":"IF($C$7=1,Calendar($C$5-1,12,11),Calendar($C$5,$C$7-1,11))","v":"1900-01-05"},{"$f":"IF($C$7=1,Calendar($C$5-1,12,12),Calendar($C$5,$C$7-1,12))","v":"1900-01-06"},{"$f":"IF($C$7=1,Calendar($C$5-1,12,13),Calendar($C$5,$C$7-1,13))","v":"1900-01-07"},{"$f":"IF($C$7=1,Calendar($C$5-1,12,14),Calendar($C$5,$C$7-1,14))","v":"1900-01-08"},null,{"$f":"Calendar($C$5,$C$7,22)","v":"1900-01-21"},{"$f":"IFERROR(IF(AND(J20<>\"\",VLOOKUP(DATE($C$5,$C$7,J20),_공휴일날짜,3,FALSE)<>\"\"),VLOOKUP(DATE($C$5,$C$7,J20),_공휴일날짜,3,FALSE),\"\"),\"\")","v":""},null,null,{"$f":"Calendar($C$5,$C$7,23)","v":"1900-01-22"},{"$f":"IFERROR(IF(AND(N20<>\"\",VLOOKUP(DATE($C$5,$C$7,N20),_공휴일날짜,3,FALSE)<>\"\"),VLOOKUP(DATE($C$5,$C$7,N20),_공휴일날짜,3,FALSE),\"\"),\"\")","v":""},null,null,{"$f":"Calendar($C$5,$C$7,24)","v":"1900-01-23"},{"$f":"IFERROR(IF(AND(R20<>\"\",VLOOKUP(DATE($C$5,$C$7,R20),_공휴일날짜,3,FALSE)<>\"\"),VLOOKUP(DATE($C$5,$C$7,R20),_공휴일날짜,3,FALSE),\"\"),\"\")","v":""},null,null,{"$f":"Calendar($C$5,$C$7,25)","v":"1900-01-24"},{"$f":"IFERROR(IF(AND(V20<>\"\",VLOOKUP(DATE($C$5,$C$7,V20),_공휴일날짜,3,FALSE)<>\"\"),VLOOKUP(DATE($C$5,$C$7,V20),_공휴일날짜,3,FALSE),\"\"),\"\")","v":""},null,null,{"$f":"Calendar($C$5,$C$7,26)","v":"1900-01-25"},{"$f":"IFERROR(IF(AND(Z20<>\"\",VLOOKUP(DATE($C$5,$C$7,Z20),_공휴일날짜,3,FALSE)<>\"\"),VLOOKUP(DATE($C$5,$C$7,Z20),_공휴일날짜,3,FALSE),\"\"),\"\")","v":"성탄절"},null,null,{"$f":"Calendar($C$5,$C$7,27)","v":"1900-01-26"},{"$f":"IFERROR(IF(AND(AD20<>\"\",VLOOKUP(DATE($C$5,$C$7,AD20),_공휴일날짜,3,FALSE)<>\"\"),VLOOKUP(DATE($C$5,$C$7,AD20),_공휴일날짜,3,FALSE),\"\"),\"\")","v":""},null,null,{"$f":"Calendar($C$5,$C$7,28)","v":"1900-01-27"},{"$f":"IFERROR(IF(AND(AH20<>\"\",VLOOKUP(DATE($C$5,$C$7,AH20),_공휴일날짜,3,FALSE)<>\"\"),VLOOKUP(DATE($C$5,$C$7,AH20),_공휴일날짜,3,FALSE),\"\"),\"\")","v":""}]
[null,{"$f":"IF($C$7=1,Calendar($C$5-1,12,15),Calendar($C$5,$C$7-1,15))","v":"1900-01-09"},{"$f":"IF($C$7=1,Calendar($C$5-1,12,16),Calendar($C$5,$C$7-1,16))","v":"1900-01-10"},{"$f":"IF($C$7=1,Calendar($C$5-1,12,17),Calendar($C$5,$C$7-1,17))","v":"1900-01-11"},{"$f":"IF($C$7=1,Calendar($C$5-1,12,18),Calendar($C$5,$C$7-1,18))","v":"1900-01-12"},{"$f":"IF($C$7=1,Calendar($C$5-1,12,19),Calendar($C$5,$C$7-1,19))","v":"1900-01-13"},{"$f":"IF($C$7=1,Calendar($C$5-1,12,20),Calendar($C$5,$C$7-1,20))","v":"1900-01-14"},{"$f":"IF($C$7=1,Calendar($C$5-1,12,21),Calendar($C$5,$C$7-1,21))","v":"1900-01-15"}]
[null,{"$f":"IF($C$7=1,Calendar($C$5-1,12,22),Calendar($C$5,$C$7-1,22))","v":"1900-01-16"},{"$f":"IF($C$7=1,Calendar($C$5-1,12,23),Calendar($C$5,$C$7-1,23))","v":"1900-01-17"},{"$f":"IF($C$7=1,Calendar($C$5-1,12,24),Calendar($C$5,$C$7-1,24))","v":"1900-01-18"},{"$f":"IF($C$7=1,Calendar($C$5-1,12,25),Calendar($C$5,$C$7-1,25))","v":"1900-01-19"},{"$f":"IF($C$7=1,Calendar($C$5-1,12,26),Calendar($C$5,$C$7-1,26))","v":"1900-01-20"},{"$f":"IF($C$7=1,Calendar($C$5-1,12,27),Calendar($C$5,$C$7-1,27))","v":"1900-01-21"},{"$f":"IF($C$7=1,Calendar($C$5-1,12,28),Calendar($C$5,$C$7-1,28))","v":"1900-01-22"}]
[null,{"$f":"IF($C$7=1,Calendar($C$5-1,12,29),Calendar($C$5,$C$7-1,29))","v":"1900-01-23"},{"$f":"IF($C$7=1,Calendar($C$5-1,12,30),Calendar($C$5,$C$7-1,30))","v":"1900-01-24"},{"$f":"IF($C$7=1,Calendar($C$5-1,12,31),Calendar($C$5,$C$7-1,31))","v":"1900-01-25"},{"$f":"IF($C$7=1,Calendar($C$5-1,12,32),Calendar($C$5,$C$7-1,32))","v":"1900-01-26"},{"$f":"IF($C$7=1,Calendar($C$5-1,12,33),Calendar($C$5,$C$7-1,33))","v":"1900-01-27"},{"$f":"IF($C$7=1,Calendar($C$5-1,12,34),Calendar($C$5,$C$7-1,34))","v":"1900-01-28"},{"$f":"IF($C$7=1,Calendar($C$5-1,12,35),Calendar($C$5,$C$7-1,35))","v":"1900-01-29"}]
[null,{"$f":"IF($C$7=1,Calendar($C$5-1,12,36),Calendar($C$5,$C$7-1,36))","v":"1900-01-30"},{"$f":"IF($C$7=1,Calendar($C$5-1,12,37),Calendar($C$5,$C$7-1,37))","v":""}]
[null,null,null,null,null,null,null,null,null,{"$f":"Calendar($C$5,$C$7,29)","v":"1900-01-28"},{"$f":"IFERROR(IF(AND(J25<>\"\",VLOOKUP(DATE($C$5,$C$7,J25),_공휴일날짜,3,FALSE)<>\"\"),VLOOKUP(DATE($C$5,$C$7,J25),_공휴일날짜,3,FALSE),\"\"),\"\")","v":""},null,null,{"$f":"Calendar($C$5,$C$7,30)","v":"1900-01-29"},{"$f":"IFERROR(IF(AND(N25<>\"\",VLOOKUP(DATE($C$5,$C$7,N25),_공휴일날짜,3,FALSE)<>\"\"),VLOOKUP(DATE($C$5,$C$7,N25),_공휴일날짜,3,FALSE),\"\"),\"\")","v":""},null,null,{"$f":"Calendar($C$5,$C$7,31)","v":"1900-01-30"},{"$f":"IFERROR(IF(AND(R25<>\"\",VLOOKUP(DATE($C$5,$C$7,R25),_공휴일날짜,3,FALSE)<>\"\"),VLOOKUP(DATE($C$5,$C$7,R25),_공휴일날짜,3,FALSE),\"\"),\"\")","v":""},null,null,{"$f":"Calendar($C$5,$C$7,32)","v":"1900-01-31"},{"$f":"IFERROR(IF(AND(V25<>\"\",VLOOKUP(DATE($C$5,$C$7,V25),_공휴일날짜,3,FALSE)<>\"\"),VLOOKUP(DATE($C$5,$C$7,V25),_공휴일날짜,3,FALSE),\"\"),\"\")","v":""},null,null,{"$f":"Calendar($C$5,$C$7,33)","v":""},{"$f":"IFERROR(IF(AND(Z25<>\"\",VLOOKUP(DATE($C$5,$C$7,Z25),_공휴일날짜,3,FALSE)<>\"\"),VLOOKUP(DATE($C$5,$C$7,Z25),_공휴일날짜,3,FALSE),\"\"),\"\")","v":""},null,null,{"$f":"Calendar($C$5,$C$7,34)","v":""},{"$f":"IFERROR(IF(AND(AD25<>\"\",VLOOKUP(DATE($C$5,$C$7,AD25),_공휴일날짜,3,FALSE)<>\"\"),VLOOKUP(DATE($C$5,$C$7,AD25),_공휴일날짜,3,FALSE),\"\"),\"\")","v":""},null,null,{"$f":"Calendar($C$5,$C$7,35)","v":""},{"$f":"IFERROR(IF(AND(AH25<>\"\",VLOOKUP(DATE($C$5,$C$7,AH25),_공휴일날짜,3,FALSE)<>\"\"),VLOOKUP(DATE($C$5,$C$7,AH25),_공휴일날짜,3,FALSE),\"\"),\"\")","v":""}]
[null,{"$f":"VLOOKUP($E$26,'달력 설정'!$B$6:$C$17,2,FALSE)","v":"January"},null,null,{"$f":"IF($C$7=12,1,$C$7+1)","v":1}]
[null,"일","월","화","수","목","금","토"]
[null,{"$f":"IF($C$7=12,Calendar($C$5+1,1,1),Calendar($C$5,$C$7+1,1))","v":""},{"$f":"IF($C$7=12,Calendar($C$5+1,1,2),Calendar($C$5,$C$7+1,2))","v":""},{"$f":"IF($C$7=12,Calendar($C$5+1,1,3),Calendar($C$5,$C$7+1,3))","v":""},{"$f":"IF($C$7=12,Calendar($C$5+1,1,4),Calendar($C$5,$C$7+1,4))","v":""},{"$f":"IF($C$7=12,Calendar($C$5+1,1,5),Calendar($C$5,$C$7+1,5))","v":"1900-01-01"},{"$f":"IF($C$7=12,Calendar($C$5+1,1,6),Calendar($C$5,$C$7+1,6))","v":"1900-01-02"},{"$f":"IF($C$7=12,Calendar($C$5+1,1,7),Calendar($C$5,$C$7+1,7))","v":"1900-01-03"}]
[null,{"$f":"IF($C$7=12,Calendar($C$5+1,1,8),Calendar($C$5,$C$7+1,8))","v":"1900-01-04"},{"$f":"IF($C$7=12,Calendar($C$5+1,1,9),Calendar($C$5,$C$7+1,9))","v":"1900-01-05"},{"$f":"IF($C$7=12,Calendar($C$5+1,1,10),Calendar($C$5,$C$7+1,10))","v":"1900-01-06"},{"$f":"IF($C$7=12,Calendar($C$5+1,1,11),Calendar($C$5,$C$7+1,11))","v":"1900-01-07"},{"$f":"IF($C$7=12,Calendar($C$5+1,1,12),Calendar($C$5,$C$7+1,12))","v":"1900-01-08"},{"$f":"IF($C$7=12,Calendar($C$5+1,1,13),Calendar($C$5,$C$7+1,13))","v":"1900-01-09"},{"$f":"IF($C$7=12,Calendar($C$5+1,1,14),Calendar($C$5,$C$7+1,14))","v":"1900-01-10"}]
[null,{"$f":"IF($C$7=12,Calendar($C$5+1,1,15),Calendar($C$5,$C$7+1,15))","v":"1900-01-11"},{"$f":"IF($C$7=12,Calendar($C$5+1,1,16),Calendar($C$5,$C$7+1,16))","v":"1900-01-12"},{"$f":"IF($C$7=12,Calendar($C$5+1,1,17),Calendar($C$5,$C$7+1,17))","v":"1900-01-13"},{"$f":"IF($C$7=12,Calendar($C$5+1,1,18),Calendar($C$5,$C$7+1,18))","v":"1900-01-14"},{"$f":"IF($C$7=12,Calendar($C$5+1,1,19),Calendar($C$5,$C$7+1,19))","v":"1900-01-15"},{"$f":"IF($C$7=12,Calendar($C$5+1,1,20),Calendar($C$5,$C$7+1,20))","v":"1900-01-16"},{"$f":"IF($C$7=12,Calendar($C$5+1,1,21),Calendar($C$5,$C$7+1,21))","v":"1900-01-17"},null,{"$f":"Calendar($C$5,$C$7,36)","v":""},{"$f":"IFERROR(IF(AND(J30<>\"\",VLOOKUP(DATE($C$5,$C$7,J30),_공휴일날짜,3,FALSE)<>\"\"),VLOOKUP(DATE($C$5,$C$7,J30),_공휴일날짜,3,FALSE),\"\"),\"\")","v":""},null,null,{"$f":"Calendar($C$5,$C$7,37)","v":""},{"$f":"IFERROR(IF(AND(N30<>\"\",VLOOKUP(DATE($C$5,$C$7,N30),_공휴일날짜,3,FALSE)<>\"\"),VLOOKUP(DATE($C$5,$C$7,N30),_공휴일날짜,3,FALSE),\"\"),\"\")","v":""}]
[null,{"$f":"IF($C$7=12,Calendar($C$5+1,1,22),Calendar($C$5,$C$7+1,22))","v":"1900-01-18"},{"$f":"IF($C$7=12,Calendar($C$5+1,1,23),Calendar($C$5,$C$7+1,23))","v":"1900-01-19"},{"$f":"IF($C$7=12,Calendar($C$5+1,1,24),Calendar($C$5,$C$7+1,24))","v":"1900-01-20"},{"$f":"IF($C$7=12,Calendar($C$5+1,1,25),Calendar($C$5,$C$7+1,25))","v":"1900-01-21"},{"$f":"IF($C$7=12,Calendar($C$5+1,1,26),Calendar($C$5,$C$7+1,26))","v":"1900-01-22"},{"$f":"IF($C$7=12,Calendar($C$5+1,1,27),Calendar($C$5,$C$7+1,27))","v":"1900-01-23"},{"$f":"IF($C$7=12,Calendar($C$5+1,1,28),Calendar($C$5,$C$7+1,28))","v":"1900-01-24"}]
[null,{"$f":"IF($C$7=12,Calendar($C$5+1,1,29),Calendar($C$5,$C$7+1,29))","v":"1900-01-25"},{"$f":"IF($C$7=12,Calendar($C$5+1,1,30),Calendar($C$5,$C$7+1,30))","v":"1900-01-26"},{"$f":"IF($C$7=12,Calendar($C$5+1,1,31),Calendar($C$5,$C$7+1,31))","v":"1900-01-27"},{"$f":"IF($C$7=12,Calendar($C$5+1,1,32),Calendar($C$5,$C$7+1,32))","v":"1900-01-28"},{"$f":"IF($C$7=12,Calendar($C$5+1,1,33),Calendar($C$5,$C$7+1,33))","v":"1900-01-29"},{"$f":"IF($C$7=12,Calendar($C$5+1,1,34),Calendar($C$5,$C$7+1,34))","v":"1900-01-30"},{"$f":"IF($C$7=12,Calendar($C$5+1,1,35),Calendar($C$5,$C$7+1,35))","v":"1900-01-31"}]
[null,{"$f":"IF($C$7=12,Calendar($C$5+1,1,36),Calendar($C$5,$C$7+1,36))","v":""},{"$f":"IF($C$7=12,Calendar($C$5+1,1,37),Calendar($C$5,$C$7+1,37))","v":""}]

{"sheet":"달력 설정","index":12,"n_rows":52,"n_cols":7,"rows_kept":52,"cut":false,"hidden":false,"merged":[[4,1,4,2],[0,4,0,6],[0,1,0,2],[1,1,2,2]]}
[null,"연도 설정",null,null,"공휴일 설정"]
[null,2025,null,null,"날짜","휴일","내용"]
[null,null,null,null,"2025-01-01","Y","신정"]
[null,null,null,null,"2025-01-28","Y"]
[null,"월별 표기",null,null,"2025-01-29","Y","설날"]
[null,1,"January",null,"2025-01-30","Y"]
[null,2,"February",null,"2025-03-01","Y","삼일절"]
[null,3,"March",null,"2025-03-03","Y","대체 휴일"]
[null,4,"April",null,"2025-05-05","Y","부처님오신날,어린이날"]
[null,5,"May",null,"2025-05-06","Y","대체 휴일"]
[null,6,"June",null,"2025-06-06","Y","현충일"]
[null,7,"July",null,"2025-08-15","Y","광복절"]
[null,8,"August",null,"2025-10-03","Y","개천절"]
[null,9,"September",null,"2025-10-06","Y","추석"]
[null,10,"October",null,"2025-10-07","Y"]
[null,11,"November",null,"2025-10-08","Y","대체 휴일"]
[null,12,"December",null,"2025-10-09","Y","한글날"]
[null,null,null,null,"2025-12-25","Y","성탄절"]
[null,null,null,null,null,"N"]
[null,null,null,null,null,"N"]
[null,null,null,null,null,"N"]
[null,null,null,null,null,"N"]
[null,null,null,null,null,"N"]
[null,null,null,null,null,"N"]
[null,null,null,null,null,"N"]
[null,null,null,null,null,"N"]
[null,null,null,null,null,"N"]
[null,null,null,null,null,"N"]
[null,null,null,null,null,"N"]
[null,null,null,null,null,"N"]
[null,null,null,null,null,"N"]
[null,null,null,null,null,"N"]
[null,null,null,null,null,"N"]
[null,null,null,null,null,"N"]
[null,null,null,null,null,"N"]
[null,null,null,null,null,"N"]
[null,null,null,null,null,"N"]
[null,null,null,null,null,"N"]
[null,null,null,null,null,"N"]
[null,null,null,null,null,"N"]
[null,null,null,null,null,"N"]
[null,null,null,null,null,"N"]
[null,null,null,null,null,"N"]
[null,null,null,null,null,"N"]
[null,null,null,null,null,"N"]
[null,null,null,null,null,"N"]
[null,null,null,null,null,"N"]
[null,null,null,null,null,"N"]
[null,null,null,null,null,"N"]
[null,null,null,null,null,"N"]
[null,null,null,null,null,"N"]
[null,null,null,null,null,"N"]