{"text_format":"1","workbook":"xlsx","n_sheets":2,"sheets":["Deflection Calc","Data"],"not_rendered":{"charts":0,"images":4,"macros":1,"external_links":0,"defined_names":23,"comments":0,"pivot_tables":0},"unopened":[],"bounds":{"document_bytes":16777216,"sheet_cells":100000,"rows_first":2000,"rows_last":500,"rows_between":2000,"halvings":0,"cell_chars":16384,"cell_head_chars":4096},"cells_cut":0,"cells_raw":0,"read":"whole","date_system":"1900"}

{"sheet":"Deflection Calc","index":0,"n_rows":39,"n_cols":33,"rows_kept":39,"cut":false,"hidden":false,"merged":[[2,11,4,15],[5,0,5,8],[7,11,8,26],[9,12,10,15],[11,0,12,2],[11,18,11,24],[12,18,12,24],[11,15,11,17],[12,15,12,17],[14,15,14,17],[14,19,14,21],[15,15,15,17],[15,19,15,21],[16,19,16,21],[23,3,23,4],[24,3,24,4],[24,6,24,7],[32,3,32,4],[34,3,34,4],[35,3,35,4],[36,0,37,8],[41,3,41,5],[11,5,12,7],[13,0,13,8],[14,0,15,2],[17,4,17,5],[18,2,18,7],[19,4,19,5],[23,6,23,7],[24,19,24,21],[26,19,26,21],[26,23,26,25],[26,27,26,28],[17,19,17,21],[19,19,19,21],[19,26,20,33],[20,19,20,21],[21,19,21,21],[23,19,23,21],[25,27,25,28],[26,15,26,17],[27,15,27,17],[27,19,27,21],[27,23,27,25],[27,27,27,28],[28,19,28,21],[28,23,28,25],[28,27,28,28],[16,15,16,17],[17,15,17,17],[19,16,19,17],[20,16,20,17],[21,16,21,17],[23,16,23,17],[24,16,24,17],[28,15,28,17]]}
[]
[]
[null," Industrial",null,null,null,"Electric Drives",null,null,null,null,null,"Linear Motion and                    Assembly Technologies",null,null,null,null,"Pneumatics",null,null,"Service",null,null,"Moblie"]
[null," Hydraulics",null,null,null,"and Controls",null,null,null,null,null,null,null,null,null,null,null,null,null,"Automation",null,null,"Hydraulics"]
[]
["Profile Deflection Input"]
[]
[null,null,null,null,null,null,null,null,null,null,null,"Rexroth Profile Deflection Calculator"]
["Profile"]
[null,null,null,null,null,null,null,"Y",null,null,null,null,"Calculation Results"]
[null,null,null,null,null,null,null,"X"]
["Force Orientation",null,null,null,null,null,null,null,null,null,null,null,"Bundle ",null,null,{"$f":"INDEX(Data!$A$3:$Z$152,MATCH(Data!AN1,Data!$A$3:$A$162,0),21)","v":3842509658},null,null,{"$f":"INDEX(Data!$A$3:$Z$152,MATCH(Data!AN1,Data!$A$3:$A$162,0),22)","v":"PROFILE 90X90 PKG06 5.6M "}]
[null,null,null,null,null,null,null,null,null,null,null,null,"Single",null,null,{"$f":"INDEX(Data!$A$3:$Z$152,MATCH(Data!AN1,Data!$A$3:$A$162,0),23)","v":3842509659},null,null,{"$f":"INDEX(Data!$A$3:$Z$152,MATCH(Data!AN1,Data!$A$3:$A$162,0),24)","v":"PROFILE 90X90 5600MM "}]
["See below for sample orientation"]
["Force Units",null,null,null,null,null,null,null,null,null,null,null,"Strut Size",null,null,{"$f":"D25&\" X \"&D24","v":"90 X 90"},null,null,"mm",{"$f":"ROUND((D25/25.4),3)&\" X \"&ROUND((D24/25.4),3)","v":"3.543 X 3.543"},null,null,"in"]
[null,null,null,null,null,null,null,null,null,null,null,null,"Strut Weight",null,null,20.0,null,null,"kg",{"$f":"ROUNDDOWN(((E18/25.4)/12)*T24,2)","v":13.9},null,null,"lbs"]
[null,null,null,null,null,null,null,null,null,null,null,null,"Strut Length",null,null,{"$f":"IF(Data!AP2=2,E18*25.4,E18)","v":1000},null,null,"mm",{"$f":"ROUND((P17/25.4),2)","v":39.37},null,null,"in"]
["Length of Profile",null,null,null,1000.0,null,{"$f":"IF(Data!AP2=1,\"mm\",\"in\")","v":"mm"},null,null,null,null,null,"Force",null,null,{"$f":"IF(Data!AP2=2,E20*4.448,E20)","v":10},null,null,"N",{"$f":"ROUNDDOWN((P18*0.2248),2)","v":2.24},null,null,"lbs"]
[null,null,{"$f":"IF(E18>INDEX(Data!A3:Z152,MATCH(Data!AN1,Data!$A$3:$A$152,0),Data!AP2+24),\"PROFILE LENGTH ERROR\",\"\")","v":""}]
["Force",null,null,null,10.0,null,{"$f":"IF(Data!AP2=1,\"N\",\"lb\")","v":"N"},null,null,null,null,null,"Profile Surface",null,null,null,{"$f":"INDEX(Data!A3:Z152,MATCH(Data!AN1,Data!$A$3:$A$152,0),9)","v":23.5},null,"cm2",{"$f":"INDEX(Data!A3:Z152,MATCH(Data!AN1,Data!$A$3:$A$152,0),18)","v":3.64250705},null,null,"in2",null,null,null,"For Everything to Build Anything Web Access                     Click on Photo"]
[null,null,null,null,null,null,null,null,null,null,null,null,"Moment of Inertia 'X'",null,null,null,{"$f":"INDEX(Data!A3:Z152,MATCH(Data!AN1,Data!$A$3:$A$152,0),5)","v":211.1},null,"cm4",{"$f":"INDEX(Data!A3:Z152,MATCH(Data!AN1,Data!$A$3:$A$152,0),14)","v":5.072733},null,null,"in3"]
[null,null,null,null,null,null,null,null,null,null,null,null,"Moment of Inertia 'Y'",null,null,null,{"$f":"INDEX(Data!A3:Z152,MATCH(Data!AN1,Data!$A$3:$A$152,0),6)","v":211.1},null,"cm4",{"$f":"INDEX(Data!A3:Z152,MATCH(Data!AN1,Data!$A$3:$A$152,0),15)","v":5.072733},null,null,"in3"]
[]
["Y (Vertical)",null,null,{"$f":"INDEX(Data!$A$3:$K$152,MATCH(Data!AN1,Data!$A$3:$A$152,0),3)","v":90},null,"mm",{"$f":"INDEX(Data!B3:Z152,MATCH(Data!AN1,Data!$A$3:$A$152,0),11)","v":3.543307087},null,"in",null,null,null,"Weight",null,null,null,{"$f":"INDEX(Data!$A$3:$K$152,MATCH(Data!AN1,Data!$A$3:$A$152,0),10)","v":6.3},null,"kg/m",{"$f":"INDEX(Data!A3:Z152,MATCH(Data!AN1,Data!$A$3:$A$152,0),19)","v":4.23675},null,null,"lb/ft"]
["X (Horizontal)",null,null,{"$f":"INDEX(Data!$A$3:$K$152,MATCH(Data!AN1,Data!$A$3:$A$152,0),4)","v":90},null,"mm",{"$f":"INDEX(Data!B3:Z152,MATCH(Data!AN1,Data!$A$3:$A$152,0),12)","v":3.543307087},null,"in",null,null,null,"Modulus of  Elasticity",null,null,null,70000.0,null,"N/mm2","10x102",null,null,"lb/in2"]
[null,null,null,null,null,null,null,null,null,null,null,null,null,null,null,null,null,null,null,null,null,null,null,null,null,null,null,"Pass / Fail"]
[null,null,null,null,null,null,null,null,null,null,null,null,"Deflection 1",null,null,{"$f":"ROUNDDOWN((P18*(P17)^3)/((3*Q25)*(IF(Data!AN2<>1,Q21,Q22))*(10^4)),2)","v":0.02},null,null,"mm",{"$f":"ROUNDDOWN(P27/25.4,3)","v":0},null,null,"in",{"$f":"P27/IF(Data!AN2<>2,D24,D25)","v":0.0002222222222},null,null,1.0,{"$f":"IF(X27<=0.1,\"Pass\",\"FAIL\")","v":"Pass"}]
[null,null,null,null,null,null,null,null,null,null,null,null,"Deflection 2",null,null,{"$f":"ROUNDDOWN((P18*(P17)^3)/((48*Q25)*(IF(Data!AN2<>1,Q21,Q22))*(10^4)),2)","v":0},null,null,"mm",0,null,null,"in",{"$f":"P28/IF(Data!AN2<>2,D24,D25)","v":0},null,null,2.0,"Pass"]
[null,null,null,null,null,null,null,null,null,null,null,null,"Deflection 3",null,null,{"$f":"ROUNDDOWN((P18*(P17)^3)/((192*Q25)*(IF(Data!AN2<>1,Q21,Q22))*(10^4)),2)","v":0},null,null,"mm",0,null,null,"in",{"$f":"P29/IF(Data!AN2<>2,D24,D25)","v":0},null,null,3.0,"Pass"]
[]
[]
[]
[]
[null,null,null,null,null,null,null,null,null,null,null,null,null,null,null,null,null,null,null,null,null,"BOSCH REXROTH CORPORATION"]
[null,null,null,null,null,null,null,null,null,null,null,null,null,null,null,null,null,null,null,null,null,"LINEAR MOTION AND ASSEMBLY TECHNOLOGIES"]
[null,null,null,null,null,null,null,null,null,null,null,null,null,null,null,null,null,null,null,null,null,"816 East Third Street"]
[null,null,null,null,null,null,null,null,null,null,null,null,null,null,null,null,null,null,null,null,null,"Buchanan, MI 49107"]
[null,null,null,null,null,null,null,null,null,null,null,null,null,null,null,null,null,null,null,null,"(269) 695-0151",null,"(800) 322-6724"]
[null,null,null,null,null,null,null,null,null,null,null,null,null,null,null,null,null,null,null,null,null,"Fax: (269) 695-5363",null,null,null,null,null,null,null,null,null,null,"V2.1.11/07"]

{"sheet":"Data","index":1,"n_rows":116,"n_cols":46,"rows_kept":116,"cut":false,"hidden":true,"merged":[[4,34,11,34],[4,36,11,36]]}
["Number","Size","Height","Width","Ix","Iy","Wx","Wy","AREA","Weight","Modulus","Height","Width","Ix","Iy","Wx","Wy","Area","Weight","Modulus","Bundle ",null,"Single",null,null,null,null,null,null,null,null,null,null,null,null,null,null,null,null,92.0,"mm,  N"]
[null,null,"mm","mm","cm4","cm4","cm3","cm3","cm2","kg/m","N/mm2","in","in","in4","in4","in3","in3","in2","lbs/ft","lb/in2","Part number","Description","Part Number","Description",null,null,null,null,null,null,null,null,null,null,null,null,null,null,null,1.0,"in,  lb",1.0]
[1.0,"11x20",20.0,11.0,0.52,0.13,0.7,0.3,1.0,0.3,70000.0,0.7874015748031497,0.4330708661417323,0.0124956,0.0031239,0.042716632,0.018307128,0.1550003,0.20174999999999998,"10x106",3.842513581E9,"PROFILE 11X20 PKG10 2M",3.842513582E9,"PROFILE 11X20 2000MM",2000.0,78.74015748031496]
[2.0,"15x22.5",22.5,15.0,0.81,0.34,0.9,0.6,1.2,0.3,70000.0,0.8858267716535434,0.5905511811023623,0.0194643,0.0081702,0.054921384000000004,0.036614256,0.18600036,0.20174999999999998,"10x106",3.842513576E9,"PROFILE 15X22.5 PKG10 2M",3.842513577E9,"PROFILE 15X22.5 2000MM",2000.0,78.74015748031496]
[3.0,"15x30",30.0,15.0,2.51,2.04,null,null,2.01,null,70000.0,1.1811023622047245,0.5905511811023623,0.060315299999999995,0.0490212,0.0,0.0,0.311550603,0.0,"10x106","NA","NA",3.842191147E9,"PROFILE, HANGING  3000MM",3000.0,118.11,null,null,null,null,null,null,null,null,null,null,null,null,null,null,null,null,null,null,null,"Deflection Calculator"]
[4.0,"20x20",20.0,20.0,0.67,0.67,0.67,0.67,1.6,0.4,70000.0,0.7874015748031497,0.7874015748031497,0.0161001,0.0161001,0.0408859192,0.0408859192,0.24800048000000002,0.269,"10x106",3.842517179E9,"PROFILE 20X20 PKG20 3M",3.842517173E9,"PROFILE 20X20 3000MM ",3000.0,118.11023622047244,null,null,null,null,null,null,null,null,null,null,null,null,null,null,null,null,null,null,null,"by Andrew Gavrun "]
[5.0,"20x20 1S",20.0,20.0,0.84,0.76,0.84,0.76,1.92,0.52,70000.0,0.787,0.787,0.02,0.018,0.051,0.046,0.298,0.349,"10x106",3.842536475E9,"PROFILE 20X20 1S PKG20 3M",3.842536476E9,"PROFILE 20X20 1S 3M",3000.0,118.11]
[6.0,"20x20 2S",20.0,20.0,0.84,0.68,0.84,0.68,1.83,0.49,70000.0,0.787,0.787,0.02,0.016,0.051,0.041,0.284,0.329,"10x106",3.842536478E9,"PROFILE 20X20 2S PKG20 3M",3.842536479E9,"PROFILE 20X20 2S 3M",3000.0,118.11]
[7.0,"20x20 3S",20.0,20.0,0.74,0.67,0.9,0.8,1.7,0.4,70000.0,0.7874015748031497,0.7874015748031497,0.017782199999999998,0.0161001,0.054921384000000004,0.048819008000000004,0.26350051,0.269,"10x106",3.84251718E9,"PROFILE 20X20 3S PKG20 3M",3.842517174E9,"PROFILE 20X20 3S 3000MM",3000.0,118.11023622047244,null,null,null,null,null,null,null,null,null,null,null,null,null,null,null,null,null,null,null,"Product Manager"]
[8.0,"20x20 2SA",20.0,20.0,0.7,0.7,0.9,0.9,1.8,0.5,70000.0,0.7874015748031497,0.7874015748031497,0.016821,0.016821,0.054921384000000004,0.054921384000000004,0.27900054,0.33625,"10x106",3.842519658E9,"PROFILE 20X20 2SA PKG20 3M",3.842519657E9,"PROFILE 20X20 2SA 3000MM",3000.0,118.11023622047244,null,null,null,null,null,null,null,null,null,null,null,null,null,null,null,null,null,null,null,"Bosch Rexroth Corporation"]
[9.0,"20x20 R",20.0,20.0,0.58,0.58,0.6,0.6,1.6,0.4,70000.0,0.7874015748031497,0.7874015748031497,0.013937399999999999,0.013937399999999999,0.036614256,0.036614256,0.24800048000000002,0.269,"10x106",3.842517183E9,"PROFILE 20X20R PKG20 3M ",3.842517177E9,"PROFILE 20X20R 3000MM",3000.0,118.11023622047244,null,null,null,null,null,null,null,null,null,null,null,null,null,null,null,null,null,null,null,"Buchanan, MI 49107"]
[10.0,"20x40",40.0,20.0,4.62,1.2,2.5,1.4,2.9,0.8,70000.0,1.5748031496062993,0.7874015748031497,0.1110186,0.028835999999999997,0.1525594,0.085433264,0.44950087,0.538,"10x106",3.842517184E9,"PROFILE 20X40 PKG20 3M",3.842517178E9,"PROFILE 20X40 3000MM",3000.0,118.11023622047244,null,null,null,null,null,null,null,null,null,null,null,null,null,null,null,null,null,null,null,"(269) 269-5214"]
[{"$f":"A12+1","v":11},"20x40x40",40.0,40.0,6.0,6.0,2.6,2.6,4.14,1.1,70000.0,1.5748031496062993,1.5748031496062993,0.14418,0.14418,0.158661776,0.158661776,0.641701242,0.73975,"10x106",3.842523234E9,"PROFILE 20X40X40 PKG20 3M ",3.842523241E9,"PROFILE 20X40X40 3000MM",3000.0,118.11023622047244]
[12,"20x60",60.0,20.0,14.2,1.7,4.7,1.7,3.48,0.9,70000.0,2.362204724409449,0.7874015748031497,0.341226,0.040851,0.286811672,0.103740392,0.539401044,0.60525,"10x106",3.842523237E9,"PROFILE 20X60 PKG20 3M",3.842523239E9,"PROFILE 20X60 3000MM",3000.0,118.11023622047244]
[13,"LF6 S",36.0,21.0,1.16,5.88,1.08,2.94,5.1,1.7,70000.0,1.4173228346456694,0.8267716535433072,0.027874799999999998,0.1412964,0.0659056608,0.1794098544,0.79050153,1.1432499999999999,"10x106",3.842518887E9,"PROFILE LF6S 3M PKG10",3.842518886E9,"PROFILE LF6S 3000MM",3000.0,118.11023622047244]
[14,"22.5x45",45.0,22.5,7.11,2.91,3.16,2.59,4.6,1.3,70000.0,1.7716535433070868,0.8858267716535434,0.1708533,0.0699273,0.1928350816,0.1580515384,0.71300138,0.87425,"10x106",3.842509176E9,"PROFILE 22.5X45 PKG20 5.6M",3.842509261E9,"PROFILE 22.5X45 5600MM",5600.0,220.4724409448819]
[15,"22.5x180",180.0,22.5,581.01,11.8,64.56,10.47,21.6,5.8,70000.0,7.086614173228347,0.8858267716535434,13.9616703,0.28355400000000003,3.9396939456,0.6389187672000001,3.3480064800000005,3.9004999999999996,"10x106",3.842509179E9,"PROFILE 22.5X180 PKG06 5.6M",3.842509206E9,"PROFILE 22.5X180 5600MM",5600.0,220.4724409448819]
[16,"22.5x30 F",30.0,22.5,1.68,2.97,1.49,1.98,3.2,0.86,70000.0,1.1811023622047245,0.8858267716535434,null,null,null,null,null,null,"10x106","NA","NA",3.842515228E9,"PROFILE 22.5X30F 5600MM ",5600.0,220.4724409448819]
[17,"26x90",90.0,26.0,4.59,68.07,3.65,15.13,8.0,2.2,70000.0,3.5433070866141736,1.0236220472440944,0.1102977,1.6357220999999997,0.222736724,0.9232894888000001,1.2400024,1.4795,"10x106",3.842526428E9,"PROF CARRIAGE 26X90 3M PKG05",3.842526495E9,"PROFILE CARRIAGE 26X90 3000MM",3000.0,118.11023622047244]
[18,"30x30",30.0,30.0,2.75,2.75,1.83,1.83,3.1,0.8,70000.0,1.1811023622047245,1.1811023622047245,0.0660825,0.0660825,0.11167348080000002,0.11167348080000002,0.48050093000000005,0.538,"10x106",3.842501574E9,"PROFILE 30X30 PKG20 6M",3.842502538E9,"PROFILE 30X30 6M",6000.0,236.2204724409449]
[19,"30x30 1S",30.0,30.0,3.12,3.48,2.2,2.6,3.7,1.0,70000.0,1.1811023622047245,1.1811023622047245,0.0749736,0.0836244,0.134252272,0.158661776,0.57350111,0.6725,"10x106",3.842506948E9,"PROFILE 30X30 1S PKG20 5.6M",3.842506952E9,"PROFILE 30X30 1S 5600MM",5600.0,220.4724409448819]
[20,"30x30 2S",30.0,30.0,2.78,3.47,2.1,2.6,3.5,0.9,70000.0,1.1811023622047245,1.1811023622047245,0.0668034,0.0833841,0.128149896,0.158661776,0.54250105,0.60525,"10x106",3.84250695E9,"PROFILE 30X30 2S PKG20 5.6M",3.842506954E9,"PROFILE 30X30 2S 5600MM ",5600.0,220.4724409448819]
[21,"30x30 2SA",30.0,30.0,3.11,3.11,2.2,2.5,3.5,0.9,70000.0,1.1811023622047245,1.1811023622047245,0.07473329999999999,0.07473329999999999,0.134252272,0.1525594,0.54250105,0.60525,"10x106",3.842506949E9,"PROFILE 30X30 2SA PKG20 5.6M",3.842506953E9,"PROFILE 30X30 2SA 5600MM ",5600.0,220.4724409448819]
[22,"30x30 3S",30.0,30.0,3.1,2.77,2.2,2.1,3.3,0.9,70000.0,1.1811023622047245,1.1811023622047245,0.074493,0.0665631,0.134252272,0.128149896,0.51150099,0.60525,"10x106",3.842506951E9,"PROFILE 30X30 3S PKG20 5.6M",3.842506955E9,"PROFILE 30X30 3S 5600MM",5600.0,220.4724409448819]
[23,"30x30 R",30.0,30.0,2.28,2.28,1.6,1.6,2.8,0.7,70000.0,1.1811023622047245,1.1811023622047245,0.054788399999999994,0.054788399999999994,0.09763801600000001,0.09763801600000001,0.43400084,0.47074999999999995,"10x106",3.842517198E9,"PROFILE 30X30R PKG20 5.6M",3.842517197E9,"PROFILE 30X30R 5600MM",5600.0,220.4724409448819]
[24,"30x45",45.0,30.0,8.04,3.82,3.9,2.8,3.9,1.1,70000.0,1.7716535433070868,1.1811023622047245,0.19320119999999996,0.09179459999999999,0.23799266400000002,0.170866528,0.60450117,0.73975,"10x106",3.842511704E9,"PROFILE 30X45 PKG18 5.6M",3.842511703E9,"PROFILE 30X45 5600MM",5600.0,220.4724409448819]
[25,"30x60",60.0,30.0,19.68,5.06,7.0,3.9,5.6,1.5,70000.0,2.362204724409449,1.1811023622047245,0.47291039999999995,0.12159179999999999,0.42716632000000004,0.23799266400000002,0.86800168,1.00875,"10x106",3.842512603E9,"PROFILE 30X60 PKG10 5.6M",3.84251293E9,"PROFILE 30X60 5600MM",5600.0,220.4724409448819]
[26,"30x30°R",30.0,30.0,3.5,3.6,2.0,1.9,3.6,1.0,70000.0,1.1811023622047245,1.1811023622047245,0.084105,0.086508,0.12204752,0.115945144,0.55800108,0.6725,"10x106",3.842524031E9,"PROFILE 30X30°R PKG20 5.6M",3.84252403E9,"PROFILE 30X30°R 5600MM",5600.0,220.4724409448819]
[27,"30x45°R",40.0,30.0,3.6,5.1,2.1,2.3,4.0,1.0,70000.0,1.5748031496062993,1.1811023622047245,0.086508,0.12255299999999998,0.128149896,0.140354648,0.6200012,0.6725,"10x106",3.842524034E9,"PROFILE 30X45°R PKG20 5.6M",3.842524033E9,"PROFILE 30X45°R 5600MM",5600.0,220.4724409448819]
[28,"30x60°R",35.0,30.0,3.0,4.1,1.7,1.9,3.6,1.0,70000.0,1.3779527559055118,1.1811023622047245,0.07209,0.09852299999999999,0.103740392,0.115945144,0.55800108,0.6725,"10x106",3.842524037E9,"PROFILE 30X60°R PKG20 5.6M ",3.842524036E9,"PROFILE 30X60°R 5600MM ",5600.0,220.4724409448819]
[29,"C30x45",45.0,30.0,10.33,5.6,4.23,3.73,4.38,1.23,70000.0,1.7716535433070868,1.1811023622047245,0.2482299,0.134568,0.25813050480000005,0.2276186248,0.678901314,0.827175,"10x106",3.842523598E9,"PROFILE C30X45 PKG20 5600",3.842523599E9,"PROFILE C30X45 5600MM",5600.0,220.4724409448819]
[30,"30x30   WG40",30.0,30.0,2.48,2.92,1.57,1.83,3.16,0.85,70000.0,1.1811023622047245,1.1811023622047245,0.0595944,0.0701676,0.09580730320000001,0.11167348080000002,0.48980094800000007,0.5716249999999999,"10x106",3.842522464E9,"PROFILE 30X30 WG40 PKG20 5.6M",3.84252246E9,"PROFILE 30X30 WG40 5600MM",5600.0,220.4724409448819]
[31,"30x30   WG30",30.0,30.0,2.57,3.01,1.64,1.92,3.19,0.86,70000.0,1.1811023622047245,1.1811023622047245,0.061757099999999995,0.07233029999999999,0.1000789664,0.1171656192,0.494450957,0.57835,"10x106",3.842522462E9,"PROFILE 30X30 WG30 PKG20 5.6M",3.842522458E9,"PROFILE 30X30 WG30 5600MM ",5600.0,220.4724409448819]
[32,"30x45   WG40",45.0,30.0,6.98,4.11,4.33,1.82,4.49,1.21,70000.0,1.7716535433070868,1.1811023622047245,0.1677294,0.0987633,0.2642328808,0.11106324320000001,0.695951347,0.8137249999999999,"10x106",3.842522465E9,"PROFILE 30X45 WG40 PKG20 5.6M",3.842522461E9,"PROFILE 30X45 WG40 5600MM ",5600.0,220.4724409448819]
[33,"30x45   WG30",45.0,30.0,7.0,4.25,4.3,1.8,4.52,1.22,70000.0,1.7716535433070868,1.1811023622047245,0.16821,0.1021275,0.262402168,0.10984276800000001,0.700601356,0.82045,"10x106",3.842522463E9,"PROFILE 30X45 WG30 PKG20 5.6M",3.842522459E9,"PROFILE 30X45 WG30 5600MM",5600.0,220.4724409448819]
[34,"30x100 End",100.0,30.0,9.65,90.3,6.4,18.0,9.68,2.61,70000.0,3.937007874015748,1.1811023622047245,0.2318895,2.169909,0.39055206400000003,1.0984276800000001,1.500402904,1.7552249999999998,"10x106","NA","NA",3.842519447E9,"END FIX PLATE 30X100 3300MM",3300.0,129.9212598425197]
[35,"30x100 Center",100.0,30.0,9.2,88.8,6.0,17.8,9.73,2.63,70000.0,3.937007874015748,1.1811023622047245,0.22107599999999997,2.133864,0.36614256,1.0862229280000002,1.508152919,1.768675,"10x106","NA","NA",3.842519448E9,"CENTER FIX PLATE 30X100 3300MM",3300.0,129.9212598425197]
[36,"LF12 S",82.0,30.0,9.45,75.92,7.02,19.53,12.9,3.5,70000.0,3.2283464566929134,1.1811023622047245,0.22708349999999997,1.8243576,0.4283867952,1.1917940328,1.99950387,2.35375,"10x106",3.842511841E9,"PROFILE LF12S 5.6M PKG05",3.842511903E9,"PROFILE LF12S 5600MM ",5600.0,220.4724409448819]
[37,"40x40",40.0,40.0,9.0,9.0,4.5,4.5,5.6,1.5,70000.0,1.5748031496062993,1.5748031496062993,0.21627,0.21627,0.27460692000000003,0.27460692000000003,0.86800168,1.00875,"10x106",3.842529339E9,"PROFILE 40X40   PKG20 6.0M",3.84252934E9,"PROFILE 40X40   UNCUT 6.0M",6000.0,236.2204724409449]
[38,"40x40 1S",40.0,40.0,9.0,9.0,4.5,4.5,5.6,1.5,70000.0,1.5748031496062993,1.5748031496062993,0.21627,0.21627,0.27460692000000003,0.27460692000000003,0.86800168,1.00875,"10x106",3.842529361E9,"PROFILE 40X40 1S PKG20 6.0M",3.842529362E9,"PROFILE 40X40 1S 6.0M",6000.0,236.2204724409449]
[39,"40x40 2S",40.0,40.0,9.0,9.0,4.5,4.5,5.6,1.5,70000.0,1.5748031496062993,1.5748031496062993,0.21627,0.21627,0.27460692000000003,0.27460692000000003,0.86800168,1.00875,"10x106",3.842529363E9,"PROFILE 40X40 2S PKG20 6.0M",3.842529364E9,"PROFILE 40X40 2S 6.0M",6000.0,236.2204724409449]
[40,"40x40 2SA",40.0,40.0,9.0,9.0,4.5,4.5,5.6,1.5,70000.0,1.5748031496062993,1.5748031496062993,0.21627,0.21627,0.27460692000000003,0.27460692000000003,0.86800168,1.00875,"10x106",3.842529365E9,"PROFILE 40X40 2SA PKG20 6.0M",3.842529366E9,"PROFILE 40X40 2SA 6.0M",6000.0,236.2204724409449]
[41,"40x40 3S",40.0,40.0,9.0,9.0,4.5,4.5,5.6,1.5,70000.0,1.5748031496062993,1.5748031496062993,0.21627,0.21627,0.27460692000000003,0.27460692000000003,0.86800168,1.00875,"10x106",3.842529367E9,"PROFILE 40X40 3S PKG20 6.0M",3.842529368E9,"PROFILE 40X40 3S 6.0M",6000.0,236.2204724409449]
[42,"40x40 R",40.0,40.0,7.2,7.2,3.6,3.6,5.0,1.3,70000.0,1.5748031496062993,1.5748031496062993,0.173016,0.173016,0.0,0.0,0.7750015,0.87425,"10x106",3.842529359E9,"PROFILE 40X40R  PKG20 6.0M",3.84252936E9,"PROFILE  40X 40R  UNCUT 6.0M ",6000.0,236.2204724409449]
[43,"40x40 HR",40.0,39.5,8.1,7.6,4.0,3.6,5.5,1.5,70000.0,1.575,1.55,0.194,0.182,0.243,0.219,0.853,1.009,"10x106",3.842529381E9,"PROFILE 40X40HR PKG20 6.0M",3.842529382E9,"PROFILE 40X40HR 6.0M",6000.0,236.22]
[44,"40x80",80.0,40.0,63.4,17.3,15.9,8.7,9.9,2.7,70000.0,3.1496062992125986,1.5748031496062993,1.523502,0.415719,0.9702777840000001,0.530906712,1.5345029700000001,1.81575,"10x106",3.842529341E9,"PROFILE 40X80   PKG12 6.0M",3.842529342E9,"PROFILE 40X80   UNCUT 6.0M",6000.0,236.2204724409449]
[45,"40X80X80",80.0,80.0,96.6,96.6,24.1,24.1,15.4,4.1,70000.0,3.15,3.15,2.319,2.319,1.469,1.469,2.388,2.757,"10x106",3.842537827E9,"PROFILE 40X80X80 PKG8 6M",3.84252937E9,"PROFILE 40X80X80 M",6000.0,236.22]
[46,"40x120",120.0,40.0,203.2,27.8,33.9,13.9,15.5,4.2,70000.0,4.724409448818898,1.5748031496062993,4.882896,0.668034,2.068705464,0.8482302640000001,2.40250465,2.8245,"10x106",3.842529343E9,"PROFILE 40X120  PKG12 6.0M ",3.842529344E9,"PROFILE 40X120  UNCUT 6.0M",6000.0,236.2204724409449]
[47,"40x160",160.0,40.0,466.7,37.2,58.3,18.6,20.5,5.5,70000.0,6.299212598425197,1.5748031496062993,11.214801,0.893916,3.557685208,1.1350419360000001,3.17750615,3.69875,"10x106",3.842529345E9,"PROFILE 40X160  PKG06 6.0M",3.842529346E9,"PROFILE 40X160  UNCUT 6.0M ",6000.0,236.2204724409449]
[48,"30x30x80   EcoSlide",94.0,40.3,147.03,786.19,null,null,11.78,null,70000.0,3.7007874015748032,1.5866141732283465,3.5331308999999997,18.8921457,0.0,0.0,1.825903534,0.0,"10x106","NA","NA",8.981535476E9,"ECOSLIDE 30X30X80 CARRIAGE",80.0,3.1496062992125986]
[49,"30x30x160 EcoSlide",94.0,40.3,147.03,786.19,null,null,11.78,null,70000.0,3.7007874015748032,1.5866141732283465,3.5331308999999997,18.8921457,0.0,0.0,1.825903534,0.0,"10x106","NA","NA",8.981535477E9,"ECOSLIDE 30X30X160 CARRIAGE",160.0,6.299212598425197]
[50,"45x45 H",45.0,45.0,13.83,13.83,6.15,6.15,7.5,2.0,70000.0,1.7716535433070868,1.7716535433070868,0.3323349,0.3323349,0.37529612400000006,0.37529612400000006,1.16250225,1.345,"10x106",3.8423151E9,"PROFILE 45X45H PKG20 6M ",3.842507125E9,"PROFILE 45X45H 6000MM ",6000.0,236.2204724409449]
[51,"45x45",45.0,45.0,11.0,11.0,4.89,4.89,5.7,1.5,70000.0,1.7716535433070868,1.7716535433070868,0.26433,0.26433,0.2984061864,0.2984061864,0.8835017100000001,1.00875,"10x106",8.981004744E9,"PROFILE 45X45 PKG20 6M ",8.981004773E9,"PROFILE 45X45 6000MM",6000.0,236.2204724409449]
[52,"45x45 1S",45.0,45.0,11.75,12.06,5.2,5.3,5.9,1.6,70000.0,1.7716535433070868,1.7716535433070868,0.2823525,0.2898018,0.317323552,0.32342592800000003,0.9145017700000001,1.076,"10x106",3.842506956E9,"PROFILE 45X45 1S PKG20 5.6M",3.84250696E9,"PROFILE 45X45 1S 5600MM",5600.0,220.4724409448819]
[53,"45x45 2S",45.0,45.0,11.54,11.38,5.1,5.0,5.8,1.6,70000.0,1.7716535433070868,1.7716535433070868,0.27730619999999995,0.2734614,0.311221176,0.3051188,0.89900174,1.076,"10x106",3.842506958E9,"PROFILE 45X45 2S PKG20 5.6M",3.842506962E9,"PROFILE 45X45 2S 5600MM",5600.0,220.4724409448819]
[54,"45x45 2SA",45.0,45.0,11.8,11.8,5.2,5.2,5.9,1.6,70000.0,1.7716535433070868,1.7716535433070868,0.28355400000000003,0.28355400000000003,0.317323552,0.317323552,0.9145017700000001,1.076,"10x106",3.842506957E9,"PROFILE 45X45 2SA PKG20 5.6M",3.842506961E9,"PROFILE 45X45 2SA 5600MM",5600.0,220.4724409448819]
[55,"45x45 3S",45.0,45.0,11.79,11.68,5.2,5.2,5.9,1.6,70000.0,1.7716535433070868,1.7716535433070868,0.28331369999999995,0.2806704,0.317323552,0.317323552,0.9145017700000001,1.076,"10x106",3.842506959E9,"PROFILE 45X45 3S PKG20 5.6M ",3.842506963E9,"PROFILE 45X45 3S 5600MM",5600.0,220.4724409448819]
[56,"45x45 R",45.0,45.0,8.56,8.56,5.0,5.0,4.9,1.3,70000.0,1.7716535433070868,1.7716535433070868,0.2056968,0.2056968,0.3051188,0.3051188,0.7595014700000001,0.87425,"10x106",3.8425172E9,"PROFILE 45X45R PKG20 5.6M",3.842517199E9,"PROFILE 45X45R 5600MM",5600.0,220.4724409448819]
[57,"45x45 HR",45.0,45.0,11.02,10.73,4.4,4.7,6.6,1.8,70000.0,1.7716535433070868,1.7716535433070868,0.2648106,0.2578419,0.268504544,0.286811672,1.02300198,1.2105,"10x106",3.842525505E9,"PROFILE 45X45HR PKG20 5.6M",3.842525504E9,"PROFILE 45X45HR 5600MM ",5600.0,220.4724409448819]
[58,"45x30°R",30.0,45.0,12.7,15.2,5.0,5.3,6.9,1.8,70000.0,1.1811023622047245,1.7716535433070868,0.305181,0.36525599999999997,0.3051188,0.32342592800000003,1.0695020700000002,1.2105,"10x106",3.84252404E9,"PROFILE 45X30°R PKG20 5.6M",3.842524039E9,"PROFILE 45X30°R 5600MM",5600.0,220.4724409448819]
{"$rows_left_out":56}