{"text_format":"1","workbook":"xlsx","n_sheets":6,"sheets":["INSTALLATION","CONVERSION","KW COST","Langue","GLOBAL DATA","CONVERSION _DATA"],"not_rendered":{"charts":1,"images":72,"macros":1,"external_links":0,"defined_names":140,"comments":0,"pivot_tables":0},"unopened":[],"bounds":{"document_bytes":16777216,"sheet_cells":100000,"rows_first":2000,"rows_last":500,"rows_between":2000,"halvings":0,"cell_chars":16384,"cell_head_chars":4096},"cells_cut":0,"cells_raw":0,"read":"whole","date_system":"1900"}

{"sheet":"INSTALLATION","index":0,"n_rows":58,"n_cols":30,"rows_kept":58,"cut":false,"hidden":false,"merged":[[2,6,4,18],[7,13,7,16],[10,8,10,11],[12,8,12,11],[12,13,12,16],[12,18,12,21],[12,23,12,25],[16,13,16,14],[16,18,16,19],[17,13,17,14],[17,18,17,19],[18,13,18,14],[18,18,18,19],[21,8,21,9],[33,18,33,20],[34,24,35,24],[34,25,35,25],[36,8,36,10],[36,13,36,15],[36,18,36,20],[21,13,21,14],[21,18,21,19],[24,13,24,14],[24,18,24,19],[26,3,27,6],[33,8,33,10],[33,13,33,15]]}
[]
[]
[]
[]
[]
[null,null,null,null,null,null,null,null,null,null,null,null,null,null,null,null,null,null,null,null,{"$f":"CONCATENATE(\"   Power :   1kW = \",KW_COST,\" \",CUR_CURRENCY)","v":"   Power :   1kW = 3.504 EURO"}]
[]
[null,null,null,"Hours",null,null,null,null,null,null,null,18.0,null,"WORKING PRESSURE"]
[null,null,null,"Days",null,null,null,null,null,null,null,7.0,null,null,61.0]
[null,null,null,"Weeks",null,null,null,null,null,null,null,42.0]
[null,null,null,"Annual running Hours ",null,null,null,null,{"$f":"+L10*L9*L8","v":5292},null,null,null,null,null,{"$f":"O9/10","v":6.1},"  Bar"]
[]
[null,null,null,"DISTRIBUTION",null,null,null,null,{"$f":"IF(INSTALL_MAIN_TYPE=\"RING\",\"MAIN RING\",\"MAIN PIPE\")","v":"MAIN PIPE"},null,null,null,null,{"$f":"IF(INSTALL_DIST1_TYPE=\"RING\",\"DISTRIBUTION RING 1\",\"DISTRIBUTION PIPE 1\")","v":"DISTRIBUTION RING 1"},null,null,null,null,{"$f":"IF(INSTALL_DIST2_TYPE=\"RING\",\"DISTRIBUTION RING 2\",\"DISTRIBUTION PIPE 2\")","v":"DISTRIBUTION RING 2"},null,null,null,null,"Key to Icons"]
[null,null,null,"Type",null,null,null,null,null,true,null,false,null,null,true,null,false,null,null,true,null,false,null,"Seat valve"]
[null,null,null,null,null,null,null,null,null,3506.0,null,null,null,null,3806.0,null,null,null,null,2672.0,null,null,null,null,0.044,"Bar*"]
[null,null,null,"Volume Flow Rate"]
[null,null,null,null,null,null,null,null,null,{"$f":"J15","v":3506},"m3/h",null,null,{"$f":"O15","v":3806},null,"m3/h",null,null,{"$f":"T15","v":2672},null,"m3/h",null,null,"Diaphragm valve"]
[null,null,null,null,null,null,null,null,null,{"$f":"J17*CONV_M3H_CFM","v":2063.281},"Cfm",null,null,{"$f":"N17*CONV_M3H_CFM","v":2239.831},null,"Cfm",null,null,{"$f":"S17*CONV_M3H_CFM","v":1572.472},null,"Cfm",null,null,null,0.012,"Bar"]
[null,null,null,null,null,null,null,null,null,{"$f":"J17*CONV_M3H_LS","v":973.8888889},"l/s",null,null,{"$f":"N17*CONV_M3H_LS","v":1057.222222},null,"l/s",null,null,{"$f":"S17*CONV_M3H_LS","v":742.2222222},null,"l/s"]
[null,null,null,"Pipe Length",null,null,null,null,null,2898.0,null,null,null,null,null,null,null,null,null,null,null,null,null,"Gate valve"]
[null,null,null,"(furthest point)",null,null,null,null,null,null,null,null,null,null,null,2286.0,null,null,null,null,2636.0,null,null,null,0.003,"Bar"]
[null,null,null,null,null,null,null,null,{"$f":"J20","v":2898},null,"m",null,null,{"$f":"P21","v":2286},null,"m",null,null,{"$f":"U21","v":2636},null,"m"]
[null,null,null,"Pipe Inner Diameter",null,null,null,null,null,null,null,null,null,null,null,null,null,null,null,null,null,null,null,"Elbow"]
[null,null,null,null,null,null,null,null,null,null," 2 \"",null,null,null,null," 1\"",null,null,null,null," 1 \" 1/2",null,null,null,0.015,"Bar"]
[null,null,null,null,null,null,null,null,null,{"$f":"VLOOKUP(K24,PIPE_DIAMETERS,2,FALSE)","v":" 50 - 60"},"mm",null,null,{"$f":"VLOOKUP(P24,PIPE_DIAMETERS,2,FALSE)","v":" 26 - 34"},null,"mm",null,null,{"$f":"VLOOKUP(U24,PIPE_DIAMETERS,2,FALSE)","v":" 40 - 49"},null,"mm"]
[null,null,null,"Valves, bends, …",null,null,null,null,null,null,null,null,null,null,null,null,null,null,null,null,null,null,null,"Bends R = d"]
[null,null,null,"(click on the icons to add components to the system)",null,null,null,null,1.0,10.0,0.0,0.0,null,0.0,0.0,0.0,0.0,null,0.0,0.0,0.0,0.0,null,null,0.003,"Bar"]
[null,null,null,null,null,null,null,null,null,null,null,null,null,null,null,null,null,null,null,null,null,null,null,"Bends R = 2d"]
[null,null,null,null,null,null,null,null,0.0,0.0,5.0,0.0,null,0.0,0.0,0.0,0.0,null,0.0,0.0,0.0,0.0,null,null,0.015,"Bar"]
[null,null,null,null,null,null,null,null,null,null,null,null,null,null,null,null,null,null,null,null,null,null,0.0]
[null,null,null,null,null,null,null,null,null,null,null,null,null,null,null,null,null,null,null,null,null,null,null,"Tpieces, hoses"]
[null,null,null,null,null,null,null,null,null,null,null,null,null,null,null,null,null,null,null,null,null,null,0.0,null,0.019,"Bar"]
[]
[null,null,null,"Pressure drop",null,null,null,null,{"$f":"IF(INSTALL_MAIN_TYPE=\"RING\",(160000000*((J17/2/3600)^1.85*(I22+AA57))/(AB48^5*(O11+1))),(160000000*((J17/3600)^1.85*(I22+AA57))/(AB48^5*(INST_WORK_PRESS+1))))","v":198.9996918},null,null,"Bar",null,{"$f":"IF(INSTALL_DIST1_TYPE=\"RING\",(160000000*((N17/2/3600)^1.85*(N22+AB57))/(AC48^5*(O11+1))),(160000000*((N17/3600)^1.85*(N22+AB57))/(AC48^5*(INST_WORK_PRESS+1))))","v":1621.959286},null,null,"Bar",null,{"$f":"IF(INSTALL_DIST2_TYPE=\"ring\",(160000000*((S17/2/3600)^1.85*(S22+AC57))/(AD48^5*(O11+1))),(160000000*((S17/3600)^1.85*(S22+AC57))/(AD48^5*(INST_WORK_PRESS+1))))","v":92.70206413},null,null,"Bar",0.0,"Reducers"]
[null,null,null,null,null,null,null,null,null,null,null,null,null,null,null,null,null,null,null,null,null,null,null,null,0.005,"Bar"]
[null,null,null,null,null,null,null,null,null,null,null,null,null,null,null,null,null,null,null,null,null,null,0.0]
[null,null,null,"Annual Cost",null,null,null,null,{"$f":"I34*(AA58*0.07)*INST_ANN_HOURS*KW_COST","v":121877754.2},null,null,{"$f":"CUR_CURRENCY","v":"EURO"},null,{"$f":"N34*(AB58*0.07)*INST_ANN_HOURS*KW_COST","v":1170619810},null,null,{"$f":"CUR_CURRENCY","v":"EURO"},null,{"$f":"S34*(AC58*0.07)*INST_ANN_HOURS*KW_COST","v":35426396.95},null,null,{"$f":"CUR_CURRENCY","v":"EURO"}]
[null,null,null,null,null,null,null,null,null,null,null,null,null,null,null,null,null,null,null,null,null,null,null,null,null,"* exemple of pressure drop through a 25 mm pipe for a 200 m3/h (118 cfm) compressor"]
[]
[]
{"$rows_left_out":19}
{"sheet":"CONVERSION","index":1,"n_rows":110,"n_cols":13,"rows_kept":110,"cut":false,"hidden":false,"merged":[[22,1,22,5],[28,1,28,5],[29,7,30,7],[29,8,30,8],[29,11,30,11],[4,1,4,5],[4,7,4,11],[10,1,10,5],[10,7,10,11],[16,1,16,5],[16,7,16,11],[22,7,22,11]]}
[]
[]
[null,null,null,null,null,null,null,null,null,null,{"$f":"CONCATENATE(\"   Power :   1kW = \",KW_COST,\" \",CUR_CURRENCY)","v":"   Power :   1kW = 3.504 EURO"}]
[]
[null,"FLOW RATE conversion ",null,null,null,null,null,"TEMPERATURE conversion "]
[]
[null,"100","m3/h","=",{"$f":"ROUND(CONV_FLOW_RATE_IN*'CONVERSION _DATA'!AH10,3)","v":27.778},"Litre/sec",null,"100","°C","=",{"$f":"ROUND(CONV_TEMPERATURE_IN*'CONVERSION _DATA'!AZ5+'CONVERSION _DATA'!BA5,3)","v":132},"°F"]
[]
[]
[]
[null,"PRESSURE conversion ",null,null,null,null,null,"OIL CONTENT conversion "]
[]
[null,"100","PSI","=",{"$f":"ROUND(CONV_PRESSURE_IN*'CONVERSION _DATA'!R28,3)","v":6.895},"Bar",null,"100","mg/m3","=",{"$f":"ROUND(CONV_OIL_IN*'CONVERSION _DATA'!AD26,3)","v":83.333},"ppm"]
[]
[]
[]
[null,"ENERGY conversion ",null,null,null,null,null,"VOLUME conversion "]
[]
[null,"100","kW/h","=",{"$f":"IF('CONVERSION _DATA'!V45=\"-\",\"No conversion\",ROUND(CONV_ENERGY_IN*'CONVERSION _DATA'!V45,3))","v":360077.489},"Joule",null,"100","m3","=",{"$f":"ROUND(CONV_VOLUME_IN*'CONVERSION _DATA'!AH21,3)","v":3531.47},"Ft3"]
[]
[]
[]
[null,"POWER conversion ",null,null,null,null,null,"F.A.D.@ 7 bar / ALTITUDE CORRECTION "]
[]
[null,"100","Watt","=",{"$f":"ROUND(CONV_POWER_IN*'CONVERSION _DATA'!Z54,3)","v":74570},"HP"]
[null,null,null,null,null,null,null,"100",null,"=",{"$f":"CONV_ALTITUDE_IN*'CONVERSION _DATA'!AK20","v":89.005},{"$f":"IF(M27=\"Pint\",M27&\"s\",IF(M27=\"Gallon\",M27&\"s\",IF(M27=\"Litre\",M27&\"s\",M27)))","v":"cm3"}]
[null,null,null,null,null,null,null,null,null,null,null,null,"cm3"]
[]
[null,"LENGTH conversion "]
[null,null,null,null,null,null,null,"Height","=",null,null,{"$f":"K31&\" m\"","v":"2313 m"}]
[null,"100","Metre","=",{"$f":"ROUND(CONV_LENGTH_IN*'CONVERSION _DATA'!Z37,3)","v":109.361},"Yard",null,null,null,null,2313.0]
[]
[]
[]
[]
[]
[]
[]
[]
[]
{"$rows_left_out":71}
{"sheet":"KW COST","index":2,"n_rows":15,"n_cols":8,"rows_kept":15,"cut":false,"hidden":false,"merged":[[6,6,6,8],[12,2,12,4],[12,6,13,8],[14,6,15,8]]}
[]
[]
[]
[]
[]
[]
[null,null,"Use the scrollbar to the right to",null,null,null,"Power Cost per kW"]
[null,null,"adjust the cost of the power."]
[null,null,null,null,null,null,null,3504.0]
[null,null,"Use the drop down box below"]
[null,null,"to select your country/currency."]
[]
[null,null,"Country Selection",null,null,null,"Cost in local currency:"]
[]
[null,null,null,"Belgium",null,null,{"$f":"\"1 kW = \"&H9/1000&\" \"&CUR_CURRENCY","v":"1 kW = 3.504 EURO"}]

{"sheet":"Langue","index":3,"n_rows":40,"n_cols":4,"rows_kept":40,"cut":false,"hidden":true,"merged":[]}
[]
["English","English","Français","Votre langue / Your language"]
[]
["Air demand","Air demand","Consommation"]
["Pressure","Pressure","Pression"]
["Air delivery","Air delivery","Débit délivré"]
["Energy Savings - ROLLAIR® V","Energy Savings","Economie d'énergie - ROLLAIR® V"]
["Project Ref.","Project Ref.","Réf. Projet"]
["Company","Company","Société"]
["Contact name","Contact name","Nom contact"]
["Annual Hours","Annual Hours","Heures par an"]
["Hours per day","Hours per day","Heures par jour"]
["Days per week","Days per week","Jours par semaine"]
["Weeks per year","Weeks per year","Semaines par an"]
["Hours","Hours","Heures"]
["Min","Min","Min"]
["Days","Days","Jours"]
["Weeks","Weeks","Semaines"]
["Cost of","Cost of","Coût d'"]
["Cost of","Cost of","Coût d'"]
["Country","Country","Pays"]
["Screw compressor","Screw compressor","Compresseur à vis ROLLAIR®"]
["Variable screw compressor","Variable screw compressor","Compresseur à vis à vitesse variable ROLLAIR® V"]
["Pressure (bar)","Pressure (bar)","Pression (bar)"]
["Energy cost","Energy cost","Coût de l'energie"]
["kWh","kWh","kWh"]
["m3 cost","m3 cost","Coût du m3"]
["Set Pressure","Set Pressure","Pression consigne"]
["Air demand","Air demand","Consommation d'air"]
["Extra Investment","Extra Investment","Investissement supplémentaire"]
["ENERGY SAVINGS FOR THE PERIOD","ENERGY SAVINGS FOR THE PERIOD","ECONOMIE D'ENERGIE SUR LA PERIODE"]
["Pay Back","Pay Back","Retour sur investissement"]
["Month(s)","Month(s)","Mois(s)"]
["Year(s)","Year(s)","An(s)"]
["Operating hours","Operating hours","Heures de fonctionnement"]
["Remaining time","Remaining time","Temps restant"]
["From","From","De"]
["to","to","à"]
["ANNUAL ENERGY SAVINGS","ANNUAL ENERGY SAVINGS","ECONOMIE D'ENERGIE ANNUELLE"]
["Compressors","Compressors","Compresseurs"]
{"$rows_left_out":1}
{"sheet":"GLOBAL DATA","index":4,"n_rows":352,"n_cols":8,"rows_kept":352,"cut":false,"hidden":true,"merged":[[102,1,106,1]]}
[null,"ALL DATA MOVED AND DEFINED BY INTUITVE MEDIA IS IN THIS SHEET (APART FROM ROLLAIR V STUFF)"]
[]
[null,"CURRENCY AND KW DATA"]
[]
[null,"Currency Lookup List",null,null,"Country"]
[null,"Austria","ATS",null,"Belgium"]
[null,"Belgium","EURO"]
[null,"Brasil","USD",null,"Current Currency"]
[null,"China","UKD",null,{"$f":"VLOOKUP(CUR_COUNTRY,CURRENCIES,2)","v":"EURO"}]
[null,"Czech Republic","CZK"]
[null,"Denmark","DKK",null,"Cost per KW"]
[null,"Egypt","EGP",null,3.504]
[null,"Finland","FIM"]
[null,"France","EURO",null,"String for Graphs"]
[null,"Germany","EURO",null,{"$f":"CONCATENATE(CUR_CURRENCY,GRAPH_UNITS)","v":"EURO /l/s"}]
[null,"Greece","EURO"]
[null,"Hungary","HUF",null,"Units for graphs"]
[null,"India","INR",null," /l/s"]
[null,"Indonesia","IDR"]
[null,"Ireland","EURO"]
[null,"Italy","EURO"]
[null,"Japan","JPY"]
[null,"Mexico","USD"]
[null,"Morroco","MAD"]
[null,"Netherlands","EURO"]
[null,"Norway","NOK"]
[null,"Poland","PLZ"]
[null,"Portugal","PTE"]
[null,"Russia","RUR"]
[null,"South Africa","ZAR"]
[null,"Spain","EURO"]
[null,"Sweden","SEK"]
[null,"Switzerland","CHF"]
[null,"Turkey","TRL"]
[null,"U.K.","GBP"]
[null,"USA","USD"]
[null,"Yugoslavia","YUN"]
[]
[]
[]
{"$rows_left_out":313}
{"sheet":"CONVERSION _DATA","index":5,"n_rows":61,"n_cols":53,"rows_kept":61,"cut":false,"hidden":true,"merged":[]}
["PRESSURE",null,null,null,null,null,null,null,null,null,null,null,null,null,null,null,null,null,null,null,null,null,null,null,null,null,null,null,null,null,null,null,null,null,null,"TEMPERATURE",null,null,null,null,null,null,null,null,null,null,null,null,null,null,null,"x","+"]
["Cfm",1.0,"Cfm",null,"Cfm",{"$f":"1/B3","v":0.4720098178},"Litre/sec",null,"Cfm",{"$f":"1/B4","v":28.32058907},"Litre/min",null,"Cfm",{"$f":"1/B5","v":1699.235344},"Litre/h",null,"Cfm",{"$f":"1/B6","v":0.02832058907},"m3/min",null,"Cfm",{"$f":"1/B7","v":1.699235344},"m3/h",null,"Cfm",{"$f":"1/B8","v":0.0004720098178},"m3/s",null,"Cfm",1.8248,"Nm3/h",null,{"$f":"C2","v":"Cfm"},{"$f":"B10","v":0.5885},null,"°C",1.0,"°C",0.0,null,"°C",{"$f":"5/9","v":0.5555555556},"°F",{"$f":"-160/9","v":-17.77777778},null,"°C",1.0,"°K",-273.0,null,"°C",{"$f":"+AK5","v":1},{"$f":"+AM5","v":32}]
["Litre/sec",2.1186,"Cfm",null,"Litre/sec",1.0,"Litre/sec",null,"Litre/sec",60.0,"Litre/min",null,"Litre/sec",3600.0,"Litre/h",null,"Litre/sec",0.06,"m3/min",null,"Litre/sec",3.6,"m3/h",null,"Litre/sec",0.001,"m3/s",null,"Litre/sec",{"$f":"AD7*V3","v":3.354266212},"Nm3/h",null,{"$f":"G2","v":"Litre/sec"},{"$f":"F10","v":0.2777777778},null,"°F",{"$f":"9/5","v":1.8},"°C",32.0,null,"°F",1.0,"°F",0.0,null,"°F",{"$f":"9/5","v":1.8},"°K",{"$f":"-2297/5","v":-459.4},null,"°F",{"$f":"+AP5","v":0.5555555556},{"$f":"+AR5","v":0}]
["Litre/min",{"$f":"B3*F4","v":0.03531},"Cfm",null,"Litre/min",{"$f":"1/60","v":0.01666666667},"Litre/sec",null,"Litre/min",1.0,"Litre/min",null,"Litre/min",60.0,"Litre/h",null,"Litre/min",0.001,"m3/min",null,"Litre/min",0.06,"m3/h",null,"Litre/min",{"$f":"1/60000","v":0.00001666666667},"m3/s",null,"Litre/min",{"$f":"AD7*V4","v":0.05590443686},"Nm3/h",null,{"$f":"K2","v":"Litre/min"},{"$f":"J10","v":16.66666667},null,"°K",1.0,"°C",273.0,null,"°K",{"$f":"5/9","v":0.5555555556},"°F",{"$f":"2297/9","v":255.2222222},null,"°K",1.0,"°K",0.0,null,"°K",{"$f":"+AU5","v":1},{"$f":"+AW5","v":-459.4}]
["Litre/h",{"$f":"F5*B3","v":0.0005885},"Cfm",null,"Litre/h",{"$f":"1/3600","v":0.0002777777778},"Litre/sec",null,"Litre/h",{"$f":"1/60","v":0.01666666667},"Litre/min",null,"Litre/h",1.0,"Litre/h",null,"Litre/h",{"$f":"1/60000","v":0.00001666666667},"m3/min",null,"Litre/h",0.001,"m3/h",null,"Litre/h",{"$f":"1/3600000","v":0.0000002777777778},"m3/s",null,"Litre/h",{"$f":"AD7*V5","v":0.0009317406143},"Nm3/h",null,{"$f":"O2","v":"Litre/h"},{"$f":"N10","v":1000},null,null,{"$f":"VLOOKUP(CONVERSION!$I$7,AJ2:AM4,2,FALSE)","v":1},null,{"$f":"VLOOKUP(CONVERSION!$L$7,AJ2:AM4,4,FALSE)","v":32},null,null,{"$f":"VLOOKUP(CONVERSION!$I$7,AO2:AR4,2,FALSE)","v":0.5555555556},null,{"$f":"VLOOKUP(CONVERSION!$L$7,AO2:AR4,4,FALSE)","v":0},null,null,{"$f":"VLOOKUP(CONVERSION!$I$7,AT2:AW4,2,FALSE)","v":1},null,{"$f":"VLOOKUP(CONVERSION!$L$7,AT2:AW4,4,FALSE)","v":-459.4},null,null,{"$f":"VLOOKUP(CONVERSION!$I$7,AY2:BA4,2,FALSE)","v":1},{"$f":"VLOOKUP(CONVERSION!$I$7,AY2:BA4,3,FALSE)","v":32}]
["m3/min",{"$f":"+F6*B3","v":35.31},"Cfm",null,"m3/min",{"$f":"1000/60","v":16.66666667},"Litre/sec",null,"m3/min",1000.0,"Litre/min",null,"m3/min",60000.0,"Litre/h",null,"m3/min",1.0,"m3/min",null,"m3/min",60.0,"m3/h",null,"m3/min",{"$f":"1/60","v":0.01666666667},"m3/s",null,"m3/min",{"$f":"+AD7*V6","v":55.90443686},"Nm3/h",null,{"$f":"S2","v":"m3/min"},{"$f":"R10","v":0.01666666667}]
["m3/h",{"$f":"+F7*B3","v":0.5885},"Cfm",null,"m3/h",{"$f":"1000/3600","v":0.2777777778},"Litre/sec",null,"m3/h",{"$f":"1000/60","v":16.66666667},"Litre/min",null,"m3/h",1000.0,"Litre/h",null,"m3/h",{"$f":"1/60","v":0.01666666667},"m3/min",null,"m3/h",1.0,"m3/h",null,"m3/h",{"$f":"1/3600","v":0.0002777777778},"m3/s",null,"m3/h",{"$f":"273/293","v":0.9317406143},"Nm3/h",null,{"$f":"W2","v":"m3/h"},{"$f":"V10","v":1}]
["m3/s",{"$f":"+F8*B3","v":2118.6},"Cfm",null,"m3/s",1000.0,"Litre/sec",null,"m3/s",60000.0,"Litre/min",null,"m3/s",3600000.0,"Litre/h",null,"m3/s",60.0,"m3/min",null,"m3/s",3600.0,"m3/h",null,"m3/s",1.0,"m3/s",null,"m3/s",{"$f":"AD7*V8","v":3354.266212},"Nm3/h",null,{"$f":"AA2","v":"m3/s"},{"$f":"Z10","v":0.0002777777778},null,500.0,0.98]
["Nm3/h",0.548,"Cfm",null,"Nm3/h",{"$f":"1/AD3","v":0.2981277981},"Litre/sec",null,"Nm3/h",{"$f":"1/AD4","v":17.88766789},"Litre/min",null,"Nm3/h",{"$f":"1/AD5","v":1073.260073},"Litre/h",null,"Nm3/h",{"$f":"1/AD6","v":0.01788766789},"m3/min",null,"Nm3/h",{"$f":"1/AD7","v":1.073260073},"m3/h",null,"Nm3/h",{"$f":"1/AD8","v":0.0002981277981},"m3/s",null,"Nm3/h",1.0,"Nm3/h",null,{"$f":"AE2","v":"Nm3/h"},{"$f":"AD10","v":0.9317406143},null,1000.0,0.96]
[null,{"$f":"VLOOKUP(CONVERSION!$C$7,'CONVERSION _DATA'!A2:B9,2,FALSE)","v":0.5885},null,null,null,{"$f":"VLOOKUP(CONVERSION!$C$7,'CONVERSION _DATA'!E2:F9,2,FALSE)","v":0.2777777778},null,null,null,{"$f":"VLOOKUP(CONVERSION!$C$7,'CONVERSION _DATA'!I2:J9,2,FALSE)","v":16.66666667},null,null,null,{"$f":"VLOOKUP(CONVERSION!$C$7,'CONVERSION _DATA'!M2:N9,2,FALSE)","v":1000},null,null,null,{"$f":"VLOOKUP(CONVERSION!$C$7,'CONVERSION _DATA'!Q2:R9,2,FALSE)","v":0.01666666667},null,null,null,{"$f":"VLOOKUP(CONVERSION!$C$7,'CONVERSION _DATA'!U2:V9,2,FALSE)","v":1},null,null,null,{"$f":"VLOOKUP(CONVERSION!$C$7,'CONVERSION _DATA'!Y2:Z9,2,FALSE)","v":0.0002777777778},null,null,null,{"$f":"VLOOKUP(CONVERSION!$C$7,'CONVERSION _DATA'!AC2:AD9,2,FALSE)","v":0.9317406143},null,null,null,{"$f":"VLOOKUP(CONVERSION!$F$7,'CONVERSION _DATA'!AG2:AH9,2,FALSE)","v":0.2777777778},null,1500.0,0.935]
[null,null,null,null,null,null,null,null,null,null,null,null,null,null,null,null,null,null,null,null,null,null,null,null,null,null,null,null,null,null,null,null,null,null,null,2000.0,0.91]
["VOLUME",null,null,null,null,null,null,null,null,null,null,null,null,null,null,null,null,null,null,null,null,null,null,null,null,null,null,null,null,null,null,null,null,null,null,2500.0,0.89]
["cm3",1.0,"cm3",null,"cm3",1.0E-6,"m3",null,"cm3",0.001,"Litre",null,"cm3",0.061024,"Inch3",null,"cm3",3.53E-5,"Ft3",null,"cm3","-","Yd3",null,"cm3",2.2E-4,"Gallon",null,"cm3",0.00176,"Pint",null,"cm3",{"$f":"B21","v":1000000},null,3000.0,0.865]
["m3",1000000.0,"cm3",null,"m3",1.0,"m3",null,"m3",1000.0,"Litre",null,"m3",61023.7,"Inch3",null,"m3",35.3147,"Ft3",null,"m3",1.30795,"Yd3",null,"m3",219.969,"Gallon",null,"m3",1759.75,"Pint",null,"m3",{"$f":"F21","v":1},null,3500.0,0.84]
["Litre",1000.0,"cm3",null,"Litre",0.001,"m3",null,"Litre",1.0,"Litre",null,"Litre",61.0237,"Inch3",null,"Litre",0.035315,"Ft3",null,"Litre",0.001308,"Yd3",null,"Litre",0.219969,"Gallon",null,"Litre",1.759,"Pint",null,"Litre",{"$f":"J21","v":1000},null,4000.0,0.815]
["In3",16.3871,"cm3",null,"In3",1.64E-5,"m3",null,"In3",0.016387,"Litre",null,"In3",1.0,"Inch3",null,"In3",5.787E-4,"Ft3",null,"In3",2.14E-5,"Yd3",null,"In3",0.003605,"Gallon",null,"In3",0.028837,"Pint",null,"In3",{"$f":"N21","v":61023.7}]
["Ft3",28316.8,"cm3",null,"Ft3",0.028317,"m3",null,"Ft3",28.3168,"Litre",null,"Ft3",1728.0,"Inch3",null,"Ft3",1.0,"Ft3",null,"Ft3",0.037037,"Yd3",null,"Ft3",6.22883,"Gallon",null,"Ft3",49.8307,"Pint",null,"Ft3",{"$f":"R21","v":35.3147}]
["Yd3",764555.0,"cm3",null,"Yd3",0.764555,"m3",null,"Yd3",764.555,"Litre",null,"Yd3",46656.0,"Inch3",null,"Yd3",27.0,"Ft3",null,"Yd3",1.0,"Yd3",null,"Yd3",168.1784,"Gallon",null,"Yd3",1345.429,"Pint",null,"Yd3",{"$f":"V21","v":1.30795}]
["Gallon",4546.09,"cm3",null,"Gallon",0.0045461,"m3",null,"Gallon",4.54609,"Litre",null,"Gallon",277.42,"Inch3",null,"Gallon",0.160544,"Ft3",null,"Gallon",0.005946,"Yd3",null,"Gallon",1.0,"Gallon",null,"Gallon",8.0,"Pint",null,"Gallon",{"$f":"Z21","v":219.969}]
["Pint",568.261,"cm3",null,"Pint",5.683E-4,"m3",null,"Pint",0.568261,"Litre",null,"Pint",34.6774,"Inch3",null,"Pint",0.020068,"Ft3",null,"Pint",7.43E-4,"Yd3",null,"Pint",0.125,"Gallon",null,"Pint",1.0,"Pint",null,"Pint",{"$f":"AD21","v":1759.75},null,null,{"$f":"-0.00005*CONVERSION!K31+1.0057","v":0.89005}]
[null,{"$f":"VLOOKUP(CONVERSION!$I$19,'CONVERSION _DATA'!A13:B20,2,FALSE)","v":1000000},null,null,null,{"$f":"VLOOKUP(CONVERSION!$I$19,'CONVERSION _DATA'!E13:F20,2,FALSE)","v":1},null,null,null,{"$f":"VLOOKUP(CONVERSION!$I$19,'CONVERSION _DATA'!I13:J20,2,FALSE)","v":1000},null,null,null,{"$f":"VLOOKUP(CONVERSION!$I$19,'CONVERSION _DATA'!M13:N20,2,FALSE)","v":61023.7},null,null,null,{"$f":"VLOOKUP(CONVERSION!$I$19,'CONVERSION _DATA'!Q13:R20,2,FALSE)","v":35.3147},null,null,null,{"$f":"VLOOKUP(CONVERSION!$I$19,'CONVERSION _DATA'!U13:V20,2,FALSE)","v":1.30795},null,null,null,{"$f":"VLOOKUP(CONVERSION!$I$19,'CONVERSION _DATA'!Y13:Z20,2,FALSE)","v":219.969},null,null,null,{"$f":"VLOOKUP(CONVERSION!$I$19,'CONVERSION _DATA'!AC13:AD20,2,FALSE)","v":1759.75},null,null,null,{"$f":"VLOOKUP(CONVERSION!$L$19,'CONVERSION _DATA'!AG13:AH20,2,FALSE)","v":35.3147}]
[]
["PRESSURE",null,null,null,null,null,null,null,null,null,null,null,null,null,null,null,null,null,null,null,"OIL CONTENT"]
["Bar",1.0,"Bar",null,"Bar",14.504,"PSI",null,"Bar",750.062,"mmHg",null,"Bar",0.9869,"Atmos.",null,"Bar",{"$f":"+B28","v":0.06895},null,null,"ppm",1.0,"ppm",null,"ppm",1.2,"mg/m3",null,"ppm",{"$f":"V26","v":0.8333333333}]
["PSI",0.06895,"Bar",null,"PSI",1.0,"PSI",null,"PSI",51.715,"mmHg",null,"PSI",0.068046,"Atmos.",null,"PSI",{"$f":"+F28","v":1},null,null,"mg/m3",{"$f":"1/Z24","v":0.8333333333},"ppm",null,"mg/m3",1.0,"mg/m3",null,"mg/m3",{"$f":"Z26","v":1}]
["mmHg",0.001333,"Bar",null,"mmHg",0.019337,"PSI",null,"mmHg",1.0,"mmHg",null,"mmHg",0.001316,"Atmos.",null,"mmHg",{"$f":"+J28","v":51.715},null,null,null,{"$f":"VLOOKUP(CONVERSION!$I$13,'CONVERSION _DATA'!U24:V25,2,FALSE)","v":0.8333333333},null,null,null,{"$f":"VLOOKUP(CONVERSION!$I$13,'CONVERSION _DATA'!Y24:Z25,2,FALSE)","v":1},null,null,null,{"$f":"VLOOKUP(CONVERSION!$L$13,'CONVERSION _DATA'!AC24:AD25,2,FALSE)","v":0.8333333333}]
["Atmos.",1.01325,"Bar",null,"Atmos.",14.6959,"PSI",null,"Atmos.",760.0,"mmHg",null,"Atmos.",1.0,"Atmos.",null,"Atmos.",{"$f":"+N28","v":0.068046}]
[null,{"$f":"VLOOKUP(CONVERSION!$C$13,'CONVERSION _DATA'!A24:B27,2,FALSE)","v":0.06895},null,null,null,{"$f":"VLOOKUP(CONVERSION!$C$13,'CONVERSION _DATA'!E24:F27,2,FALSE)","v":1},null,null,null,{"$f":"VLOOKUP(CONVERSION!$C$13,'CONVERSION _DATA'!I24:J27,2,FALSE)","v":51.715},null,null,null,{"$f":"VLOOKUP(CONVERSION!$C$13,'CONVERSION _DATA'!M24:N27,2,FALSE)","v":0.068046},null,null,null,{"$f":"VLOOKUP(CONVERSION!$F$13,'CONVERSION _DATA'!Q24:R27,2,FALSE)","v":0.06895}]
[]
["LENGTH"]
["mm",1.0,"mm",null,"mm",0.1,"cm",null,"mm",0.03937,"Inch",null,"mm",0.003281,"Foot",null,"mm",0.001094,"Yard",null,"mm",0.001,"Metre",null,"mm",{"$f":"+B37","v":1000}]
["cm",10.0,"mm",null,"cm",1.0,"cm",null,"cm",0.393701,"Inch",null,"cm",0.032808,"Foot",null,"cm",0.010936,"Yard",null,"cm",0.01,"Metre",null,"cm",{"$f":"+F37","v":100}]
["Inch",25.4,"mm",null,"Inch",2.54,"cm",null,"Inch",1.0,"Inch",null,"Inch",0.08333,"Foot",null,"Inch",0.027778,"Yard",null,"Inch",0.0254,"Metre",null,"Inch",{"$f":"+J37","v":39.3701}]
["Foot",304.8,"mm",null,"Foot",30.48,"cm",null,"Foot",12.0,"Inch",null,"Foot",1.0,"Foot",null,"Foot",0.333333,"Yard",null,"Foot",0.3048,"Metre",null,"Foot",{"$f":"N37","v":3.28084}]
["Yard",914.4,"mm",null,"Yard",91.44,"cm",null,"Yard",36.0,"Inch",null,"Yard",3.0,"Foot",null,"Yard",1.0,"Yard",null,"Yard",0.9144,"Metre",null,"Yard",{"$f":"+R37","v":1.09361}]
["Metre",1000.0,"mm",null,"Metre",100.0,"cm",null,"Metre",39.3701,"Inch",null,"Metre",3.28084,"Foot",null,"Metre",1.09361,"Yard",null,"Metre",1.0,"Metre",null,"Metre",{"$f":"+V37","v":1}]
[null,{"$f":"VLOOKUP(CONVERSION!$C$31,'CONVERSION _DATA'!A31:B36,2,FALSE)","v":1000},null,null,null,{"$f":"VLOOKUP(CONVERSION!$C$31,'CONVERSION _DATA'!E31:F36,2,FALSE)","v":100},null,null,null,{"$f":"VLOOKUP(CONVERSION!$C$31,'CONVERSION _DATA'!I31:J36,2,FALSE)","v":39.3701},null,null,null,{"$f":"VLOOKUP(CONVERSION!$C$31,'CONVERSION _DATA'!M31:N36,2,FALSE)","v":3.28084},null,null,null,{"$f":"VLOOKUP(CONVERSION!$C$31,'CONVERSION _DATA'!Q31:R36,2,FALSE)","v":1.09361},null,null,null,{"$f":"VLOOKUP(CONVERSION!$C$31,'CONVERSION _DATA'!U31:V36,2,FALSE)","v":1},null,null,null,{"$f":"VLOOKUP(CONVERSION!$F$31,'CONVERSION _DATA'!Y31:Z36,2,FALSE)","v":1.09361}]
[]
["ENERGY"]
["kW/h",1.0,"kW/h",null,"kW/h",1.3412,"HP/h",null,"kW/h",{"$f":"1/B42","v":3600.774887},"Joule",null,"kW/h",860.563,"Calorie",null,"kW/h",3412.8,"Btu",null,"kW/h",{"$f":"B45","v":1}]
{"$rows_left_out":21}