{"text_format":"1","workbook":"xlsx","n_sheets":13,"sheets":["1월","2월","3월","4월","5월","6월","7월","8월","9월","10월","11월","12월","달력 설정"],"not_rendered":{"charts":0,"images":9,"macros":1,"external_links":0,"defined_names":16,"comments":0,"pivot_tables":0},"unopened":[],"bounds":{"document_bytes":16777216,"sheet_cells":100000,"rows_first":2000,"rows_last":500,"rows_between":2000,"halvings":0,"cell_chars":16384,"cell_head_chars":4096},"cells_cut":0,"cells_raw":0,"read":"whole","date_system":"1900"}

{"sheet":"1월","index":0,"n_rows":36,"n_cols":41,"rows_kept":36,"cut":false,"hidden":false,"merged":[[6,9,6,12],[4,9,5,9],[5,10,5,12],[4,13,5,13],[20,9,20,12],[20,13,20,16],[20,17,20,20],[17,26,17,28],[17,30,17,32],[5,18,5,20],[4,21,5,21],[5,22,5,24],[4,25,5,25],[5,26,5,28],[4,29,5,29],[5,30,5,32],[8,9,8,12],[7,9,7,12],[9,9,9,12],[9,13,9,16],[9,21,9,24],[9,17,9,20],[16,10,16,12],[16,14,16,16],[11,41,11,45],[23,34,23,36],[17,34,17,36],[4,34,4,36],[17,22,17,24],[4,22,4,24],[4,18,4,20],[4,14,4,16],[4,10,4,12],[8,41,8,45],[9,41,9,45],[7,41,7,45],[5,41,5,45],[4,41,4,45],[13,41,13,45],[14,41,14,45],[15,41,15,45],[16,41,16,45],[6,17,6,20],[13,29,13,32],[13,33,13,36],[10,34,10,36],[11,34,11,36],[10,33,11,33],[17,1,17,2],[17,4,17,7],[17,40,17,45],[19,40,19,45],[19,1,19,3],[19,9,19,12],[19,13,19,16],[19,17,19,20],[19,21,19,24],[19,25,19,28],[19,29,19,32],[19,33,19,36],[18,13,18,16],[4,33,5,33],[5,34,5,36],[5,14,5,16],[4,17,5,17],[10,41,10,45],[4,26,4,28],[4,30,4,32],[8,13,8,16],[8,17,8,20],[8,21,8,24],[8,25,8,28],[6,41,6,45],[6,13,6,16],[9,25,9,28],[9,29,9,32],[9,33,9,36],[7,29,7,32],[7,33,7,36],[8,29,8,32],[8,33,8,36],[7,13,7,16],[7,17,7,20],[7,21,7,24],[7,25,7,28],[2,9,3,12],[2,13,3,16],[2,17,3,20],[2,21,3,24],[2,25,3,28],[2,29,3,32],[2,33,3,36],[15,9,15,12],[15,13,15,16],[15,17,15,20],[15,21,15,24],[15,25,15,28],[15,29,15,32],[15,33,15,36],[14,9,14,12],[14,13,14,16],[14,17,14,20],[14,21,14,24],[14,25,14,28],[13,9,13,12],[13,13,13,16],[13,17,13,20],[13,21,13,24],[13,25,13,28],[16,18,16,20],[16,22,16,24],[16,26,16,28],[16,30,16,32],[16,9,17,9],[16,13,17,13],[16,17,17,17],[16,21,17,21],[16,25,17,25],[16,29,17,29],[17,10,17,12],[17,14,17,16],[17,18,17,20],[24,13,24,16],[24,17,24,20],[24,21,24,24],[24,25,24,28],[24,29,24,32],[24,33,24,36],[20,21,20,24],[20,25,20,28],[20,29,20,32],[20,33,20,36],[21,33,21,36],[22,14,22,16],[22,18,22,20],[22,22,22,24],[22,26,22,28],[22,30,22,32],[22,34,22,36],[21,13,21,16],[21,17,21,20],[21,21,21,24],[21,25,21,28],[21,29,21,32],[23,22,23,24],[29,1,29,3],[27,9,27,12],[27,13,27,16],[27,17,27,20],[27,21,27,24],[27,25,27,28],[27,29,27,32],[28,10,28,12],[28,26,28,28],[28,30,28,32],[28,14,28,16],[28,18,28,20],[28,22,28,24],[39,9,39,12],[39,13,39,16],[33,33,33,36],[34,10,34,12],[34,14,34,16],[37,9,37,12],[37,13,37,16],[33,9,33,12],[33,13,33,16],[33,17,33,20],[33,21,33,24],[38,9,38,12],[38,13,38,16],[36,9,36,12],[36,13,36,16],[33,25,33,28],[33,29,33,32],[34,9,35,9],[34,13,35,13],[35,10,35,12],[35,14,35,16],[36,21,36,28],[37,21,37,28],[38,21,38,28],[12,9,12,12],[12,13,12,16],[12,17,12,20],[10,10,10,12],[10,14,10,16],[10,18,10,20],[10,22,10,24],[10,26,10,28],[10,30,10,32],[10,9,11,9],[10,13,11,13],[10,17,11,17],[10,29,11,29],[11,10,11,12],[11,14,11,16],[11,18,11,20],[11,22,11,24],[11,26,11,28],[11,30,11,32],[16,34,16,36],[16,33,17,33],[14,29,14,32],[14,33,14,36],[25,25,25,28],[22,25,23,25],[22,29,23,29],[22,33,23,33],[6,33,6,36],[6,29,6,32],[6,25,6,28],[23,26,23,28],[23,30,23,32],[6,21,6,24],[12,21,12,24],[12,25,12,28],[12,29,12,32],[12,33,12,36],[10,21,11,21],[10,25,11,25],[32,9,32,12],[32,13,32,16],[32,17,32,20],[32,21,32,24],[32,25,32,28],[32,29,32,32],[32,33,32,36],[31,9,31,12],[31,13,31,16],[31,17,31,20],[31,21,31,24],[31,25,31,28],[31,29,31,32],[31,33,31,36],[23,10,23,12],[23,14,23,16],[23,18,23,20],[12,41,12,45],[28,33,29,33],[29,10,29,12],[29,14,29,16],[29,18,29,20],[29,22,29,24],[29,26,29,28],[29,30,29,32],[29,34,29,36],[18,17,18,20],[18,21,18,24],[18,25,18,28],[18,29,18,32],[18,33,18,36],[25,9,25,12],[25,13,25,16],[25,17,25,20],[25,21,25,24],[18,9,18,12],[22,9,23,9],[22,13,23,13],[22,17,23,17],[22,21,23,21],[20,42,20,45],[22,10,22,12],[21,9,21,12],[30,40,30,45],[26,13,26,16],[26,17,26,20],[26,21,26,24],[26,25,26,28],[24,9,24,12],[30,9,30,12],[30,13,30,16],[30,17,30,20],[30,21,30,24],[26,9,26,12],[30,25,30,28],[30,29,30,32],[30,33,30,36],[27,33,27,36],[28,34,28,36],[28,9,29,9],[28,13,29,13],[28,17,29,17],[28,21,29,21],[28,25,29,25],[28,29,29,29],[31,40,31,45],[32,40,32,45],[21,42,21,45],[22,42,22,45],[23,42,23,45],[24,42,24,45],[25,42,25,45],[26,42,26,45],[21,40,21,41],[33,40,33,45],[34,40,34,45],[35,40,35,45],[39,21,39,28],[36,29,36,36],[37,29,37,36],[38,29,38,36],[39,29,39,36],[20,40,20,41],[22,40,22,41],[23,40,23,41],[24,40,24,41],[25,40,25,41],[26,40,26,41],[25,29,25,32],[25,33,25,36],[26,29,26,32],[26,33,26,36],[36,40,36,45],[37,40,37,45],[38,40,38,45],[27,40,27,45],[28,40,28,45],[29,40,29,45]]}
["v1.01"]
[]
[null,null,null,null,null,null,null,null,null,"일 Sunday",null,null,null,"월 Monday",null,null,null,"화 Tuesday",null,null,null,"수 Wednesday",null,null,null,"목 Thursday",null,null,null,"금 Friday",null,null,null,"토 Saturday"]
[]
[null,null,null,null,null,null,null,null,null,null,{"$f":"IFERROR(IF(AND(J5<>\"\",VLOOKUP(J5,_공휴일날짜,3,FALSE)<>\"\"),VLOOKUP(J5,_공휴일날짜,3,FALSE),\"\"),\"\")","v":""},null,null,null,{"$f":"IFERROR(IF(AND(N5<>\"\",VLOOKUP(N5,_공휴일날짜,3,FALSE)<>\"\"),VLOOKUP(N5,_공휴일날짜,3,FALSE),\"\"),\"\")","v":""},null,null,null,{"$f":"IFERROR(IF(AND(R5<>\"\",VLOOKUP(R5,_공휴일날짜,3,FALSE)<>\"\"),VLOOKUP(R5,_공휴일날짜,3,FALSE),\"\"),\"\")","v":""},null,null,"2025-01-01",{"$f":"IFERROR(IF(AND(V5<>\"\",VLOOKUP(V5,_공휴일날짜,3,FALSE)<>\"\"),VLOOKUP(V5,_공휴일날짜,3,FALSE),\"\"),\"\")","v":"신정"},null,null,"2025-01-02",{"$f":"IFERROR(IF(AND(Z5<>\"\",VLOOKUP(Z5,_공휴일날짜,3,FALSE)<>\"\"),VLOOKUP(Z5,_공휴일날짜,3,FALSE),\"\"),\"\")","v":""},null,null,"2025-01-03",{"$f":"IFERROR(IF(AND(AD5<>\"\",VLOOKUP(AD5,_공휴일날짜,3,FALSE)<>\"\"),VLOOKUP(AD5,_공휴일날짜,3,FALSE),\"\"),\"\")","v":""},null,null,"2025-01-04",{"$f":"IFERROR(IF(AND(AH5<>\"\",VLOOKUP(AH5,_공휴일날짜,3,FALSE)<>\"\"),VLOOKUP(AH5,_공휴일날짜,3,FALSE),\"\"),\"\")","v":""},null,null,null,null,null,false]
[null,null,null,{"$f":"'달력 설정'!B6","v":2025},1,{"$f":"VLOOKUP($E$6,_월별표기,2)","v":"January"},null,null,null,null,null,null,null,null,null,null,null,null,null,null,null,null,null,null,null,null,null,null,null,null,null,null,null,null,null,null,null,null,null,null,false]
[null,null,null,null,null,null,null,null,null,null,null,null,null,null,null,null,null,null,null,null,null,null,null,null,null,null,null,null,null,null,null,null,null,null,null,null,null,null,null,null,false]
[null,1,null,null,null,null,null,null,null,null,null,null,null,null,null,null,null,null,null,null,null,null,null,null,null,null,null,null,null,null,null,null,null,null,null,null,null,null,null,null,false]
[null,null,null,null,null,null,null,null,null,null,null,null,null,null,null,null,null,null,null,null,null,null,null,null,null,null,null,null,null,null,null,null,null,null,null,null,null,null,null,null,false]
[null,null,null,null,null,null,null,null,null,null,null,null,null,null,null,null,null,null,null,null,null,null,null,null,null,null,null,null,null,null,null,null,null,null,null,null,null,null,null,null,false]
[null,null,null,null,null,null,null,null,null,"2025-01-05",{"$f":"IFERROR(IF(AND(J11<>\"\",VLOOKUP(J11,_공휴일날짜,3,FALSE)<>\"\"),VLOOKUP(J11,_공휴일날짜,3,FALSE),\"\"),\"\")","v":""},null,null,"2025-01-06",{"$f":"IFERROR(IF(AND(N11<>\"\",VLOOKUP(N11,_공휴일날짜,3,FALSE)<>\"\"),VLOOKUP(N11,_공휴일날짜,3,FALSE),\"\"),\"\")","v":""},null,null,"2025-01-07",{"$f":"IFERROR(IF(AND(R11<>\"\",VLOOKUP(R11,_공휴일날짜,3,FALSE)<>\"\"),VLOOKUP(R11,_공휴일날짜,3,FALSE),\"\"),\"\")","v":""},null,null,"2025-01-08",{"$f":"IFERROR(IF(AND(V11<>\"\",VLOOKUP(V11,_공휴일날짜,3,FALSE)<>\"\"),VLOOKUP(V11,_공휴일날짜,3,FALSE),\"\"),\"\")","v":""},null,null,"2025-01-09",{"$f":"IFERROR(IF(AND(Z11<>\"\",VLOOKUP(Z11,_공휴일날짜,3,FALSE)<>\"\"),VLOOKUP(Z11,_공휴일날짜,3,FALSE),\"\"),\"\")","v":""},null,null,"2025-01-10",{"$f":"IFERROR(IF(AND(AD11<>\"\",VLOOKUP(AD11,_공휴일날짜,3,FALSE)<>\"\"),VLOOKUP(AD11,_공휴일날짜,3,FALSE),\"\"),\"\")","v":""},null,null,"2025-01-11",{"$f":"IFERROR(IF(AND(AH11<>\"\",VLOOKUP(AH11,_공휴일날짜,3,FALSE)<>\"\"),VLOOKUP(AH11,_공휴일날짜,3,FALSE),\"\"),\"\")","v":""},null,null,null,null,null,false]
[null,null,null,null,null,null,null,null,null,null,null,null,null,null,null,null,null,null,null,null,null,null,null,null,null,null,null,null,null,null,null,null,null,null,null,null,null,null,null,null,false]
[null,null,null,null,null,null,null,null,null,null,null,null,null,null,null,null,null,null,null,null,null,null,null,null,null,null,null,null,null,null,null,null,null,null,null,null,null,null,null,null,false]
[null,null,null,null,null,null,null,null,null,null,null,null,null,null,null,null,null,null,null,null,null,null,null,null,null,null,null,null,null,null,null,null,null,null,null,null,null,null,null,null,false]
[null,null,null,null,null,null,null,null,null,null,null,null,null,null,null,null,null,null,null,null,null,null,null,null,null,null,null,null,null,null,null,null,null,null,null,null,null,null,null,null,false]
[null,null,null,{"$f":"YEAR(TODAY())","v":2025},{"$f":"MONTH(TODAY())","v":2},{"$f":"DAY(TODAY())","v":24},null,null,null,null,null,null,null,null,null,null,null,null,null,null,null,null,null,null,null,null,null,null,null,null,null,null,null,null,null,null,null,null,null,null,false]
[null,null,null,null,null,null,null,null,null,"2025-01-12",{"$f":"IFERROR(IF(AND(J17<>\"\",VLOOKUP(J17,_공휴일날짜,3,FALSE)<>\"\"),VLOOKUP(J17,_공휴일날짜,3,FALSE),\"\"),\"\")","v":""},null,null,"2025-01-13",{"$f":"IFERROR(IF(AND(N17<>\"\",VLOOKUP(N17,_공휴일날짜,3,FALSE)<>\"\"),VLOOKUP(N17,_공휴일날짜,3,FALSE),\"\"),\"\")","v":""},null,null,"2025-01-14",{"$f":"IFERROR(IF(AND(R17<>\"\",VLOOKUP(R17,_공휴일날짜,3,FALSE)<>\"\"),VLOOKUP(R17,_공휴일날짜,3,FALSE),\"\"),\"\")","v":""},null,null,"2025-01-15",{"$f":"IFERROR(IF(AND(V17<>\"\",VLOOKUP(V17,_공휴일날짜,3,FALSE)<>\"\"),VLOOKUP(V17,_공휴일날짜,3,FALSE),\"\"),\"\")","v":""},null,null,"2025-01-16",{"$f":"IFERROR(IF(AND(Z17<>\"\",VLOOKUP(Z17,_공휴일날짜,3,FALSE)<>\"\"),VLOOKUP(Z17,_공휴일날짜,3,FALSE),\"\"),\"\")","v":""},null,null,"2025-01-17",{"$f":"IFERROR(IF(AND(AD17<>\"\",VLOOKUP(AD17,_공휴일날짜,3,FALSE)<>\"\"),VLOOKUP(AD17,_공휴일날짜,3,FALSE),\"\"),\"\")","v":""},null,null,"2025-01-18",{"$f":"IFERROR(IF(AND(AH17<>\"\",VLOOKUP(AH17,_공휴일날짜,3,FALSE)<>\"\"),VLOOKUP(AH17,_공휴일날짜,3,FALSE),\"\"),\"\")","v":""}]
[]
[]
[null,{"$f":"VLOOKUP($E$20,_월별표기,2)","v":"December"},null,null,12]
[null,"일","월","화","수","목","금","토"]
[null,"2024-12-01","2024-12-02","2024-12-03","2024-12-04","2024-12-05","2024-12-06","2024-12-07"]
[null,"2024-12-08","2024-12-09","2024-12-10","2024-12-11","2024-12-12","2024-12-13","2024-12-14",null,"2025-01-19",{"$f":"IFERROR(IF(AND(J23<>\"\",VLOOKUP(J23,_공휴일날짜,3,FALSE)<>\"\"),VLOOKUP(J23,_공휴일날짜,3,FALSE),\"\"),\"\")","v":""},null,null,"2025-01-20",{"$f":"IFERROR(IF(AND(N23<>\"\",VLOOKUP(N23,_공휴일날짜,3,FALSE)<>\"\"),VLOOKUP(N23,_공휴일날짜,3,FALSE),\"\"),\"\")","v":""},null,null,"2025-01-21",{"$f":"IFERROR(IF(AND(R23<>\"\",VLOOKUP(R23,_공휴일날짜,3,FALSE)<>\"\"),VLOOKUP(R23,_공휴일날짜,3,FALSE),\"\"),\"\")","v":""},null,null,"2025-01-22",{"$f":"IFERROR(IF(AND(V23<>\"\",VLOOKUP(V23,_공휴일날짜,3,FALSE)<>\"\"),VLOOKUP(V23,_공휴일날짜,3,FALSE),\"\"),\"\")","v":""},null,null,"2025-01-23",{"$f":"IFERROR(IF(AND(Z23<>\"\",VLOOKUP(Z23,_공휴일날짜,3,FALSE)<>\"\"),VLOOKUP(Z23,_공휴일날짜,3,FALSE),\"\"),\"\")","v":""},null,null,"2025-01-24",{"$f":"IFERROR(IF(AND(AD23<>\"\",VLOOKUP(AD23,_공휴일날짜,3,FALSE)<>\"\"),VLOOKUP(AD23,_공휴일날짜,3,FALSE),\"\"),\"\")","v":""},null,null,"2025-01-25",{"$f":"IFERROR(IF(AND(AH23<>\"\",VLOOKUP(AH23,_공휴일날짜,3,FALSE)<>\"\"),VLOOKUP(AH23,_공휴일날짜,3,FALSE),\"\"),\"\")","v":""}]
[null,"2024-12-15","2024-12-16","2024-12-17","2024-12-18","2024-12-19","2024-12-20","2024-12-21"]
[null,"2024-12-22","2024-12-23","2024-12-24","2024-12-25","2024-12-26","2024-12-27","2024-12-28"]
[null,"2024-12-29","2024-12-30","2024-12-31"]
[]
[]
[null,null,null,null,null,null,null,null,null,"2025-01-26",{"$f":"IFERROR(IF(AND(J29<>\"\",VLOOKUP(J29,_공휴일날짜,3,FALSE)<>\"\"),VLOOKUP(J29,_공휴일날짜,3,FALSE),\"\"),\"\")","v":""},null,null,"2025-01-27",{"$f":"IFERROR(IF(AND(N29<>\"\",VLOOKUP(N29,_공휴일날짜,3,FALSE)<>\"\"),VLOOKUP(N29,_공휴일날짜,3,FALSE),\"\"),\"\")","v":"대체 휴일"},null,null,"2025-01-28",{"$f":"IFERROR(IF(AND(R29<>\"\",VLOOKUP(R29,_공휴일날짜,3,FALSE)<>\"\"),VLOOKUP(R29,_공휴일날짜,3,FALSE),\"\"),\"\")","v":""},null,null,"2025-01-29",{"$f":"IFERROR(IF(AND(V29<>\"\",VLOOKUP(V29,_공휴일날짜,3,FALSE)<>\"\"),VLOOKUP(V29,_공휴일날짜,3,FALSE),\"\"),\"\")","v":"설날"},null,null,"2025-01-30",{"$f":"IFERROR(IF(AND(Z29<>\"\",VLOOKUP(Z29,_공휴일날짜,3,FALSE)<>\"\"),VLOOKUP(Z29,_공휴일날짜,3,FALSE),\"\"),\"\")","v":""},null,null,"2025-01-31",{"$f":"IFERROR(IF(AND(AD29<>\"\",VLOOKUP(AD29,_공휴일날짜,3,FALSE)<>\"\"),VLOOKUP(AD29,_공휴일날짜,3,FALSE),\"\"),\"\")","v":""},null,null,null,{"$f":"IFERROR(IF(AND(AH29<>\"\",VLOOKUP(AH29,_공휴일날짜,3,FALSE)<>\"\"),VLOOKUP(AH29,_공휴일날짜,3,FALSE),\"\"),\"\")","v":""}]
[null,{"$f":"VLOOKUP($E$30,_월별표기,2)","v":"February"},null,null,2]
[null,"일","월","화","수","목","금","토"]
[null,null,null,null,null,null,null,"2025-02-01"]
[null,"2025-02-02","2025-02-03","2025-02-04","2025-02-05","2025-02-06","2025-02-07","2025-02-08"]
[null,"2025-02-09","2025-02-10","2025-02-11","2025-02-12","2025-02-13","2025-02-14","2025-02-15"]
[null,"2025-02-16","2025-02-17","2025-02-18","2025-02-19","2025-02-20","2025-02-21","2025-02-22",null,null,{"$f":"IFERROR(IF(AND(J35<>\"\",VLOOKUP(J35,_공휴일날짜,3,FALSE)<>\"\"),VLOOKUP(J35,_공휴일날짜,3,FALSE),\"\"),\"\")","v":""},null,null,null,{"$f":"IFERROR(IF(AND(N35<>\"\",VLOOKUP(N35,_공휴일날짜,3,FALSE)<>\"\"),VLOOKUP(N35,_공휴일날짜,3,FALSE),\"\"),\"\")","v":""}]
[null,"2025-02-23","2025-02-24","2025-02-25","2025-02-26","2025-02-27","2025-02-28"]

{"sheet":"2월","index":1,"n_rows":37,"n_cols":41,"rows_kept":37,"cut":false,"hidden":false,"merged":[[5,41,5,45],[2,33,3,36],[4,9,5,9],[4,10,4,12],[4,13,5,13],[4,14,4,16],[4,17,5,17],[4,18,4,20],[4,21,5,21],[4,22,4,24],[4,25,5,25],[2,9,3,12],[2,13,3,16],[2,17,3,20],[2,21,3,24],[2,25,3,28],[2,29,3,32],[5,10,5,12],[5,14,5,16],[5,18,5,20],[5,22,5,24],[5,26,5,28],[5,30,5,32],[4,26,4,28],[4,29,5,29],[4,30,4,32],[6,33,6,36],[6,41,6,45],[7,9,7,12],[7,13,7,16],[7,17,7,20],[7,21,7,24],[7,25,7,28],[7,29,7,32],[7,33,7,36],[7,41,7,45],[6,9,6,12],[6,13,6,16],[6,17,6,20],[6,21,6,24],[6,25,6,28],[6,29,6,32],[4,33,5,33],[4,34,4,36],[4,41,4,45],[5,34,5,36],[10,9,11,9],[10,10,10,12],[10,13,11,13],[10,14,10,16],[10,17,11,17],[10,18,10,20],[8,33,8,36],[8,41,8,45],[9,9,9,12],[9,13,9,16],[9,17,9,20],[9,21,9,24],[9,25,9,28],[9,29,9,32],[9,33,9,36],[9,41,9,45],[8,9,8,12],[8,13,8,16],[8,17,8,20],[8,21,8,24],[8,25,8,28],[8,29,8,32],[11,41,11,45],[12,9,12,12],[12,13,12,16],[12,17,12,20],[12,21,12,24],[12,25,12,28],[12,29,12,32],[12,33,12,36],[12,41,12,45],[10,33,11,33],[10,34,10,36],[10,41,10,45],[11,10,11,12],[11,14,11,16],[11,18,11,20],[11,22,11,24],[11,26,11,28],[11,30,11,32],[11,34,11,36],[10,21,11,21],[10,22,10,24],[10,25,11,25],[10,26,10,28],[10,29,11,29],[10,30,10,32],[13,33,13,36],[13,41,13,45],[14,9,14,12],[14,13,14,16],[14,17,14,20],[14,21,14,24],[14,25,14,28],[14,29,14,32],[14,33,14,36],[14,41,14,45],[13,9,13,12],[13,13,13,16],[13,17,13,20],[13,21,13,24],[13,25,13,28],[13,29,13,32],[15,41,15,45],[16,9,17,9],[16,10,16,12],[16,13,17,13],[16,14,16,16],[16,17,17,17],[16,18,16,20],[16,21,17,21],[16,22,16,24],[15,9,15,12],[15,13,15,16],[15,17,15,20],[15,21,15,24],[15,25,15,28],[15,29,15,32],[16,41,16,45],[17,30,17,32],[17,34,17,36],[16,25,17,25],[16,26,16,28],[16,29,17,29],[16,30,16,32],[16,33,17,33],[16,34,16,36],[15,33,15,36],[19,1,19,3],[19,9,19,12],[19,13,19,16],[19,17,19,20],[19,21,19,24],[19,25,19,28],[17,40,17,45],[18,9,18,12],[18,13,18,16],[18,17,18,20],[18,21,18,24],[18,25,18,28],[18,29,18,32],[18,33,18,36],[19,29,19,32],[19,33,19,36],[19,40,19,45],[17,1,17,2],[17,4,17,7],[17,10,17,12],[17,14,17,16],[17,18,17,20],[17,22,17,24],[17,26,17,28],[20,9,20,12],[20,13,20,16],[20,17,20,20],[20,21,20,24],[20,25,20,28],[20,29,20,32],[20,33,20,36],[20,40,20,41],[20,42,20,45],[21,9,21,12],[21,13,21,16],[21,17,21,20],[21,21,21,24],[21,25,21,28],[21,29,21,32],[21,33,21,36],[21,40,21,41],[21,42,21,45],[22,9,23,9],[22,10,22,12],[22,13,23,13],[22,14,22,16],[22,17,23,17],[22,18,22,20],[22,21,23,21],[22,22,22,24],[22,25,23,25],[22,42,22,45],[23,10,23,12],[23,14,23,16],[23,18,23,20],[23,22,23,24],[23,26,23,28],[23,30,23,32],[23,34,23,36],[23,40,23,41],[23,42,23,45],[22,26,22,28],[22,29,23,29],[22,30,22,32],[22,33,23,33],[22,34,22,36],[22,40,22,41],[24,33,24,36],[24,40,24,41],[24,42,24,45],[25,9,25,12],[25,13,25,16],[25,17,25,20],[25,21,25,24],[25,25,25,28],[25,29,25,32],[25,33,25,36],[24,9,24,12],[24,13,24,16],[24,17,24,20],[24,21,24,24],[24,25,24,28],[24,29,24,32],[25,40,25,41],[25,42,25,45],[26,9,26,12],[26,13,26,16],[26,17,26,20],[26,21,26,24],[26,25,26,28],[26,29,26,32],[26,33,26,36],[26,40,26,41],[26,42,26,45],[27,9,27,12],[27,13,27,16],[27,17,27,20],[27,21,27,24],[27,25,27,28],[27,29,27,32],[27,33,27,36],[27,40,27,45],[29,1,29,3],[29,10,29,12],[29,14,29,16],[29,18,29,20],[29,22,29,24],[29,26,29,28],[29,30,29,32],[28,21,29,21],[28,22,28,24],[28,25,29,25],[28,26,28,28],[28,29,29,29],[28,30,28,32],[28,9,29,9],[28,10,28,12],[28,13,29,13],[28,14,28,16],[28,17,29,17],[28,18,28,20],[29,34,29,36],[29,40,29,45],[30,9,30,12],[30,13,30,16],[30,17,30,20],[30,21,30,24],[30,25,30,28],[30,29,30,32],[30,33,30,36],[30,40,30,45],[28,33,29,33],[28,34,28,36],[28,40,28,45],[31,33,31,36],[31,40,31,45],[32,9,32,12],[32,13,32,16],[32,17,32,20],[32,21,32,24],[32,25,32,28],[32,29,32,32],[32,33,32,36],[32,40,32,45],[31,9,31,12],[31,13,31,16],[31,17,31,20],[31,21,31,24],[31,25,31,28],[31,29,31,32],[33,33,33,36],[33,40,33,45],[34,9,35,9],[34,10,34,12],[34,13,35,13],[34,14,34,16],[34,40,34,45],[35,10,35,12],[35,14,35,16],[35,40,35,45],[33,9,33,12],[33,13,33,16],[33,17,33,20],[33,21,33,24],[33,25,33,28],[33,29,33,32],[36,9,36,12],[36,13,36,16],[36,21,36,28],[36,29,36,36],[36,40,36,45],[37,9,37,12],[37,13,37,16],[37,21,37,28],[37,29,37,36],[37,40,37,45],[38,9,38,12],[38,13,38,16],[38,21,38,28],[38,29,38,36],[38,40,38,45],[39,9,39,12],[39,13,39,16],[39,21,39,28],[39,29,39,36]]}
["v1.01"]
[]
[null,null,null,null,null,null,null,null,null,"일 Sunday",null,null,null,"월 Monday",null,null,null,"화 Tuesday",null,null,null,"수 Wednesday",null,null,null,"목 Thursday",null,null,null,"금 Friday",null,null,null,"토 Saturday"]
[]
[null,null,null,null,null,null,null,null,null,null,{"$f":"IFERROR(IF(AND(J5<>\"\",VLOOKUP(J5,_공휴일날짜,3,FALSE)<>\"\"),VLOOKUP(J5,_공휴일날짜,3,FALSE),\"\"),\"\")","v":""},null,null,null,{"$f":"IFERROR(IF(AND(N5<>\"\",VLOOKUP(N5,_공휴일날짜,3,FALSE)<>\"\"),VLOOKUP(N5,_공휴일날짜,3,FALSE),\"\"),\"\")","v":""},null,null,null,{"$f":"IFERROR(IF(AND(R5<>\"\",VLOOKUP(R5,_공휴일날짜,3,FALSE)<>\"\"),VLOOKUP(R5,_공휴일날짜,3,FALSE),\"\"),\"\")","v":""},null,null,null,{"$f":"IFERROR(IF(AND(V5<>\"\",VLOOKUP(V5,_공휴일날짜,3,FALSE)<>\"\"),VLOOKUP(V5,_공휴일날짜,3,FALSE),\"\"),\"\")","v":""},null,null,null,{"$f":"IFERROR(IF(AND(Z5<>\"\",VLOOKUP(Z5,_공휴일날짜,3,FALSE)<>\"\"),VLOOKUP(Z5,_공휴일날짜,3,FALSE),\"\"),\"\")","v":""},null,null,null,{"$f":"IFERROR(IF(AND(AD5<>\"\",VLOOKUP(AD5,_공휴일날짜,3,FALSE)<>\"\"),VLOOKUP(AD5,_공휴일날짜,3,FALSE),\"\"),\"\")","v":""},null,null,"2025-02-01",{"$f":"IFERROR(IF(AND(AH5<>\"\",VLOOKUP(AH5,_공휴일날짜,3,FALSE)<>\"\"),VLOOKUP(AH5,_공휴일날짜,3,FALSE),\"\"),\"\")","v":""},null,null,null,null,null,false]
[null,null,null,{"$f":"'달력 설정'!B6","v":2025},2,{"$f":"VLOOKUP($E$6,_월별표기,2)","v":"February"},null,null,null,null,null,null,null,null,null,null,null,null,null,null,null,null,null,null,null,null,null,null,null,null,null,null,null,null,null,null,null,null,null,null,false]
[null,null,null,null,null,null,null,null,null,null,null,null,null,null,null,null,null,null,null,null,null,null,null,null,null,null,null,null,null,null,null,null,null,null,null,null,null,null,null,null,false]
[null,1,null,null,null,null,null,null,null,null,null,null,null,null,null,null,null,null,null,null,null,null,null,null,null,null,null,null,null,null,null,null,null,null,null,null,null,null,null,null,false]
[null,null,null,null,null,null,null,null,null,null,null,null,null,null,null,null,null,null,null,null,null,null,null,null,null,null,null,null,null,null,null,null,null,null,null,null,null,null,null,null,false]
[null,null,null,null,null,null,null,null,null,null,null,null,null,null,null,null,null,null,null,null,null,null,null,null,null,null,null,null,null,null,null,null,null,null,null,null,null,null,null,null,false]
[null,null,null,null,null,null,null,null,null,"2025-02-02",{"$f":"IFERROR(IF(AND(J11<>\"\",VLOOKUP(J11,_공휴일날짜,3,FALSE)<>\"\"),VLOOKUP(J11,_공휴일날짜,3,FALSE),\"\"),\"\")","v":""},null,null,"2025-02-03",{"$f":"IFERROR(IF(AND(N11<>\"\",VLOOKUP(N11,_공휴일날짜,3,FALSE)<>\"\"),VLOOKUP(N11,_공휴일날짜,3,FALSE),\"\"),\"\")","v":""},null,null,"2025-02-04",{"$f":"IFERROR(IF(AND(R11<>\"\",VLOOKUP(R11,_공휴일날짜,3,FALSE)<>\"\"),VLOOKUP(R11,_공휴일날짜,3,FALSE),\"\"),\"\")","v":""},null,null,"2025-02-05",{"$f":"IFERROR(IF(AND(V11<>\"\",VLOOKUP(V11,_공휴일날짜,3,FALSE)<>\"\"),VLOOKUP(V11,_공휴일날짜,3,FALSE),\"\"),\"\")","v":""},null,null,"2025-02-06",{"$f":"IFERROR(IF(AND(Z11<>\"\",VLOOKUP(Z11,_공휴일날짜,3,FALSE)<>\"\"),VLOOKUP(Z11,_공휴일날짜,3,FALSE),\"\"),\"\")","v":""},null,null,"2025-02-07",{"$f":"IFERROR(IF(AND(AD11<>\"\",VLOOKUP(AD11,_공휴일날짜,3,FALSE)<>\"\"),VLOOKUP(AD11,_공휴일날짜,3,FALSE),\"\"),\"\")","v":""},null,null,"2025-02-08",{"$f":"IFERROR(IF(AND(AH11<>\"\",VLOOKUP(AH11,_공휴일날짜,3,FALSE)<>\"\"),VLOOKUP(AH11,_공휴일날짜,3,FALSE),\"\"),\"\")","v":""},null,null,null,null,null,false]
[null,null,null,null,null,null,null,null,null,null,null,null,null,null,null,null,null,null,null,null,null,null,null,null,null,null,null,null,null,null,null,null,null,null,null,null,null,null,null,null,false]
[null,null,null,null,null,null,null,null,null,null,null,null,null,null,null,null,null,null,null,null,null,null,null,null,null,null,null,null,null,null,null,null,null,null,null,null,null,null,null,null,false]
[null,null,null,null,null,null,null,null,null,null,null,null,null,null,null,null,null,null,null,null,null,null,null,null,null,null,null,null,null,null,null,null,null,null,null,null,null,null,null,null,false]
[null,null,null,null,null,null,null,null,null,null,null,null,null,null,null,null,null,null,null,null,null,null,null,null,null,null,null,null,null,null,null,null,null,null,null,null,null,null,null,null,false]
[null,null,null,{"$f":"YEAR(TODAY())","v":2025},{"$f":"MONTH(TODAY())","v":2},{"$f":"DAY(TODAY())","v":24},null,null,null,null,null,null,null,null,null,null,null,null,null,null,null,null,null,null,null,null,null,null,null,null,null,null,null,null,null,null,null,null,null,null,false]
[null,null,null,null,null,null,null,null,null,"2025-02-09",{"$f":"IFERROR(IF(AND(J17<>\"\",VLOOKUP(J17,_공휴일날짜,3,FALSE)<>\"\"),VLOOKUP(J17,_공휴일날짜,3,FALSE),\"\"),\"\")","v":""},null,null,"2025-02-10",{"$f":"IFERROR(IF(AND(N17<>\"\",VLOOKUP(N17,_공휴일날짜,3,FALSE)<>\"\"),VLOOKUP(N17,_공휴일날짜,3,FALSE),\"\"),\"\")","v":""},null,null,"2025-02-11",{"$f":"IFERROR(IF(AND(R17<>\"\",VLOOKUP(R17,_공휴일날짜,3,FALSE)<>\"\"),VLOOKUP(R17,_공휴일날짜,3,FALSE),\"\"),\"\")","v":""},null,null,"2025-02-12",{"$f":"IFERROR(IF(AND(V17<>\"\",VLOOKUP(V17,_공휴일날짜,3,FALSE)<>\"\"),VLOOKUP(V17,_공휴일날짜,3,FALSE),\"\"),\"\")","v":""},null,null,"2025-02-13",{"$f":"IFERROR(IF(AND(Z17<>\"\",VLOOKUP(Z17,_공휴일날짜,3,FALSE)<>\"\"),VLOOKUP(Z17,_공휴일날짜,3,FALSE),\"\"),\"\")","v":""},null,null,"2025-02-14",{"$f":"IFERROR(IF(AND(AD17<>\"\",VLOOKUP(AD17,_공휴일날짜,3,FALSE)<>\"\"),VLOOKUP(AD17,_공휴일날짜,3,FALSE),\"\"),\"\")","v":""},null,null,"2025-02-15",{"$f":"IFERROR(IF(AND(AH17<>\"\",VLOOKUP(AH17,_공휴일날짜,3,FALSE)<>\"\"),VLOOKUP(AH17,_공휴일날짜,3,FALSE),\"\"),\"\")","v":""}]
[]
[]
[null,{"$f":"VLOOKUP($E$20,_월별표기,2)","v":"January"},null,null,1]
[null,"일","월","화","수","목","금","토"]
[null,null,null,null,"2025-01-01","2025-01-02","2025-01-03","2025-01-04"]
[null,"2025-01-05","2025-01-06","2025-01-07","2025-01-08","2025-01-09","2025-01-10","2025-01-11",null,"2025-02-16",{"$f":"IFERROR(IF(AND(J23<>\"\",VLOOKUP(J23,_공휴일날짜,3,FALSE)<>\"\"),VLOOKUP(J23,_공휴일날짜,3,FALSE),\"\"),\"\")","v":""},null,null,"2025-02-17",{"$f":"IFERROR(IF(AND(N23<>\"\",VLOOKUP(N23,_공휴일날짜,3,FALSE)<>\"\"),VLOOKUP(N23,_공휴일날짜,3,FALSE),\"\"),\"\")","v":""},null,null,"2025-02-18",{"$f":"IFERROR(IF(AND(R23<>\"\",VLOOKUP(R23,_공휴일날짜,3,FALSE)<>\"\"),VLOOKUP(R23,_공휴일날짜,3,FALSE),\"\"),\"\")","v":""},null,null,"2025-02-19",{"$f":"IFERROR(IF(AND(V23<>\"\",VLOOKUP(V23,_공휴일날짜,3,FALSE)<>\"\"),VLOOKUP(V23,_공휴일날짜,3,FALSE),\"\"),\"\")","v":""},null,null,"2025-02-20",{"$f":"IFERROR(IF(AND(Z23<>\"\",VLOOKUP(Z23,_공휴일날짜,3,FALSE)<>\"\"),VLOOKUP(Z23,_공휴일날짜,3,FALSE),\"\"),\"\")","v":""},null,null,"2025-02-21",{"$f":"IFERROR(IF(AND(AD23<>\"\",VLOOKUP(AD23,_공휴일날짜,3,FALSE)<>\"\"),VLOOKUP(AD23,_공휴일날짜,3,FALSE),\"\"),\"\")","v":""},null,null,"2025-02-22",{"$f":"IFERROR(IF(AND(AH23<>\"\",VLOOKUP(AH23,_공휴일날짜,3,FALSE)<>\"\"),VLOOKUP(AH23,_공휴일날짜,3,FALSE),\"\"),\"\")","v":""}]
[null,"2025-01-12","2025-01-13","2025-01-14","2025-01-15","2025-01-16","2025-01-17","2025-01-18"]
[null,"2025-01-19","2025-01-20","2025-01-21","2025-01-22","2025-01-23","2025-01-24","2025-01-25"]
[null,"2025-01-26","2025-01-27","2025-01-28","2025-01-29","2025-01-30","2025-01-31"]
[]
[]
[null,null,null,null,null,null,null,null,null,"2025-02-23",{"$f":"IFERROR(IF(AND(J29<>\"\",VLOOKUP(J29,_공휴일날짜,3,FALSE)<>\"\"),VLOOKUP(J29,_공휴일날짜,3,FALSE),\"\"),\"\")","v":""},null,null,"2025-02-24",{"$f":"IFERROR(IF(AND(N29<>\"\",VLOOKUP(N29,_공휴일날짜,3,FALSE)<>\"\"),VLOOKUP(N29,_공휴일날짜,3,FALSE),\"\"),\"\")","v":""},null,null,"2025-02-25",{"$f":"IFERROR(IF(AND(R29<>\"\",VLOOKUP(R29,_공휴일날짜,3,FALSE)<>\"\"),VLOOKUP(R29,_공휴일날짜,3,FALSE),\"\"),\"\")","v":""},null,null,"2025-02-26",{"$f":"IFERROR(IF(AND(V29<>\"\",VLOOKUP(V29,_공휴일날짜,3,FALSE)<>\"\"),VLOOKUP(V29,_공휴일날짜,3,FALSE),\"\"),\"\")","v":""},null,null,"2025-02-27",{"$f":"IFERROR(IF(AND(Z29<>\"\",VLOOKUP(Z29,_공휴일날짜,3,FALSE)<>\"\"),VLOOKUP(Z29,_공휴일날짜,3,FALSE),\"\"),\"\")","v":""},null,null,"2025-02-28",{"$f":"IFERROR(IF(AND(AD29<>\"\",VLOOKUP(AD29,_공휴일날짜,3,FALSE)<>\"\"),VLOOKUP(AD29,_공휴일날짜,3,FALSE),\"\"),\"\")","v":""},null,null,null,{"$f":"IFERROR(IF(AND(AH29<>\"\",VLOOKUP(AH29,_공휴일날짜,3,FALSE)<>\"\"),VLOOKUP(AH29,_공휴일날짜,3,FALSE),\"\"),\"\")","v":""}]
[null,{"$f":"VLOOKUP($E$30,_월별표기,2)","v":"March"},null,null,3]
[null,"일","월","화","수","목","금","토"]
[null,null,null,null,null,null,null,"2025-03-01"]
[null,"2025-03-02","2025-03-03","2025-03-04","2025-03-05","2025-03-06","2025-03-07","2025-03-08"]
[null,"2025-03-09","2025-03-10","2025-03-11","2025-03-12","2025-03-13","2025-03-14","2025-03-15"]
[null,"2025-03-16","2025-03-17","2025-03-18","2025-03-19","2025-03-20","2025-03-21","2025-03-22",null,null,{"$f":"IFERROR(IF(AND(J35<>\"\",VLOOKUP(J35,_공휴일날짜,3,FALSE)<>\"\"),VLOOKUP(J35,_공휴일날짜,3,FALSE),\"\"),\"\")","v":""},null,null,null,{"$f":"IFERROR(IF(AND(N35<>\"\",VLOOKUP(N35,_공휴일날짜,3,FALSE)<>\"\"),VLOOKUP(N35,_공휴일날짜,3,FALSE),\"\"),\"\")","v":""}]
[null,"2025-03-23","2025-03-24","2025-03-25","2025-03-26","2025-03-27","2025-03-28","2025-03-29"]
[null,"2025-03-30","2025-03-31"]

{"sheet":"3월","index":2,"n_rows":36,"n_cols":41,"rows_kept":36,"cut":false,"hidden":false,"merged":[[5,41,5,45],[2,33,3,36],[4,9,5,9],[4,10,4,12],[4,13,5,13],[4,14,4,16],[4,17,5,17],[4,18,4,20],[4,21,5,21],[4,22,4,24],[4,25,5,25],[2,9,3,12],[2,13,3,16],[2,17,3,20],[2,21,3,24],[2,25,3,28],[2,29,3,32],[5,10,5,12],[5,14,5,16],[5,18,5,20],[5,22,5,24],[5,26,5,28],[5,30,5,32],[4,26,4,28],[4,29,5,29],[4,30,4,32],[6,33,6,36],[6,41,6,45],[7,9,7,12],[7,13,7,16],[7,17,7,20],[7,21,7,24],[7,25,7,28],[7,29,7,32],[7,33,7,36],[7,41,7,45],[6,9,6,12],[6,13,6,16],[6,17,6,20],[6,21,6,24],[6,25,6,28],[6,29,6,32],[4,33,5,33],[4,34,4,36],[4,41,4,45],[5,34,5,36],[10,9,11,9],[10,10,10,12],[10,13,11,13],[10,14,10,16],[10,17,11,17],[10,18,10,20],[8,33,8,36],[8,41,8,45],[9,9,9,12],[9,13,9,16],[9,17,9,20],[9,21,9,24],[9,25,9,28],[9,29,9,32],[9,33,9,36],[9,41,9,45],[8,9,8,12],[8,13,8,16],[8,17,8,20],[8,21,8,24],[8,25,8,28],[8,29,8,32],[11,41,11,45],[12,9,12,12],[12,13,12,16],[12,17,12,20],[12,21,12,24],[12,25,12,28],[12,29,12,32],[12,33,12,36],[12,41,12,45],[10,33,11,33],[10,34,10,36],[10,41,10,45],[11,10,11,12],[11,14,11,16],[11,18,11,20],[11,22,11,24],[11,26,11,28],[11,30,11,32],[11,34,11,36],[10,21,11,21],[10,22,10,24],[10,25,11,25],[10,26,10,28],[10,29,11,29],[10,30,10,32],[13,33,13,36],[13,41,13,45],[14,9,14,12],[14,13,14,16],[14,17,14,20],[14,21,14,24],[14,25,14,28],[14,29,14,32],[14,33,14,36],[14,41,14,45],[13,9,13,12],[13,13,13,16],[13,17,13,20],[13,21,13,24],[13,25,13,28],[13,29,13,32],[15,41,15,45],[16,9,17,9],[16,10,16,12],[16,13,17,13],[16,14,16,16],[16,17,17,17],[16,18,16,20],[16,21,17,21],[16,22,16,24],[15,9,15,12],[15,13,15,16],[15,17,15,20],[15,21,15,24],[15,25,15,28],[15,29,15,32],[16,41,16,45],[17,30,17,32],[17,34,17,36],[16,25,17,25],[16,26,16,28],[16,29,17,29],[16,30,16,32],[16,33,17,33],[16,34,16,36],[15,33,15,36],[19,1,19,3],[19,9,19,12],[19,13,19,16],[19,17,19,20],[19,21,19,24],[19,25,19,28],[17,40,17,45],[18,9,18,12],[18,13,18,16],[18,17,18,20],[18,21,18,24],[18,25,18,28],[18,29,18,32],[18,33,18,36],[19,29,19,32],[19,33,19,36],[19,40,19,45],[17,1,17,2],[17,4,17,7],[17,10,17,12],[17,14,17,16],[17,18,17,20],[17,22,17,24],[17,26,17,28],[20,9,20,12],[20,13,20,16],[20,17,20,20],[20,21,20,24],[20,25,20,28],[20,29,20,32],[20,33,20,36],[20,40,20,41],[20,42,20,45],[21,9,21,12],[21,13,21,16],[21,17,21,20],[21,21,21,24],[21,25,21,28],[21,29,21,32],[21,33,21,36],[21,40,21,41],[21,42,21,45],[22,9,23,9],[22,10,22,12],[22,13,23,13],[22,14,22,16],[22,17,23,17],[22,18,22,20],[22,21,23,21],[22,22,22,24],[22,25,23,25],[22,42,22,45],[23,10,23,12],[23,14,23,16],[23,18,23,20],[23,22,23,24],[23,26,23,28],[23,30,23,32],[23,34,23,36],[23,40,23,41],[23,42,23,45],[22,26,22,28],[22,29,23,29],[22,30,22,32],[22,33,23,33],[22,34,22,36],[22,40,22,41],[24,33,24,36],[24,40,24,41],[24,42,24,45],[25,9,25,12],[25,13,25,16],[25,17,25,20],[25,21,25,24],[25,25,25,28],[25,29,25,32],[25,33,25,36],[24,9,24,12],[24,13,24,16],[24,17,24,20],[24,21,24,24],[24,25,24,28],[24,29,24,32],[25,40,25,41],[25,42,25,45],[26,9,26,12],[26,13,26,16],[26,17,26,20],[26,21,26,24],[26,25,26,28],[26,29,26,32],[26,33,26,36],[26,40,26,41],[26,42,26,45],[27,9,27,12],[27,13,27,16],[27,17,27,20],[27,21,27,24],[27,25,27,28],[27,29,27,32],[27,33,27,36],[27,40,27,45],[29,1,29,3],[29,10,29,12],[29,14,29,16],[29,18,29,20],[29,22,29,24],[29,26,29,28],[29,30,29,32],[28,21,29,21],[28,22,28,24],[28,25,29,25],[28,26,28,28],[28,29,29,29],[28,30,28,32],[28,9,29,9],[28,10,28,12],[28,13,29,13],[28,14,28,16],[28,17,29,17],[28,18,28,20],[29,34,29,36],[29,40,29,45],[30,9,30,12],[30,13,30,16],[30,17,30,20],[30,21,30,24],[30,25,30,28],[30,29,30,32],[30,33,30,36],[30,40,30,45],[28,33,29,33],[28,34,28,36],[28,40,28,45],[31,33,31,36],[31,40,31,45],[32,9,32,12],[32,13,32,16],[32,17,32,20],[32,21,32,24],[32,25,32,28],[32,29,32,32],[32,33,32,36],[32,40,32,45],[31,9,31,12],[31,13,31,16],[31,17,31,20],[31,21,31,24],[31,25,31,28],[31,29,31,32],[33,33,33,36],[33,40,33,45],[34,9,35,9],[34,10,34,12],[34,13,35,13],[34,14,34,16],[34,40,34,45],[35,10,35,12],[35,14,35,16],[35,40,35,45],[33,9,33,12],[33,13,33,16],[33,17,33,20],[33,21,33,24],[33,25,33,28],[33,29,33,32],[36,9,36,12],[36,13,36,16],[36,21,36,28],[36,29,36,36],[36,40,36,45],[37,9,37,12],[37,13,37,16],[37,21,37,28],[37,29,37,36],[37,40,37,45],[38,9,38,12],[38,13,38,16],[38,21,38,28],[38,29,38,36],[38,40,38,45],[39,9,39,12],[39,13,39,16],[39,21,39,28],[39,29,39,36]]}
["v1.01"]
[]
[null,null,null,null,null,null,null,null,null,"일 Sunday",null,null,null,"월 Monday",null,null,null,"화 Tuesday",null,null,null,"수 Wednesday",null,null,null,"목 Thursday",null,null,null,"금 Friday",null,null,null,"토 Saturday"]
[]
[null,null,null,null,null,null,null,null,null,null,{"$f":"IFERROR(IF(AND(J5<>\"\",VLOOKUP(J5,_공휴일날짜,3,FALSE)<>\"\"),VLOOKUP(J5,_공휴일날짜,3,FALSE),\"\"),\"\")","v":""},null,null,null,{"$f":"IFERROR(IF(AND(N5<>\"\",VLOOKUP(N5,_공휴일날짜,3,FALSE)<>\"\"),VLOOKUP(N5,_공휴일날짜,3,FALSE),\"\"),\"\")","v":""},null,null,null,{"$f":"IFERROR(IF(AND(R5<>\"\",VLOOKUP(R5,_공휴일날짜,3,FALSE)<>\"\"),VLOOKUP(R5,_공휴일날짜,3,FALSE),\"\"),\"\")","v":""},null,null,null,{"$f":"IFERROR(IF(AND(V5<>\"\",VLOOKUP(V5,_공휴일날짜,3,FALSE)<>\"\"),VLOOKUP(V5,_공휴일날짜,3,FALSE),\"\"),\"\")","v":""},null,null,null,{"$f":"IFERROR(IF(AND(Z5<>\"\",VLOOKUP(Z5,_공휴일날짜,3,FALSE)<>\"\"),VLOOKUP(Z5,_공휴일날짜,3,FALSE),\"\"),\"\")","v":""},null,null,null,{"$f":"IFERROR(IF(AND(AD5<>\"\",VLOOKUP(AD5,_공휴일날짜,3,FALSE)<>\"\"),VLOOKUP(AD5,_공휴일날짜,3,FALSE),\"\"),\"\")","v":""},null,null,"2025-03-01",{"$f":"IFERROR(IF(AND(AH5<>\"\",VLOOKUP(AH5,_공휴일날짜,3,FALSE)<>\"\"),VLOOKUP(AH5,_공휴일날짜,3,FALSE),\"\"),\"\")","v":"삼일절"},null,null,null,null,null,false]
[null,null,null,{"$f":"'달력 설정'!B6","v":2025},3,{"$f":"VLOOKUP($E$6,_월별표기,2)","v":"March"},null,null,null,null,null,null,null,null,null,null,null,null,null,null,null,null,null,null,null,null,null,null,null,null,null,null,null,null,null,null,null,null,null,null,false]
[null,null,null,null,null,null,null,null,null,null,null,null,null,null,null,null,null,null,null,null,null,null,null,null,null,null,null,null,null,null,null,null,null,null,null,null,null,null,null,null,false]
[null,1,null,null,null,null,null,null,null,null,null,null,null,null,null,null,null,null,null,null,null,null,null,null,null,null,null,null,null,null,null,null,null,null,null,null,null,null,null,null,false]
[null,null,null,null,null,null,null,null,null,null,null,null,null,null,null,null,null,null,null,null,null,null,null,null,null,null,null,null,null,null,null,null,null,null,null,null,null,null,null,null,false]
[null,null,null,null,null,null,null,null,null,null,null,null,null,null,null,null,null,null,null,null,null,null,null,null,null,null,null,null,null,null,null,null,null,null,null,null,null,null,null,null,false]
[null,null,null,null,null,null,null,null,null,"2025-03-02",{"$f":"IFERROR(IF(AND(J11<>\"\",VLOOKUP(J11,_공휴일날짜,3,FALSE)<>\"\"),VLOOKUP(J11,_공휴일날짜,3,FALSE),\"\"),\"\")","v":""},null,null,"2025-03-03",{"$f":"IFERROR(IF(AND(N11<>\"\",VLOOKUP(N11,_공휴일날짜,3,FALSE)<>\"\"),VLOOKUP(N11,_공휴일날짜,3,FALSE),\"\"),\"\")","v":"대체 휴일"},null,null,"2025-03-04",{"$f":"IFERROR(IF(AND(R11<>\"\",VLOOKUP(R11,_공휴일날짜,3,FALSE)<>\"\"),VLOOKUP(R11,_공휴일날짜,3,FALSE),\"\"),\"\")","v":""},null,null,"2025-03-05",{"$f":"IFERROR(IF(AND(V11<>\"\",VLOOKUP(V11,_공휴일날짜,3,FALSE)<>\"\"),VLOOKUP(V11,_공휴일날짜,3,FALSE),\"\"),\"\")","v":""},null,null,"2025-03-06",{"$f":"IFERROR(IF(AND(Z11<>\"\",VLOOKUP(Z11,_공휴일날짜,3,FALSE)<>\"\"),VLOOKUP(Z11,_공휴일날짜,3,FALSE),\"\"),\"\")","v":""},null,null,"2025-03-07",{"$f":"IFERROR(IF(AND(AD11<>\"\",VLOOKUP(AD11,_공휴일날짜,3,FALSE)<>\"\"),VLOOKUP(AD11,_공휴일날짜,3,FALSE),\"\"),\"\")","v":""},null,null,"2025-03-08",{"$f":"IFERROR(IF(AND(AH11<>\"\",VLOOKUP(AH11,_공휴일날짜,3,FALSE)<>\"\"),VLOOKUP(AH11,_공휴일날짜,3,FALSE),\"\"),\"\")","v":""},null,null,null,null,null,false]
[null,null,null,null,null,null,null,null,null,null,null,null,null,null,null,null,null,null,null,null,null,null,null,null,null,null,null,null,null,null,null,null,null,null,null,null,null,null,null,null,false]
[null,null,null,null,null,null,null,null,null,null,null,null,null,null,null,null,null,null,null,null,null,null,null,null,null,null,null,null,null,null,null,null,null,null,null,null,null,null,null,null,false]
[null,null,null,null,null,null,null,null,null,null,null,null,null,null,null,null,null,null,null,null,null,null,null,null,null,null,null,null,null,null,null,null,null,null,null,null,null,null,null,null,false]
[null,null,null,null,null,null,null,null,null,null,null,null,null,null,null,null,null,null,null,null,null,null,null,null,null,null,null,null,null,null,null,null,null,null,null,null,null,null,null,null,false]
[null,null,null,{"$f":"YEAR(TODAY())","v":2025},{"$f":"MONTH(TODAY())","v":2},{"$f":"DAY(TODAY())","v":24},null,null,null,null,null,null,null,null,null,null,null,null,null,null,null,null,null,null,null,null,null,null,null,null,null,null,null,null,null,null,null,null,null,null,false]
[null,null,null,null,null,null,null,null,null,"2025-03-09",{"$f":"IFERROR(IF(AND(J17<>\"\",VLOOKUP(J17,_공휴일날짜,3,FALSE)<>\"\"),VLOOKUP(J17,_공휴일날짜,3,FALSE),\"\"),\"\")","v":""},null,null,"2025-03-10",{"$f":"IFERROR(IF(AND(N17<>\"\",VLOOKUP(N17,_공휴일날짜,3,FALSE)<>\"\"),VLOOKUP(N17,_공휴일날짜,3,FALSE),\"\"),\"\")","v":""},null,null,"2025-03-11",{"$f":"IFERROR(IF(AND(R17<>\"\",VLOOKUP(R17,_공휴일날짜,3,FALSE)<>\"\"),VLOOKUP(R17,_공휴일날짜,3,FALSE),\"\"),\"\")","v":""},null,null,"2025-03-12",{"$f":"IFERROR(IF(AND(V17<>\"\",VLOOKUP(V17,_공휴일날짜,3,FALSE)<>\"\"),VLOOKUP(V17,_공휴일날짜,3,FALSE),\"\"),\"\")","v":""},null,null,"2025-03-13",{"$f":"IFERROR(IF(AND(Z17<>\"\",VLOOKUP(Z17,_공휴일날짜,3,FALSE)<>\"\"),VLOOKUP(Z17,_공휴일날짜,3,FALSE),\"\"),\"\")","v":""},null,null,"2025-03-14",{"$f":"IFERROR(IF(AND(AD17<>\"\",VLOOKUP(AD17,_공휴일날짜,3,FALSE)<>\"\"),VLOOKUP(AD17,_공휴일날짜,3,FALSE),\"\"),\"\")","v":""},null,null,"2025-03-15",{"$f":"IFERROR(IF(AND(AH17<>\"\",VLOOKUP(AH17,_공휴일날짜,3,FALSE)<>\"\"),VLOOKUP(AH17,_공휴일날짜,3,FALSE),\"\"),\"\")","v":""}]
[]
[]
[null,{"$f":"VLOOKUP($E$20,_월별표기,2)","v":"February"},null,null,2]
[null,"일","월","화","수","목","금","토"]
[null,null,null,null,null,null,null,"2025-02-01"]
[null,"2025-02-02","2025-02-03","2025-02-04","2025-02-05","2025-02-06","2025-02-07","2025-02-08",null,"2025-03-16",{"$f":"IFERROR(IF(AND(J23<>\"\",VLOOKUP(J23,_공휴일날짜,3,FALSE)<>\"\"),VLOOKUP(J23,_공휴일날짜,3,FALSE),\"\"),\"\")","v":""},null,null,"2025-03-17",{"$f":"IFERROR(IF(AND(N23<>\"\",VLOOKUP(N23,_공휴일날짜,3,FALSE)<>\"\"),VLOOKUP(N23,_공휴일날짜,3,FALSE),\"\"),\"\")","v":""},null,null,"2025-03-18",{"$f":"IFERROR(IF(AND(R23<>\"\",VLOOKUP(R23,_공휴일날짜,3,FALSE)<>\"\"),VLOOKUP(R23,_공휴일날짜,3,FALSE),\"\"),\"\")","v":""},null,null,"2025-03-19",{"$f":"IFERROR(IF(AND(V23<>\"\",VLOOKUP(V23,_공휴일날짜,3,FALSE)<>\"\"),VLOOKUP(V23,_공휴일날짜,3,FALSE),\"\"),\"\")","v":""},null,null,"2025-03-20",{"$f":"IFERROR(IF(AND(Z23<>\"\",VLOOKUP(Z23,_공휴일날짜,3,FALSE)<>\"\"),VLOOKUP(Z23,_공휴일날짜,3,FALSE),\"\"),\"\")","v":""},null,null,"2025-03-21",{"$f":"IFERROR(IF(AND(AD23<>\"\",VLOOKUP(AD23,_공휴일날짜,3,FALSE)<>\"\"),VLOOKUP(AD23,_공휴일날짜,3,FALSE),\"\"),\"\")","v":""},null,null,"2025-03-22",{"$f":"IFERROR(IF(AND(AH23<>\"\",VLOOKUP(AH23,_공휴일날짜,3,FALSE)<>\"\"),VLOOKUP(AH23,_공휴일날짜,3,FALSE),\"\"),\"\")","v":""}]
[null,"2025-02-09","2025-02-10","2025-02-11","2025-02-12","2025-02-13","2025-02-14","2025-02-15"]
[null,"2025-02-16","2025-02-17","2025-02-18","2025-02-19","2025-02-20","2025-02-21","2025-02-22"]
[null,"2025-02-23","2025-02-24","2025-02-25","2025-02-26","2025-02-27","2025-02-28"]
[]
[]
[null,null,null,null,null,null,null,null,null,"2025-03-23",{"$f":"IFERROR(IF(AND(J29<>\"\",VLOOKUP(J29,_공휴일날짜,3,FALSE)<>\"\"),VLOOKUP(J29,_공휴일날짜,3,FALSE),\"\"),\"\")","v":""},null,null,"2025-03-24",{"$f":"IFERROR(IF(AND(N29<>\"\",VLOOKUP(N29,_공휴일날짜,3,FALSE)<>\"\"),VLOOKUP(N29,_공휴일날짜,3,FALSE),\"\"),\"\")","v":""},null,null,"2025-03-25",{"$f":"IFERROR(IF(AND(R29<>\"\",VLOOKUP(R29,_공휴일날짜,3,FALSE)<>\"\"),VLOOKUP(R29,_공휴일날짜,3,FALSE),\"\"),\"\")","v":""},null,null,"2025-03-26",{"$f":"IFERROR(IF(AND(V29<>\"\",VLOOKUP(V29,_공휴일날짜,3,FALSE)<>\"\"),VLOOKUP(V29,_공휴일날짜,3,FALSE),\"\"),\"\")","v":""},null,null,"2025-03-27",{"$f":"IFERROR(IF(AND(Z29<>\"\",VLOOKUP(Z29,_공휴일날짜,3,FALSE)<>\"\"),VLOOKUP(Z29,_공휴일날짜,3,FALSE),\"\"),\"\")","v":""},null,null,"2025-03-28",{"$f":"IFERROR(IF(AND(AD29<>\"\",VLOOKUP(AD29,_공휴일날짜,3,FALSE)<>\"\"),VLOOKUP(AD29,_공휴일날짜,3,FALSE),\"\"),\"\")","v":""},null,null,"2025-03-29",{"$f":"IFERROR(IF(AND(AH29<>\"\",VLOOKUP(AH29,_공휴일날짜,3,FALSE)<>\"\"),VLOOKUP(AH29,_공휴일날짜,3,FALSE),\"\"),\"\")","v":""}]
[null,{"$f":"VLOOKUP($E$30,_월별표기,2)","v":"April"},null,null,4]
[null,"일","월","화","수","목","금","토"]
[null,null,null,"2025-04-01","2025-04-02","2025-04-03","2025-04-04","2025-04-05"]
[null,"2025-04-06","2025-04-07","2025-04-08","2025-04-09","2025-04-10","2025-04-11","2025-04-12"]
[null,"2025-04-13","2025-04-14","2025-04-15","2025-04-16","2025-04-17","2025-04-18","2025-04-19"]
[null,"2025-04-20","2025-04-21","2025-04-22","2025-04-23","2025-04-24","2025-04-25","2025-04-26",null,"2025-03-30",{"$f":"IFERROR(IF(AND(J35<>\"\",VLOOKUP(J35,_공휴일날짜,3,FALSE)<>\"\"),VLOOKUP(J35,_공휴일날짜,3,FALSE),\"\"),\"\")","v":""},null,null,"2025-03-31",{"$f":"IFERROR(IF(AND(N35<>\"\",VLOOKUP(N35,_공휴일날짜,3,FALSE)<>\"\"),VLOOKUP(N35,_공휴일날짜,3,FALSE),\"\"),\"\")","v":""}]
[null,"2025-04-27","2025-04-28","2025-04-29","2025-04-30"]

{"sheet":"4월","index":3,"n_rows":36,"n_cols":41,"rows_kept":36,"cut":false,"hidden":false,"merged":[[5,41,5,45],[2,33,3,36],[4,9,5,9],[4,10,4,12],[4,13,5,13],[4,14,4,16],[4,17,5,17],[4,18,4,20],[4,21,5,21],[4,22,4,24],[4,25,5,25],[2,9,3,12],[2,13,3,16],[2,17,3,20],[2,21,3,24],[2,25,3,28],[2,29,3,32],[5,10,5,12],[5,14,5,16],[5,18,5,20],[5,22,5,24],[5,26,5,28],[5,30,5,32],[4,26,4,28],[4,29,5,29],[4,30,4,32],[6,33,6,36],[6,41,6,45],[7,9,7,12],[7,13,7,16],[7,17,7,20],[7,21,7,24],[7,25,7,28],[7,29,7,32],[7,33,7,36],[7,41,7,45],[6,9,6,12],[6,13,6,16],[6,17,6,20],[6,21,6,24],[6,25,6,28],[6,29,6,32],[4,33,5,33],[4,34,4,36],[4,41,4,45],[5,34,5,36],[10,9,11,9],[10,10,10,12],[10,13,11,13],[10,14,10,16],[10,17,11,17],[10,18,10,20],[8,33,8,36],[8,41,8,45],[9,9,9,12],[9,13,9,16],[9,17,9,20],[9,21,9,24],[9,25,9,28],[9,29,9,32],[9,33,9,36],[9,41,9,45],[8,9,8,12],[8,13,8,16],[8,17,8,20],[8,21,8,24],[8,25,8,28],[8,29,8,32],[11,41,11,45],[12,9,12,12],[12,13,12,16],[12,17,12,20],[12,21,12,24],[12,25,12,28],[12,29,12,32],[12,33,12,36],[12,41,12,45],[10,33,11,33],[10,34,10,36],[10,41,10,45],[11,10,11,12],[11,14,11,16],[11,18,11,20],[11,22,11,24],[11,26,11,28],[11,30,11,32],[11,34,11,36],[10,21,11,21],[10,22,10,24],[10,25,11,25],[10,26,10,28],[10,29,11,29],[10,30,10,32],[13,33,13,36],[13,41,13,45],[14,9,14,12],[14,13,14,16],[14,17,14,20],[14,21,14,24],[14,25,14,28],[14,29,14,32],[14,33,14,36],[14,41,14,45],[13,9,13,12],[13,13,13,16],[13,17,13,20],[13,21,13,24],[13,25,13,28],[13,29,13,32],[15,41,15,45],[16,9,17,9],[16,10,16,12],[16,13,17,13],[16,14,16,16],[16,17,17,17],[16,18,16,20],[16,21,17,21],[16,22,16,24],[15,9,15,12],[15,13,15,16],[15,17,15,20],[15,21,15,24],[15,25,15,28],[15,29,15,32],[16,41,16,45],[17,30,17,32],[17,34,17,36],[16,25,17,25],[16,26,16,28],[16,29,17,29],[16,30,16,32],[16,33,17,33],[16,34,16,36],[15,33,15,36],[19,1,19,3],[19,9,19,12],[19,13,19,16],[19,17,19,20],[19,21,19,24],[19,25,19,28],[17,40,17,45],[18,9,18,12],[18,13,18,16],[18,17,18,20],[18,21,18,24],[18,25,18,28],[18,29,18,32],[18,33,18,36],[19,29,19,32],[19,33,19,36],[19,40,19,45],[17,1,17,2],[17,4,17,7],[17,10,17,12],[17,14,17,16],[17,18,17,20],[17,22,17,24],[17,26,17,28],[20,9,20,12],[20,13,20,16],[20,17,20,20],[20,21,20,24],[20,25,20,28],[20,29,20,32],[20,33,20,36],[20,40,20,41],[20,42,20,45],[21,9,21,12],[21,13,21,16],[21,17,21,20],[21,21,21,24],[21,25,21,28],[21,29,21,32],[21,33,21,36],[21,40,21,41],[21,42,21,45],[22,9,23,9],[22,10,22,12],[22,13,23,13],[22,14,22,16],[22,17,23,17],[22,18,22,20],[22,21,23,21],[22,22,22,24],[22,25,23,25],[22,42,22,45],[23,10,23,12],[23,14,23,16],[23,18,23,20],[23,22,23,24],[23,26,23,28],[23,30,23,32],[23,34,23,36],[23,40,23,41],[23,42,23,45],[22,26,22,28],[22,29,23,29],[22,30,22,32],[22,33,23,33],[22,34,22,36],[22,40,22,41],[24,33,24,36],[24,40,24,41],[24,42,24,45],[25,9,25,12],[25,13,25,16],[25,17,25,20],[25,21,25,24],[25,25,25,28],[25,29,25,32],[25,33,25,36],[24,9,24,12],[24,13,24,16],[24,17,24,20],[24,21,24,24],[24,25,24,28],[24,29,24,32],[25,40,25,41],[25,42,25,45],[26,9,26,12],[26,13,26,16],[26,17,26,20],[26,21,26,24],[26,25,26,28],[26,29,26,32],[26,33,26,36],[26,40,26,41],[26,42,26,45],[27,9,27,12],[27,13,27,16],[27,17,27,20],[27,21,27,24],[27,25,27,28],[27,29,27,32],[27,33,27,36],[27,40,27,45],[29,1,29,3],[29,10,29,12],[29,14,29,16],[29,18,29,20],[29,22,29,24],[29,26,29,28],[29,30,29,32],[28,21,29,21],[28,22,28,24],[28,25,29,25],[28,26,28,28],[28,29,29,29],[28,30,28,32],[28,9,29,9],[28,10,28,12],[28,13,29,13],[28,14,28,16],[28,17,29,17],[28,18,28,20],[29,34,29,36],[29,40,29,45],[30,9,30,12],[30,13,30,16],[30,17,30,20],[30,21,30,24],[30,25,30,28],[30,29,30,32],[30,33,30,36],[30,40,30,45],[28,33,29,33],[28,34,28,36],[28,40,28,45],[31,33,31,36],[31,40,31,45],[32,9,32,12],[32,13,32,16],[32,17,32,20],[32,21,32,24],[32,25,32,28],[32,29,32,32],[32,33,32,36],[32,40,32,45],[31,9,31,12],[31,13,31,16],[31,17,31,20],[31,21,31,24],[31,25,31,28],[31,29,31,32],[33,33,33,36],[33,40,33,45],[34,9,35,9],[34,10,34,12],[34,13,35,13],[34,14,34,16],[34,40,34,45],[35,10,35,12],[35,14,35,16],[35,40,35,45],[33,9,33,12],[33,13,33,16],[33,17,33,20],[33,21,33,24],[33,25,33,28],[33,29,33,32],[36,9,36,12],[36,13,36,16],[36,21,36,28],[36,29,36,36],[36,40,36,45],[37,9,37,12],[37,13,37,16],[37,21,37,28],[37,29,37,36],[37,40,37,45],[38,9,38,12],[38,13,38,16],[38,21,38,28],[38,29,38,36],[38,40,38,45],[39,9,39,12],[39,13,39,16],[39,21,39,28],[39,29,39,36]]}
["v1.01"]
[]
[null,null,null,null,null,null,null,null,null,"일 Sunday",null,null,null,"월 Monday",null,null,null,"화 Tuesday",null,null,null,"수 Wednesday",null,null,null,"목 Thursday",null,null,null,"금 Friday",null,null,null,"토 Saturday"]
[]
[null,null,null,null,null,null,null,null,null,null,{"$f":"IFERROR(IF(AND(J5<>\"\",VLOOKUP(J5,_공휴일날짜,3,FALSE)<>\"\"),VLOOKUP(J5,_공휴일날짜,3,FALSE),\"\"),\"\")","v":""},null,null,null,{"$f":"IFERROR(IF(AND(N5<>\"\",VLOOKUP(N5,_공휴일날짜,3,FALSE)<>\"\"),VLOOKUP(N5,_공휴일날짜,3,FALSE),\"\"),\"\")","v":""},null,null,"2025-04-01",{"$f":"IFERROR(IF(AND(R5<>\"\",VLOOKUP(R5,_공휴일날짜,3,FALSE)<>\"\"),VLOOKUP(R5,_공휴일날짜,3,FALSE),\"\"),\"\")","v":""},null,null,"2025-04-02",{"$f":"IFERROR(IF(AND(V5<>\"\",VLOOKUP(V5,_공휴일날짜,3,FALSE)<>\"\"),VLOOKUP(V5,_공휴일날짜,3,FALSE),\"\"),\"\")","v":""},null,null,"2025-04-03",{"$f":"IFERROR(IF(AND(Z5<>\"\",VLOOKUP(Z5,_공휴일날짜,3,FALSE)<>\"\"),VLOOKUP(Z5,_공휴일날짜,3,FALSE),\"\"),\"\")","v":""},null,null,"2025-04-04",{"$f":"IFERROR(IF(AND(AD5<>\"\",VLOOKUP(AD5,_공휴일날짜,3,FALSE)<>\"\"),VLOOKUP(AD5,_공휴일날짜,3,FALSE),\"\"),\"\")","v":""},null,null,"2025-04-05",{"$f":"IFERROR(IF(AND(AH5<>\"\",VLOOKUP(AH5,_공휴일날짜,3,FALSE)<>\"\"),VLOOKUP(AH5,_공휴일날짜,3,FALSE),\"\"),\"\")","v":""},null,null,null,null,null,false]
[null,null,null,{"$f":"'달력 설정'!B6","v":2025},4,{"$f":"VLOOKUP($E$6,_월별표기,2)","v":"April"},null,null,null,null,null,null,null,null,null,null,null,null,null,null,null,null,null,null,null,null,null,null,null,null,null,null,null,null,null,null,null,null,null,null,false]
[null,null,null,null,null,null,null,null,null,null,null,null,null,null,null,null,null,null,null,null,null,null,null,null,null,null,null,null,null,null,null,null,null,null,null,null,null,null,null,null,false]
[null,1,null,null,null,null,null,null,null,null,null,null,null,null,null,null,null,null,null,null,null,null,null,null,null,null,null,null,null,null,null,null,null,null,null,null,null,null,null,null,false]
[null,null,null,null,null,null,null,null,null,null,null,null,null,null,null,null,null,null,null,null,null,null,null,null,null,null,null,null,null,null,null,null,null,null,null,null,null,null,null,null,false]
[null,null,null,null,null,null,null,null,null,null,null,null,null,null,null,null,null,null,null,null,null,null,null,null,null,null,null,null,null,null,null,null,null,null,null,null,null,null,null,null,false]
[null,null,null,null,null,null,null,null,null,"2025-04-06",{"$f":"IFERROR(IF(AND(J11<>\"\",VLOOKUP(J11,_공휴일날짜,3,FALSE)<>\"\"),VLOOKUP(J11,_공휴일날짜,3,FALSE),\"\"),\"\")","v":""},null,null,"2025-04-07",{"$f":"IFERROR(IF(AND(N11<>\"\",VLOOKUP(N11,_공휴일날짜,3,FALSE)<>\"\"),VLOOKUP(N11,_공휴일날짜,3,FALSE),\"\"),\"\")","v":""},null,null,"2025-04-08",{"$f":"IFERROR(IF(AND(R11<>\"\",VLOOKUP(R11,_공휴일날짜,3,FALSE)<>\"\"),VLOOKUP(R11,_공휴일날짜,3,FALSE),\"\"),\"\")","v":""},null,null,"2025-04-09",{"$f":"IFERROR(IF(AND(V11<>\"\",VLOOKUP(V11,_공휴일날짜,3,FALSE)<>\"\"),VLOOKUP(V11,_공휴일날짜,3,FALSE),\"\"),\"\")","v":""},null,null,"2025-04-10",{"$f":"IFERROR(IF(AND(Z11<>\"\",VLOOKUP(Z11,_공휴일날짜,3,FALSE)<>\"\"),VLOOKUP(Z11,_공휴일날짜,3,FALSE),\"\"),\"\")","v":""},null,null,"2025-04-11",{"$f":"IFERROR(IF(AND(AD11<>\"\",VLOOKUP(AD11,_공휴일날짜,3,FALSE)<>\"\"),VLOOKUP(AD11,_공휴일날짜,3,FALSE),\"\"),\"\")","v":""},null,null,"2025-04-12",{"$f":"IFERROR(IF(AND(AH11<>\"\",VLOOKUP(AH11,_공휴일날짜,3,FALSE)<>\"\"),VLOOKUP(AH11,_공휴일날짜,3,FALSE),\"\"),\"\")","v":""},null,null,null,null,null,false]
[null,null,null,null,null,null,null,null,null,null,null,null,null,null,null,null,null,null,null,null,null,null,null,null,null,null,null,null,null,null,null,null,null,null,null,null,null,null,null,null,false]
[null,null,null,null,null,null,null,null,null,null,null,null,null,null,null,null,null,null,null,null,null,null,null,null,null,null,null,null,null,null,null,null,null,null,null,null,null,null,null,null,false]
[null,null,null,null,null,null,null,null,null,null,null,null,null,null,null,null,null,null,null,null,null,null,null,null,null,null,null,null,null,null,null,null,null,null,null,null,null,null,null,null,false]
[null,null,null,null,null,null,null,null,null,null,null,null,null,null,null,null,null,null,null,null,null,null,null,null,null,null,null,null,null,null,null,null,null,null,null,null,null,null,null,null,false]
[null,null,null,{"$f":"YEAR(TODAY())","v":2025},{"$f":"MONTH(TODAY())","v":2},{"$f":"DAY(TODAY())","v":24},null,null,null,null,null,null,null,null,null,null,null,null,null,null,null,null,null,null,null,null,null,null,null,null,null,null,null,null,null,null,null,null,null,null,false]
[null,null,null,null,null,null,null,null,null,"2025-04-13",{"$f":"IFERROR(IF(AND(J17<>\"\",VLOOKUP(J17,_공휴일날짜,3,FALSE)<>\"\"),VLOOKUP(J17,_공휴일날짜,3,FALSE),\"\"),\"\")","v":""},null,null,"2025-04-14",{"$f":"IFERROR(IF(AND(N17<>\"\",VLOOKUP(N17,_공휴일날짜,3,FALSE)<>\"\"),VLOOKUP(N17,_공휴일날짜,3,FALSE),\"\"),\"\")","v":""},null,null,"2025-04-15",{"$f":"IFERROR(IF(AND(R17<>\"\",VLOOKUP(R17,_공휴일날짜,3,FALSE)<>\"\"),VLOOKUP(R17,_공휴일날짜,3,FALSE),\"\"),\"\")","v":""},null,null,"2025-04-16",{"$f":"IFERROR(IF(AND(V17<>\"\",VLOOKUP(V17,_공휴일날짜,3,FALSE)<>\"\"),VLOOKUP(V17,_공휴일날짜,3,FALSE),\"\"),\"\")","v":""},null,null,"2025-04-17",{"$f":"IFERROR(IF(AND(Z17<>\"\",VLOOKUP(Z17,_공휴일날짜,3,FALSE)<>\"\"),VLOOKUP(Z17,_공휴일날짜,3,FALSE),\"\"),\"\")","v":""},null,null,"2025-04-18",{"$f":"IFERROR(IF(AND(AD17<>\"\",VLOOKUP(AD17,_공휴일날짜,3,FALSE)<>\"\"),VLOOKUP(AD17,_공휴일날짜,3,FALSE),\"\"),\"\")","v":""},null,null,"2025-04-19",{"$f":"IFERROR(IF(AND(AH17<>\"\",VLOOKUP(AH17,_공휴일날짜,3,FALSE)<>\"\"),VLOOKUP(AH17,_공휴일날짜,3,FALSE),\"\"),\"\")","v":""}]
[]
[]
[null,{"$f":"VLOOKUP($E$20,_월별표기,2)","v":"March"},null,null,3]
[null,"일","월","화","수","목","금","토"]
[null,null,null,null,null,null,null,"2025-03-01"]
[null,"2025-03-02","2025-03-03","2025-03-04","2025-03-05","2025-03-06","2025-03-07","2025-03-08",null,"2025-04-20",{"$f":"IFERROR(IF(AND(J23<>\"\",VLOOKUP(J23,_공휴일날짜,3,FALSE)<>\"\"),VLOOKUP(J23,_공휴일날짜,3,FALSE),\"\"),\"\")","v":""},null,null,"2025-04-21",{"$f":"IFERROR(IF(AND(N23<>\"\",VLOOKUP(N23,_공휴일날짜,3,FALSE)<>\"\"),VLOOKUP(N23,_공휴일날짜,3,FALSE),\"\"),\"\")","v":""},null,null,"2025-04-22",{"$f":"IFERROR(IF(AND(R23<>\"\",VLOOKUP(R23,_공휴일날짜,3,FALSE)<>\"\"),VLOOKUP(R23,_공휴일날짜,3,FALSE),\"\"),\"\")","v":""},null,null,"2025-04-23",{"$f":"IFERROR(IF(AND(V23<>\"\",VLOOKUP(V23,_공휴일날짜,3,FALSE)<>\"\"),VLOOKUP(V23,_공휴일날짜,3,FALSE),\"\"),\"\")","v":""},null,null,"2025-04-24",{"$f":"IFERROR(IF(AND(Z23<>\"\",VLOOKUP(Z23,_공휴일날짜,3,FALSE)<>\"\"),VLOOKUP(Z23,_공휴일날짜,3,FALSE),\"\"),\"\")","v":""},null,null,"2025-04-25",{"$f":"IFERROR(IF(AND(AD23<>\"\",VLOOKUP(AD23,_공휴일날짜,3,FALSE)<>\"\"),VLOOKUP(AD23,_공휴일날짜,3,FALSE),\"\"),\"\")","v":""},null,null,"2025-04-26",{"$f":"IFERROR(IF(AND(AH23<>\"\",VLOOKUP(AH23,_공휴일날짜,3,FALSE)<>\"\"),VLOOKUP(AH23,_공휴일날짜,3,FALSE),\"\"),\"\")","v":""}]
[null,"2025-03-09","2025-03-10","2025-03-11","2025-03-12","2025-03-13","2025-03-14","2025-03-15"]
[null,"2025-03-16","2025-03-17","2025-03-18","2025-03-19","2025-03-20","2025-03-21","2025-03-22"]
[null,"2025-03-23","2025-03-24","2025-03-25","2025-03-26","2025-03-27","2025-03-28","2025-03-29"]
[null,"2025-03-30","2025-03-31"]
[]
[null,null,null,null,null,null,null,null,null,"2025-04-27",{"$f":"IFERROR(IF(AND(J29<>\"\",VLOOKUP(J29,_공휴일날짜,3,FALSE)<>\"\"),VLOOKUP(J29,_공휴일날짜,3,FALSE),\"\"),\"\")","v":""},null,null,"2025-04-28",{"$f":"IFERROR(IF(AND(N29<>\"\",VLOOKUP(N29,_공휴일날짜,3,FALSE)<>\"\"),VLOOKUP(N29,_공휴일날짜,3,FALSE),\"\"),\"\")","v":""},null,null,"2025-04-29",{"$f":"IFERROR(IF(AND(R29<>\"\",VLOOKUP(R29,_공휴일날짜,3,FALSE)<>\"\"),VLOOKUP(R29,_공휴일날짜,3,FALSE),\"\"),\"\")","v":""},null,null,"2025-04-30",{"$f":"IFERROR(IF(AND(V29<>\"\",VLOOKUP(V29,_공휴일날짜,3,FALSE)<>\"\"),VLOOKUP(V29,_공휴일날짜,3,FALSE),\"\"),\"\")","v":""},null,null,null,{"$f":"IFERROR(IF(AND(Z29<>\"\",VLOOKUP(Z29,_공휴일날짜,3,FALSE)<>\"\"),VLOOKUP(Z29,_공휴일날짜,3,FALSE),\"\"),\"\")","v":""},null,null,null,{"$f":"IFERROR(IF(AND(AD29<>\"\",VLOOKUP(AD29,_공휴일날짜,3,FALSE)<>\"\"),VLOOKUP(AD29,_공휴일날짜,3,FALSE),\"\"),\"\")","v":""},null,null,null,{"$f":"IFERROR(IF(AND(AH29<>\"\",VLOOKUP(AH29,_공휴일날짜,3,FALSE)<>\"\"),VLOOKUP(AH29,_공휴일날짜,3,FALSE),\"\"),\"\")","v":""}]
[null,{"$f":"VLOOKUP($E$30,_월별표기,2)","v":"May"},null,null,5]
[null,"일","월","화","수","목","금","토"]
[null,null,null,null,null,"2025-05-01","2025-05-02","2025-05-03"]
[null,"2025-05-04","2025-05-05","2025-05-06","2025-05-07","2025-05-08","2025-05-09","2025-05-10"]
[null,"2025-05-11","2025-05-12","2025-05-13","2025-05-14","2025-05-15","2025-05-16","2025-05-17"]
[null,"2025-05-18","2025-05-19","2025-05-20","2025-05-21","2025-05-22","2025-05-23","2025-05-24",null,null,{"$f":"IFERROR(IF(AND(J35<>\"\",VLOOKUP(J35,_공휴일날짜,3,FALSE)<>\"\"),VLOOKUP(J35,_공휴일날짜,3,FALSE),\"\"),\"\")","v":""},null,null,null,{"$f":"IFERROR(IF(AND(N35<>\"\",VLOOKUP(N35,_공휴일날짜,3,FALSE)<>\"\"),VLOOKUP(N35,_공휴일날짜,3,FALSE),\"\"),\"\")","v":""}]
[null,"2025-05-25","2025-05-26","2025-05-27","2025-05-28","2025-05-29","2025-05-30","2025-05-31"]

{"sheet":"5월","index":4,"n_rows":36,"n_cols":41,"rows_kept":36,"cut":false,"hidden":false,"merged":[[5,41,5,45],[2,33,3,36],[4,9,5,9],[4,10,4,12],[4,13,5,13],[4,14,4,16],[4,17,5,17],[4,18,4,20],[4,21,5,21],[4,22,4,24],[4,25,5,25],[2,9,3,12],[2,13,3,16],[2,17,3,20],[2,21,3,24],[2,25,3,28],[2,29,3,32],[5,10,5,12],[5,14,5,16],[5,18,5,20],[5,22,5,24],[5,26,5,28],[5,30,5,32],[4,26,4,28],[4,29,5,29],[4,30,4,32],[6,33,6,36],[6,41,6,45],[7,9,7,12],[7,13,7,16],[7,17,7,20],[7,21,7,24],[7,25,7,28],[7,29,7,32],[7,33,7,36],[7,41,7,45],[6,9,6,12],[6,13,6,16],[6,17,6,20],[6,21,6,24],[6,25,6,28],[6,29,6,32],[4,33,5,33],[4,34,4,36],[4,41,4,45],[5,34,5,36],[10,9,11,9],[10,10,10,12],[10,13,11,13],[10,14,10,16],[10,17,11,17],[10,18,10,20],[8,33,8,36],[8,41,8,45],[9,9,9,12],[9,13,9,16],[9,17,9,20],[9,21,9,24],[9,25,9,28],[9,29,9,32],[9,33,9,36],[9,41,9,45],[8,9,8,12],[8,13,8,16],[8,17,8,20],[8,21,8,24],[8,25,8,28],[8,29,8,32],[11,41,11,45],[12,9,12,12],[12,13,12,16],[12,17,12,20],[12,21,12,24],[12,25,12,28],[12,29,12,32],[12,33,12,36],[12,41,12,45],[10,33,11,33],[10,34,10,36],[10,41,10,45],[11,10,11,12],[11,14,11,16],[11,18,11,20],[11,22,11,24],[11,26,11,28],[11,30,11,32],[11,34,11,36],[10,21,11,21],[10,22,10,24],[10,25,11,25],[10,26,10,28],[10,29,11,29],[10,30,10,32],[13,33,13,36],[13,41,13,45],[14,9,14,12],[14,13,14,16],[14,17,14,20],[14,21,14,24],[14,25,14,28],[14,29,14,32],[14,33,14,36],[14,41,14,45],[13,9,13,12],[13,13,13,16],[13,17,13,20],[13,21,13,24],[13,25,13,28],[13,29,13,32],[15,41,15,45],[16,9,17,9],[16,10,16,12],[16,13,17,13],[16,14,16,16],[16,17,17,17],[16,18,16,20],[16,21,17,21],[16,22,16,24],[15,9,15,12],[15,13,15,16],[15,17,15,20],[15,21,15,24],[15,25,15,28],[15,29,15,32],[16,41,16,45],[17,30,17,32],[17,34,17,36],[16,25,17,25],[16,26,16,28],[16,29,17,29],[16,30,16,32],[16,33,17,33],[16,34,16,36],[15,33,15,36],[19,1,19,3],[19,9,19,12],[19,13,19,16],[19,17,19,20],[19,21,19,24],[19,25,19,28],[17,40,17,45],[18,9,18,12],[18,13,18,16],[18,17,18,20],[18,21,18,24],[18,25,18,28],[18,29,18,32],[18,33,18,36],[19,29,19,32],[19,33,19,36],[19,40,19,45],[17,1,17,2],[17,4,17,7],[17,10,17,12],[17,14,17,16],[17,18,17,20],[17,22,17,24],[17,26,17,28],[20,9,20,12],[20,13,20,16],[20,17,20,20],[20,21,20,24],[20,25,20,28],[20,29,20,32],[20,33,20,36],[20,40,20,41],[20,42,20,45],[21,9,21,12],[21,13,21,16],[21,17,21,20],[21,21,21,24],[21,25,21,28],[21,29,21,32],[21,33,21,36],[21,40,21,41],[21,42,21,45],[22,9,23,9],[22,10,22,12],[22,13,23,13],[22,14,22,16],[22,17,23,17],[22,18,22,20],[22,21,23,21],[22,22,22,24],[22,25,23,25],[22,42,22,45],[23,10,23,12],[23,14,23,16],[23,18,23,20],[23,22,23,24],[23,26,23,28],[23,30,23,32],[23,34,23,36],[23,40,23,41],[23,42,23,45],[22,26,22,28],[22,29,23,29],[22,30,22,32],[22,33,23,33],[22,34,22,36],[22,40,22,41],[24,33,24,36],[24,40,24,41],[24,42,24,45],[25,9,25,12],[25,13,25,16],[25,17,25,20],[25,21,25,24],[25,25,25,28],[25,29,25,32],[25,33,25,36],[24,9,24,12],[24,13,24,16],[24,17,24,20],[24,21,24,24],[24,25,24,28],[24,29,24,32],[25,40,25,41],[25,42,25,45],[26,9,26,12],[26,13,26,16],[26,17,26,20],[26,21,26,24],[26,25,26,28],[26,29,26,32],[26,33,26,36],[26,40,26,41],[26,42,26,45],[27,9,27,12],[27,13,27,16],[27,17,27,20],[27,21,27,24],[27,25,27,28],[27,29,27,32],[27,33,27,36],[27,40,27,45],[29,1,29,3],[29,10,29,12],[29,14,29,16],[29,18,29,20],[29,22,29,24],[29,26,29,28],[29,30,29,32],[28,21,29,21],[28,22,28,24],[28,25,29,25],[28,26,28,28],[28,29,29,29],[28,30,28,32],[28,9,29,9],[28,10,28,12],[28,13,29,13],[28,14,28,16],[28,17,29,17],[28,18,28,20],[29,34,29,36],[29,40,29,45],[30,9,30,12],[30,13,30,16],[30,17,30,20],[30,21,30,24],[30,25,30,28],[30,29,30,32],[30,33,30,36],[30,40,30,45],[28,33,29,33],[28,34,28,36],[28,40,28,45],[31,33,31,36],[31,40,31,45],[32,9,32,12],[32,13,32,16],[32,17,32,20],[32,21,32,24],[32,25,32,28],[32,29,32,32],[32,33,32,36],[32,40,32,45],[31,9,31,12],[31,13,31,16],[31,17,31,20],[31,21,31,24],[31,25,31,28],[31,29,31,32],[33,33,33,36],[33,40,33,45],[34,9,35,9],[34,10,34,12],[34,13,35,13],[34,14,34,16],[34,40,34,45],[35,10,35,12],[35,14,35,16],[35,40,35,45],[33,9,33,12],[33,13,33,16],[33,17,33,20],[33,21,33,24],[33,25,33,28],[33,29,33,32],[36,9,36,12],[36,13,36,16],[36,21,36,28],[36,29,36,36],[36,40,36,45],[37,9,37,12],[37,13,37,16],[37,21,37,28],[37,29,37,36],[37,40,37,45],[38,9,38,12],[38,13,38,16],[38,21,38,28],[38,29,38,36],[38,40,38,45],[39,9,39,12],[39,13,39,16],[39,21,39,28],[39,29,39,36]]}
["v1.01"]
[]
[null,null,null,null,null,null,null,null,null,"일 Sunday",null,null,null,"월 Monday",null,null,null,"화 Tuesday",null,null,null,"수 Wednesday",null,null,null,"목 Thursday",null,null,null,"금 Friday",null,null,null,"토 Saturday"]
[]
[null,null,null,null,null,null,null,null,null,null,{"$f":"IFERROR(IF(AND(J5<>\"\",VLOOKUP(J5,_공휴일날짜,3,FALSE)<>\"\"),VLOOKUP(J5,_공휴일날짜,3,FALSE),\"\"),\"\")","v":""},null,null,null,{"$f":"IFERROR(IF(AND(N5<>\"\",VLOOKUP(N5,_공휴일날짜,3,FALSE)<>\"\"),VLOOKUP(N5,_공휴일날짜,3,FALSE),\"\"),\"\")","v":""},null,null,null,{"$f":"IFERROR(IF(AND(R5<>\"\",VLOOKUP(R5,_공휴일날짜,3,FALSE)<>\"\"),VLOOKUP(R5,_공휴일날짜,3,FALSE),\"\"),\"\")","v":""},null,null,null,{"$f":"IFERROR(IF(AND(V5<>\"\",VLOOKUP(V5,_공휴일날짜,3,FALSE)<>\"\"),VLOOKUP(V5,_공휴일날짜,3,FALSE),\"\"),\"\")","v":""},null,null,"2025-05-01",{"$f":"IFERROR(IF(AND(Z5<>\"\",VLOOKUP(Z5,_공휴일날짜,3,FALSE)<>\"\"),VLOOKUP(Z5,_공휴일날짜,3,FALSE),\"\"),\"\")","v":""},null,null,"2025-05-02",{"$f":"IFERROR(IF(AND(AD5<>\"\",VLOOKUP(AD5,_공휴일날짜,3,FALSE)<>\"\"),VLOOKUP(AD5,_공휴일날짜,3,FALSE),\"\"),\"\")","v":""},null,null,"2025-05-03",{"$f":"IFERROR(IF(AND(AH5<>\"\",VLOOKUP(AH5,_공휴일날짜,3,FALSE)<>\"\"),VLOOKUP(AH5,_공휴일날짜,3,FALSE),\"\"),\"\")","v":""},null,null,null,null,null,false]
[null,null,null,{"$f":"'달력 설정'!B6","v":2025},5,{"$f":"VLOOKUP($E$6,_월별표기,2)","v":"May"},null,null,null,null,null,null,null,null,null,null,null,null,null,null,null,null,null,null,null,null,null,null,null,null,null,null,null,null,null,null,null,null,null,null,false]
[null,null,null,null,null,null,null,null,null,null,null,null,null,null,null,null,null,null,null,null,null,null,null,null,null,null,null,null,null,null,null,null,null,null,null,null,null,null,null,null,false]
[null,1,null,null,null,null,null,null,null,null,null,null,null,null,null,null,null,null,null,null,null,null,null,null,null,null,null,null,null,null,null,null,null,null,null,null,null,null,null,null,false]
[null,null,null,null,null,null,null,null,null,null,null,null,null,null,null,null,null,null,null,null,null,null,null,null,null,null,null,null,null,null,null,null,null,null,null,null,null,null,null,null,false]
[null,null,null,null,null,null,null,null,null,null,null,null,null,null,null,null,null,null,null,null,null,null,null,null,null,null,null,null,null,null,null,null,null,null,null,null,null,null,null,null,false]
[null,null,null,null,null,null,null,null,null,"2025-05-04",{"$f":"IFERROR(IF(AND(J11<>\"\",VLOOKUP(J11,_공휴일날짜,3,FALSE)<>\"\"),VLOOKUP(J11,_공휴일날짜,3,FALSE),\"\"),\"\")","v":""},null,null,"2025-05-05",{"$f":"IFERROR(IF(AND(N11<>\"\",VLOOKUP(N11,_공휴일날짜,3,FALSE)<>\"\"),VLOOKUP(N11,_공휴일날짜,3,FALSE),\"\"),\"\")","v":"석가탄신일,어린이날"},null,null,"2025-05-06",{"$f":"IFERROR(IF(AND(R11<>\"\",VLOOKUP(R11,_공휴일날짜,3,FALSE)<>\"\"),VLOOKUP(R11,_공휴일날짜,3,FALSE),\"\"),\"\")","v":"대체 휴일"},null,null,"2025-05-07",{"$f":"IFERROR(IF(AND(V11<>\"\",VLOOKUP(V11,_공휴일날짜,3,FALSE)<>\"\"),VLOOKUP(V11,_공휴일날짜,3,FALSE),\"\"),\"\")","v":""},null,null,"2025-05-08",{"$f":"IFERROR(IF(AND(Z11<>\"\",VLOOKUP(Z11,_공휴일날짜,3,FALSE)<>\"\"),VLOOKUP(Z11,_공휴일날짜,3,FALSE),\"\"),\"\")","v":""},null,null,"2025-05-09",{"$f":"IFERROR(IF(AND(AD11<>\"\",VLOOKUP(AD11,_공휴일날짜,3,FALSE)<>\"\"),VLOOKUP(AD11,_공휴일날짜,3,FALSE),\"\"),\"\")","v":""},null,null,"2025-05-10",{"$f":"IFERROR(IF(AND(AH11<>\"\",VLOOKUP(AH11,_공휴일날짜,3,FALSE)<>\"\"),VLOOKUP(AH11,_공휴일날짜,3,FALSE),\"\"),\"\")","v":""},null,null,null,null,null,false]
[null,null,null,null,null,null,null,null,null,null,null,null,null,null,null,null,null,null,null,null,null,null,null,null,null,null,null,null,null,null,null,null,null,null,null,null,null,null,null,null,false]
[null,null,null,null,null,null,null,null,null,null,null,null,null,null,null,null,null,null,null,null,null,null,null,null,null,null,null,null,null,null,null,null,null,null,null,null,null,null,null,null,false]
[null,null,null,null,null,null,null,null,null,null,null,null,null,null,null,null,null,null,null,null,null,null,null,null,null,null,null,null,null,null,null,null,null,null,null,null,null,null,null,null,false]
[null,null,null,null,null,null,null,null,null,null,null,null,null,null,null,null,null,null,null,null,null,null,null,null,null,null,null,null,null,null,null,null,null,null,null,null,null,null,null,null,false]
[null,null,null,{"$f":"YEAR(TODAY())","v":2025},{"$f":"MONTH(TODAY())","v":2},{"$f":"DAY(TODAY())","v":24},null,null,null,null,null,null,null,null,null,null,null,null,null,null,null,null,null,null,null,null,null,null,null,null,null,null,null,null,null,null,null,null,null,null,false]
[null,null,null,null,null,null,null,null,null,"2025-05-11",{"$f":"IFERROR(IF(AND(J17<>\"\",VLOOKUP(J17,_공휴일날짜,3,FALSE)<>\"\"),VLOOKUP(J17,_공휴일날짜,3,FALSE),\"\"),\"\")","v":""},null,null,"2025-05-12",{"$f":"IFERROR(IF(AND(N17<>\"\",VLOOKUP(N17,_공휴일날짜,3,FALSE)<>\"\"),VLOOKUP(N17,_공휴일날짜,3,FALSE),\"\"),\"\")","v":""},null,null,"2025-05-13",{"$f":"IFERROR(IF(AND(R17<>\"\",VLOOKUP(R17,_공휴일날짜,3,FALSE)<>\"\"),VLOOKUP(R17,_공휴일날짜,3,FALSE),\"\"),\"\")","v":""},null,null,"2025-05-14",{"$f":"IFERROR(IF(AND(V17<>\"\",VLOOKUP(V17,_공휴일날짜,3,FALSE)<>\"\"),VLOOKUP(V17,_공휴일날짜,3,FALSE),\"\"),\"\")","v":""},null,null,"2025-05-15",{"$f":"IFERROR(IF(AND(Z17<>\"\",VLOOKUP(Z17,_공휴일날짜,3,FALSE)<>\"\"),VLOOKUP(Z17,_공휴일날짜,3,FALSE),\"\"),\"\")","v":""},null,null,"2025-05-16",{"$f":"IFERROR(IF(AND(AD17<>\"\",VLOOKUP(AD17,_공휴일날짜,3,FALSE)<>\"\"),VLOOKUP(AD17,_공휴일날짜,3,FALSE),\"\"),\"\")","v":""},null,null,"2025-05-17",{"$f":"IFERROR(IF(AND(AH17<>\"\",VLOOKUP(AH17,_공휴일날짜,3,FALSE)<>\"\"),VLOOKUP(AH17,_공휴일날짜,3,FALSE),\"\"),\"\")","v":""}]
[]
[]
[null,{"$f":"VLOOKUP($E$20,_월별표기,2)","v":"April"},null,null,4]
[null,"일","월","화","수","목","금","토"]
[null,null,null,"2025-04-01","2025-04-02","2025-04-03","2025-04-04","2025-04-05"]
[null,"2025-04-06","2025-04-07","2025-04-08","2025-04-09","2025-04-10","2025-04-11","2025-04-12",null,"2025-05-18",{"$f":"IFERROR(IF(AND(J23<>\"\",VLOOKUP(J23,_공휴일날짜,3,FALSE)<>\"\"),VLOOKUP(J23,_공휴일날짜,3,FALSE),\"\"),\"\")","v":""},null,null,"2025-05-19",{"$f":"IFERROR(IF(AND(N23<>\"\",VLOOKUP(N23,_공휴일날짜,3,FALSE)<>\"\"),VLOOKUP(N23,_공휴일날짜,3,FALSE),\"\"),\"\")","v":""},null,null,"2025-05-20",{"$f":"IFERROR(IF(AND(R23<>\"\",VLOOKUP(R23,_공휴일날짜,3,FALSE)<>\"\"),VLOOKUP(R23,_공휴일날짜,3,FALSE),\"\"),\"\")","v":""},null,null,"2025-05-21",{"$f":"IFERROR(IF(AND(V23<>\"\",VLOOKUP(V23,_공휴일날짜,3,FALSE)<>\"\"),VLOOKUP(V23,_공휴일날짜,3,FALSE),\"\"),\"\")","v":""},null,null,"2025-05-22",{"$f":"IFERROR(IF(AND(Z23<>\"\",VLOOKUP(Z23,_공휴일날짜,3,FALSE)<>\"\"),VLOOKUP(Z23,_공휴일날짜,3,FALSE),\"\"),\"\")","v":""},null,null,"2025-05-23",{"$f":"IFERROR(IF(AND(AD23<>\"\",VLOOKUP(AD23,_공휴일날짜,3,FALSE)<>\"\"),VLOOKUP(AD23,_공휴일날짜,3,FALSE),\"\"),\"\")","v":""},null,null,"2025-05-24",{"$f":"IFERROR(IF(AND(AH23<>\"\",VLOOKUP(AH23,_공휴일날짜,3,FALSE)<>\"\"),VLOOKUP(AH23,_공휴일날짜,3,FALSE),\"\"),\"\")","v":""}]
[null,"2025-04-13","2025-04-14","2025-04-15","2025-04-16","2025-04-17","2025-04-18","2025-04-19"]
[null,"2025-04-20","2025-04-21","2025-04-22","2025-04-23","2025-04-24","2025-04-25","2025-04-26"]
[null,"2025-04-27","2025-04-28","2025-04-29","2025-04-30"]
[]
[]
[null,null,null,null,null,null,null,null,null,"2025-05-25",{"$f":"IFERROR(IF(AND(J29<>\"\",VLOOKUP(J29,_공휴일날짜,3,FALSE)<>\"\"),VLOOKUP(J29,_공휴일날짜,3,FALSE),\"\"),\"\")","v":""},null,null,"2025-05-26",{"$f":"IFERROR(IF(AND(N29<>\"\",VLOOKUP(N29,_공휴일날짜,3,FALSE)<>\"\"),VLOOKUP(N29,_공휴일날짜,3,FALSE),\"\"),\"\")","v":""},null,null,"2025-05-27",{"$f":"IFERROR(IF(AND(R29<>\"\",VLOOKUP(R29,_공휴일날짜,3,FALSE)<>\"\"),VLOOKUP(R29,_공휴일날짜,3,FALSE),\"\"),\"\")","v":""},null,null,"2025-05-28",{"$f":"IFERROR(IF(AND(V29<>\"\",VLOOKUP(V29,_공휴일날짜,3,FALSE)<>\"\"),VLOOKUP(V29,_공휴일날짜,3,FALSE),\"\"),\"\")","v":""},null,null,"2025-05-29",{"$f":"IFERROR(IF(AND(Z29<>\"\",VLOOKUP(Z29,_공휴일날짜,3,FALSE)<>\"\"),VLOOKUP(Z29,_공휴일날짜,3,FALSE),\"\"),\"\")","v":""},null,null,"2025-05-30",{"$f":"IFERROR(IF(AND(AD29<>\"\",VLOOKUP(AD29,_공휴일날짜,3,FALSE)<>\"\"),VLOOKUP(AD29,_공휴일날짜,3,FALSE),\"\"),\"\")","v":""},null,null,"2025-05-31",{"$f":"IFERROR(IF(AND(AH29<>\"\",VLOOKUP(AH29,_공휴일날짜,3,FALSE)<>\"\"),VLOOKUP(AH29,_공휴일날짜,3,FALSE),\"\"),\"\")","v":""}]
[null,{"$f":"VLOOKUP($E$30,_월별표기,2)","v":"June"},null,null,6]
[null,"일","월","화","수","목","금","토"]
[null,"2025-06-01","2025-06-02","2025-06-03","2025-06-04","2025-06-05","2025-06-06","2025-06-07"]
[null,"2025-06-08","2025-06-09","2025-06-10","2025-06-11","2025-06-12","2025-06-13","2025-06-14"]
[null,"2025-06-15","2025-06-16","2025-06-17","2025-06-18","2025-06-19","2025-06-20","2025-06-21"]
[null,"2025-06-22","2025-06-23","2025-06-24","2025-06-25","2025-06-26","2025-06-27","2025-06-28",null,null,{"$f":"IFERROR(IF(AND(J35<>\"\",VLOOKUP(J35,_공휴일날짜,3,FALSE)<>\"\"),VLOOKUP(J35,_공휴일날짜,3,FALSE),\"\"),\"\")","v":""},null,null,null,{"$f":"IFERROR(IF(AND(N35<>\"\",VLOOKUP(N35,_공휴일날짜,3,FALSE)<>\"\"),VLOOKUP(N35,_공휴일날짜,3,FALSE),\"\"),\"\")","v":""}]
[null,"2025-06-29","2025-06-30"]

{"sheet":"6월","index":5,"n_rows":36,"n_cols":41,"rows_kept":36,"cut":false,"hidden":false,"merged":[[5,41,5,45],[2,33,3,36],[4,9,5,9],[4,10,4,12],[4,13,5,13],[4,14,4,16],[4,17,5,17],[4,18,4,20],[4,21,5,21],[4,22,4,24],[4,25,5,25],[2,9,3,12],[2,13,3,16],[2,17,3,20],[2,21,3,24],[2,25,3,28],[2,29,3,32],[5,10,5,12],[5,14,5,16],[5,18,5,20],[5,22,5,24],[5,26,5,28],[5,30,5,32],[4,26,4,28],[4,29,5,29],[4,30,4,32],[6,33,6,36],[6,41,6,45],[7,9,7,12],[7,13,7,16],[7,17,7,20],[7,21,7,24],[7,25,7,28],[7,29,7,32],[7,33,7,36],[7,41,7,45],[6,9,6,12],[6,13,6,16],[6,17,6,20],[6,21,6,24],[6,25,6,28],[6,29,6,32],[4,33,5,33],[4,34,4,36],[4,41,4,45],[5,34,5,36],[10,9,11,9],[10,10,10,12],[10,13,11,13],[10,14,10,16],[10,17,11,17],[10,18,10,20],[8,33,8,36],[8,41,8,45],[9,9,9,12],[9,13,9,16],[9,17,9,20],[9,21,9,24],[9,25,9,28],[9,29,9,32],[9,33,9,36],[9,41,9,45],[8,9,8,12],[8,13,8,16],[8,17,8,20],[8,21,8,24],[8,25,8,28],[8,29,8,32],[11,41,11,45],[12,9,12,12],[12,13,12,16],[12,17,12,20],[12,21,12,24],[12,25,12,28],[12,29,12,32],[12,33,12,36],[12,41,12,45],[10,33,11,33],[10,34,10,36],[10,41,10,45],[11,10,11,12],[11,14,11,16],[11,18,11,20],[11,22,11,24],[11,26,11,28],[11,30,11,32],[11,34,11,36],[10,21,11,21],[10,22,10,24],[10,25,11,25],[10,26,10,28],[10,29,11,29],[10,30,10,32],[13,33,13,36],[13,41,13,45],[14,9,14,12],[14,13,14,16],[14,17,14,20],[14,21,14,24],[14,25,14,28],[14,29,14,32],[14,33,14,36],[14,41,14,45],[13,9,13,12],[13,13,13,16],[13,17,13,20],[13,21,13,24],[13,25,13,28],[13,29,13,32],[15,41,15,45],[16,9,17,9],[16,10,16,12],[16,13,17,13],[16,14,16,16],[16,17,17,17],[16,18,16,20],[16,21,17,21],[16,22,16,24],[15,9,15,12],[15,13,15,16],[15,17,15,20],[15,21,15,24],[15,25,15,28],[15,29,15,32],[16,41,16,45],[17,30,17,32],[17,34,17,36],[16,25,17,25],[16,26,16,28],[16,29,17,29],[16,30,16,32],[16,33,17,33],[16,34,16,36],[15,33,15,36],[19,1,19,3],[19,9,19,12],[19,13,19,16],[19,17,19,20],[19,21,19,24],[19,25,19,28],[17,40,17,45],[18,9,18,12],[18,13,18,16],[18,17,18,20],[18,21,18,24],[18,25,18,28],[18,29,18,32],[18,33,18,36],[19,29,19,32],[19,33,19,36],[19,40,19,45],[17,1,17,2],[17,4,17,7],[17,10,17,12],[17,14,17,16],[17,18,17,20],[17,22,17,24],[17,26,17,28],[20,9,20,12],[20,13,20,16],[20,17,20,20],[20,21,20,24],[20,25,20,28],[20,29,20,32],[20,33,20,36],[20,40,20,41],[20,42,20,45],[21,9,21,12],[21,13,21,16],[21,17,21,20],[21,21,21,24],[21,25,21,28],[21,29,21,32],[21,33,21,36],[21,40,21,41],[21,42,21,45],[22,9,23,9],[22,10,22,12],[22,13,23,13],[22,14,22,16],[22,17,23,17],[22,18,22,20],[22,21,23,21],[22,22,22,24],[22,25,23,25],[22,42,22,45],[23,10,23,12],[23,14,23,16],[23,18,23,20],[23,22,23,24],[23,26,23,28],[23,30,23,32],[23,34,23,36],[23,40,23,41],[23,42,23,45],[22,26,22,28],[22,29,23,29],[22,30,22,32],[22,33,23,33],[22,34,22,36],[22,40,22,41],[24,33,24,36],[24,40,24,41],[24,42,24,45],[25,9,25,12],[25,13,25,16],[25,17,25,20],[25,21,25,24],[25,25,25,28],[25,29,25,32],[25,33,25,36],[24,9,24,12],[24,13,24,16],[24,17,24,20],[24,21,24,24],[24,25,24,28],[24,29,24,32],[25,40,25,41],[25,42,25,45],[26,9,26,12],[26,13,26,16],[26,17,26,20],[26,21,26,24],[26,25,26,28],[26,29,26,32],[26,33,26,36],[26,40,26,41],[26,42,26,45],[27,9,27,12],[27,13,27,16],[27,17,27,20],[27,21,27,24],[27,25,27,28],[27,29,27,32],[27,33,27,36],[27,40,27,45],[29,1,29,3],[29,10,29,12],[29,14,29,16],[29,18,29,20],[29,22,29,24],[29,26,29,28],[29,30,29,32],[28,21,29,21],[28,22,28,24],[28,25,29,25],[28,26,28,28],[28,29,29,29],[28,30,28,32],[28,9,29,9],[28,10,28,12],[28,13,29,13],[28,14,28,16],[28,17,29,17],[28,18,28,20],[29,34,29,36],[29,40,29,45],[30,9,30,12],[30,13,30,16],[30,17,30,20],[30,21,30,24],[30,25,30,28],[30,29,30,32],[30,33,30,36],[30,40,30,45],[28,33,29,33],[28,34,28,36],[28,40,28,45],[31,33,31,36],[31,40,31,45],[32,9,32,12],[32,13,32,16],[32,17,32,20],[32,21,32,24],[32,25,32,28],[32,29,32,32],[32,33,32,36],[32,40,32,45],[31,9,31,12],[31,13,31,16],[31,17,31,20],[31,21,31,24],[31,25,31,28],[31,29,31,32],[33,33,33,36],[33,40,33,45],[34,9,35,9],[34,10,34,12],[34,13,35,13],[34,14,34,16],[34,40,34,45],[35,10,35,12],[35,14,35,16],[35,40,35,45],[33,9,33,12],[33,13,33,16],[33,17,33,20],[33,21,33,24],[33,25,33,28],[33,29,33,32],[36,9,36,12],[36,13,36,16],[36,21,36,28],[36,29,36,36],[36,40,36,45],[37,9,37,12],[37,13,37,16],[37,21,37,28],[37,29,37,36],[37,40,37,45],[38,9,38,12],[38,13,38,16],[38,21,38,28],[38,29,38,36],[38,40,38,45],[39,9,39,12],[39,13,39,16],[39,21,39,28],[39,29,39,36]]}
["v1.01"]
[]
[null,null,null,null,null,null,null,null,null,"일 Sunday",null,null,null,"월 Monday",null,null,null,"화 Tuesday",null,null,null,"수 Wednesday",null,null,null,"목 Thursday",null,null,null,"금 Friday",null,null,null,"토 Saturday"]
[]
[null,null,null,null,null,null,null,null,null,"2025-06-01",{"$f":"IFERROR(IF(AND(J5<>\"\",VLOOKUP(J5,_공휴일날짜,3,FALSE)<>\"\"),VLOOKUP(J5,_공휴일날짜,3,FALSE),\"\"),\"\")","v":""},null,null,"2025-06-02",{"$f":"IFERROR(IF(AND(N5<>\"\",VLOOKUP(N5,_공휴일날짜,3,FALSE)<>\"\"),VLOOKUP(N5,_공휴일날짜,3,FALSE),\"\"),\"\")","v":""},null,null,"2025-06-03",{"$f":"IFERROR(IF(AND(R5<>\"\",VLOOKUP(R5,_공휴일날짜,3,FALSE)<>\"\"),VLOOKUP(R5,_공휴일날짜,3,FALSE),\"\"),\"\")","v":""},null,null,"2025-06-04",{"$f":"IFERROR(IF(AND(V5<>\"\",VLOOKUP(V5,_공휴일날짜,3,FALSE)<>\"\"),VLOOKUP(V5,_공휴일날짜,3,FALSE),\"\"),\"\")","v":""},null,null,"2025-06-05",{"$f":"IFERROR(IF(AND(Z5<>\"\",VLOOKUP(Z5,_공휴일날짜,3,FALSE)<>\"\"),VLOOKUP(Z5,_공휴일날짜,3,FALSE),\"\"),\"\")","v":""},null,null,"2025-06-06",{"$f":"IFERROR(IF(AND(AD5<>\"\",VLOOKUP(AD5,_공휴일날짜,3,FALSE)<>\"\"),VLOOKUP(AD5,_공휴일날짜,3,FALSE),\"\"),\"\")","v":"현충일"},null,null,"2025-06-07",{"$f":"IFERROR(IF(AND(AH5<>\"\",VLOOKUP(AH5,_공휴일날짜,3,FALSE)<>\"\"),VLOOKUP(AH5,_공휴일날짜,3,FALSE),\"\"),\"\")","v":""},null,null,null,null,null,false]
[null,null,null,{"$f":"'달력 설정'!B6","v":2025},6,{"$f":"VLOOKUP($E$6,_월별표기,2)","v":"June"},null,null,null,null,null,null,null,null,null,null,null,null,null,null,null,null,null,null,null,null,null,null,null,null,null,null,null,null,null,null,null,null,null,null,false]
[null,null,null,null,null,null,null,null,null,null,null,null,null,null,null,null,null,null,null,null,null,null,null,null,null,null,null,null,null,null,null,null,null,null,null,null,null,null,null,null,false]
[null,1,null,null,null,null,null,null,null,null,null,null,null,null,null,null,null,null,null,null,null,null,null,null,null,null,null,null,null,null,null,null,null,null,null,null,null,null,null,null,false]
[null,null,null,null,null,null,null,null,null,null,null,null,null,null,null,null,null,null,null,null,null,null,null,null,null,null,null,null,null,null,null,null,null,null,null,null,null,null,null,null,false]
[null,null,null,null,null,null,null,null,null,null,null,null,null,null,null,null,null,null,null,null,null,null,null,null,null,null,null,null,null,null,null,null,null,null,null,null,null,null,null,null,false]
[null,null,null,null,null,null,null,null,null,"2025-06-08",{"$f":"IFERROR(IF(AND(J11<>\"\",VLOOKUP(J11,_공휴일날짜,3,FALSE)<>\"\"),VLOOKUP(J11,_공휴일날짜,3,FALSE),\"\"),\"\")","v":""},null,null,"2025-06-09",{"$f":"IFERROR(IF(AND(N11<>\"\",VLOOKUP(N11,_공휴일날짜,3,FALSE)<>\"\"),VLOOKUP(N11,_공휴일날짜,3,FALSE),\"\"),\"\")","v":""},null,null,"2025-06-10",{"$f":"IFERROR(IF(AND(R11<>\"\",VLOOKUP(R11,_공휴일날짜,3,FALSE)<>\"\"),VLOOKUP(R11,_공휴일날짜,3,FALSE),\"\"),\"\")","v":""},null,null,"2025-06-11",{"$f":"IFERROR(IF(AND(V11<>\"\",VLOOKUP(V11,_공휴일날짜,3,FALSE)<>\"\"),VLOOKUP(V11,_공휴일날짜,3,FALSE),\"\"),\"\")","v":""},null,null,"2025-06-12",{"$f":"IFERROR(IF(AND(Z11<>\"\",VLOOKUP(Z11,_공휴일날짜,3,FALSE)<>\"\"),VLOOKUP(Z11,_공휴일날짜,3,FALSE),\"\"),\"\")","v":""},null,null,"2025-06-13",{"$f":"IFERROR(IF(AND(AD11<>\"\",VLOOKUP(AD11,_공휴일날짜,3,FALSE)<>\"\"),VLOOKUP(AD11,_공휴일날짜,3,FALSE),\"\"),\"\")","v":""},null,null,"2025-06-14",{"$f":"IFERROR(IF(AND(AH11<>\"\",VLOOKUP(AH11,_공휴일날짜,3,FALSE)<>\"\"),VLOOKUP(AH11,_공휴일날짜,3,FALSE),\"\"),\"\")","v":""},null,null,null,null,null,false]
[null,null,null,null,null,null,null,null,null,null,null,null,null,null,null,null,null,null,null,null,null,null,null,null,null,null,null,null,null,null,null,null,null,null,null,null,null,null,null,null,false]
[null,null,null,null,null,null,null,null,null,null,null,null,null,null,null,null,null,null,null,null,null,null,null,null,null,null,null,null,null,null,null,null,null,null,null,null,null,null,null,null,false]
[null,null,null,null,null,null,null,null,null,null,null,null,null,null,null,null,null,null,null,null,null,null,null,null,null,null,null,null,null,null,null,null,null,null,null,null,null,null,null,null,false]
[null,null,null,null,null,null,null,null,null,null,null,null,null,null,null,null,null,null,null,null,null,null,null,null,null,null,null,null,null,null,null,null,null,null,null,null,null,null,null,null,false]
[null,null,null,{"$f":"YEAR(TODAY())","v":2025},{"$f":"MONTH(TODAY())","v":2},{"$f":"DAY(TODAY())","v":24},null,null,null,null,null,null,null,null,null,null,null,null,null,null,null,null,null,null,null,null,null,null,null,null,null,null,null,null,null,null,null,null,null,null,false]
[null,null,null,null,null,null,null,null,null,"2025-06-15",{"$f":"IFERROR(IF(AND(J17<>\"\",VLOOKUP(J17,_공휴일날짜,3,FALSE)<>\"\"),VLOOKUP(J17,_공휴일날짜,3,FALSE),\"\"),\"\")","v":""},null,null,"2025-06-16",{"$f":"IFERROR(IF(AND(N17<>\"\",VLOOKUP(N17,_공휴일날짜,3,FALSE)<>\"\"),VLOOKUP(N17,_공휴일날짜,3,FALSE),\"\"),\"\")","v":""},null,null,"2025-06-17",{"$f":"IFERROR(IF(AND(R17<>\"\",VLOOKUP(R17,_공휴일날짜,3,FALSE)<>\"\"),VLOOKUP(R17,_공휴일날짜,3,FALSE),\"\"),\"\")","v":""},null,null,"2025-06-18",{"$f":"IFERROR(IF(AND(V17<>\"\",VLOOKUP(V17,_공휴일날짜,3,FALSE)<>\"\"),VLOOKUP(V17,_공휴일날짜,3,FALSE),\"\"),\"\")","v":""},null,null,"2025-06-19",{"$f":"IFERROR(IF(AND(Z17<>\"\",VLOOKUP(Z17,_공휴일날짜,3,FALSE)<>\"\"),VLOOKUP(Z17,_공휴일날짜,3,FALSE),\"\"),\"\")","v":""},null,null,"2025-06-20",{"$f":"IFERROR(IF(AND(AD17<>\"\",VLOOKUP(AD17,_공휴일날짜,3,FALSE)<>\"\"),VLOOKUP(AD17,_공휴일날짜,3,FALSE),\"\"),\"\")","v":""},null,null,"2025-06-21",{"$f":"IFERROR(IF(AND(AH17<>\"\",VLOOKUP(AH17,_공휴일날짜,3,FALSE)<>\"\"),VLOOKUP(AH17,_공휴일날짜,3,FALSE),\"\"),\"\")","v":""}]
[]
[]
[null,{"$f":"VLOOKUP($E$20,_월별표기,2)","v":"May"},null,null,5]
[null,"일","월","화","수","목","금","토"]
[null,null,null,null,null,"2025-05-01","2025-05-02","2025-05-03"]
[null,"2025-05-04","2025-05-05","2025-05-06","2025-05-07","2025-05-08","2025-05-09","2025-05-10",null,"2025-06-22",{"$f":"IFERROR(IF(AND(J23<>\"\",VLOOKUP(J23,_공휴일날짜,3,FALSE)<>\"\"),VLOOKUP(J23,_공휴일날짜,3,FALSE),\"\"),\"\")","v":""},null,null,"2025-06-23",{"$f":"IFERROR(IF(AND(N23<>\"\",VLOOKUP(N23,_공휴일날짜,3,FALSE)<>\"\"),VLOOKUP(N23,_공휴일날짜,3,FALSE),\"\"),\"\")","v":""},null,null,"2025-06-24",{"$f":"IFERROR(IF(AND(R23<>\"\",VLOOKUP(R23,_공휴일날짜,3,FALSE)<>\"\"),VLOOKUP(R23,_공휴일날짜,3,FALSE),\"\"),\"\")","v":""},null,null,"2025-06-25",{"$f":"IFERROR(IF(AND(V23<>\"\",VLOOKUP(V23,_공휴일날짜,3,FALSE)<>\"\"),VLOOKUP(V23,_공휴일날짜,3,FALSE),\"\"),\"\")","v":""},null,null,"2025-06-26",{"$f":"IFERROR(IF(AND(Z23<>\"\",VLOOKUP(Z23,_공휴일날짜,3,FALSE)<>\"\"),VLOOKUP(Z23,_공휴일날짜,3,FALSE),\"\"),\"\")","v":""},null,null,"2025-06-27",{"$f":"IFERROR(IF(AND(AD23<>\"\",VLOOKUP(AD23,_공휴일날짜,3,FALSE)<>\"\"),VLOOKUP(AD23,_공휴일날짜,3,FALSE),\"\"),\"\")","v":""},null,null,"2025-06-28",{"$f":"IFERROR(IF(AND(AH23<>\"\",VLOOKUP(AH23,_공휴일날짜,3,FALSE)<>\"\"),VLOOKUP(AH23,_공휴일날짜,3,FALSE),\"\"),\"\")","v":""}]
[null,"2025-05-11","2025-05-12","2025-05-13","2025-05-14","2025-05-15","2025-05-16","2025-05-17"]
[null,"2025-05-18","2025-05-19","2025-05-20","2025-05-21","2025-05-22","2025-05-23","2025-05-24"]
[null,"2025-05-25","2025-05-26","2025-05-27","2025-05-28","2025-05-29","2025-05-30","2025-05-31"]
[]
[]
[null,null,null,null,null,null,null,null,null,"2025-06-29",{"$f":"IFERROR(IF(AND(J29<>\"\",VLOOKUP(J29,_공휴일날짜,3,FALSE)<>\"\"),VLOOKUP(J29,_공휴일날짜,3,FALSE),\"\"),\"\")","v":""},null,null,"2025-06-30",{"$f":"IFERROR(IF(AND(N29<>\"\",VLOOKUP(N29,_공휴일날짜,3,FALSE)<>\"\"),VLOOKUP(N29,_공휴일날짜,3,FALSE),\"\"),\"\")","v":""},null,null,null,{"$f":"IFERROR(IF(AND(R29<>\"\",VLOOKUP(R29,_공휴일날짜,3,FALSE)<>\"\"),VLOOKUP(R29,_공휴일날짜,3,FALSE),\"\"),\"\")","v":""},null,null,null,{"$f":"IFERROR(IF(AND(V29<>\"\",VLOOKUP(V29,_공휴일날짜,3,FALSE)<>\"\"),VLOOKUP(V29,_공휴일날짜,3,FALSE),\"\"),\"\")","v":""},null,null,null,{"$f":"IFERROR(IF(AND(Z29<>\"\",VLOOKUP(Z29,_공휴일날짜,3,FALSE)<>\"\"),VLOOKUP(Z29,_공휴일날짜,3,FALSE),\"\"),\"\")","v":""},null,null,null,{"$f":"IFERROR(IF(AND(AD29<>\"\",VLOOKUP(AD29,_공휴일날짜,3,FALSE)<>\"\"),VLOOKUP(AD29,_공휴일날짜,3,FALSE),\"\"),\"\")","v":""},null,null,null,{"$f":"IFERROR(IF(AND(AH29<>\"\",VLOOKUP(AH29,_공휴일날짜,3,FALSE)<>\"\"),VLOOKUP(AH29,_공휴일날짜,3,FALSE),\"\"),\"\")","v":""}]
[null,{"$f":"VLOOKUP($E$30,_월별표기,2)","v":"July"},null,null,7]
[null,"일","월","화","수","목","금","토"]
[null,null,null,"2025-07-01","2025-07-02","2025-07-03","2025-07-04","2025-07-05"]
[null,"2025-07-06","2025-07-07","2025-07-08","2025-07-09","2025-07-10","2025-07-11","2025-07-12"]
[null,"2025-07-13","2025-07-14","2025-07-15","2025-07-16","2025-07-17","2025-07-18","2025-07-19"]
[null,"2025-07-20","2025-07-21","2025-07-22","2025-07-23","2025-07-24","2025-07-25","2025-07-26",null,null,{"$f":"IFERROR(IF(AND(J35<>\"\",VLOOKUP(J35,_공휴일날짜,3,FALSE)<>\"\"),VLOOKUP(J35,_공휴일날짜,3,FALSE),\"\"),\"\")","v":""},null,null,null,{"$f":"IFERROR(IF(AND(N35<>\"\",VLOOKUP(N35,_공휴일날짜,3,FALSE)<>\"\"),VLOOKUP(N35,_공휴일날짜,3,FALSE),\"\"),\"\")","v":""}]
[null,"2025-07-27","2025-07-28","2025-07-29","2025-07-30","2025-07-31"]

{"sheet":"7월","index":6,"n_rows":37,"n_cols":41,"rows_kept":37,"cut":false,"hidden":false,"merged":[[5,41,5,45],[2,33,3,36],[4,9,5,9],[4,10,4,12],[4,13,5,13],[4,14,4,16],[4,17,5,17],[4,18,4,20],[4,21,5,21],[4,22,4,24],[4,25,5,25],[2,9,3,12],[2,13,3,16],[2,17,3,20],[2,21,3,24],[2,25,3,28],[2,29,3,32],[5,10,5,12],[5,14,5,16],[5,18,5,20],[5,22,5,24],[5,26,5,28],[5,30,5,32],[4,26,4,28],[4,29,5,29],[4,30,4,32],[6,33,6,36],[6,41,6,45],[7,9,7,12],[7,13,7,16],[7,17,7,20],[7,21,7,24],[7,25,7,28],[7,29,7,32],[7,33,7,36],[7,41,7,45],[6,9,6,12],[6,13,6,16],[6,17,6,20],[6,21,6,24],[6,25,6,28],[6,29,6,32],[4,33,5,33],[4,34,4,36],[4,41,4,45],[5,34,5,36],[10,9,11,9],[10,10,10,12],[10,13,11,13],[10,14,10,16],[10,17,11,17],[10,18,10,20],[8,33,8,36],[8,41,8,45],[9,9,9,12],[9,13,9,16],[9,17,9,20],[9,21,9,24],[9,25,9,28],[9,29,9,32],[9,33,9,36],[9,41,9,45],[8,9,8,12],[8,13,8,16],[8,17,8,20],[8,21,8,24],[8,25,8,28],[8,29,8,32],[11,41,11,45],[12,9,12,12],[12,13,12,16],[12,17,12,20],[12,21,12,24],[12,25,12,28],[12,29,12,32],[12,33,12,36],[12,41,12,45],[10,33,11,33],[10,34,10,36],[10,41,10,45],[11,10,11,12],[11,14,11,16],[11,18,11,20],[11,22,11,24],[11,26,11,28],[11,30,11,32],[11,34,11,36],[10,21,11,21],[10,22,10,24],[10,25,11,25],[10,26,10,28],[10,29,11,29],[10,30,10,32],[13,33,13,36],[13,41,13,45],[14,9,14,12],[14,13,14,16],[14,17,14,20],[14,21,14,24],[14,25,14,28],[14,29,14,32],[14,33,14,36],[14,41,14,45],[13,9,13,12],[13,13,13,16],[13,17,13,20],[13,21,13,24],[13,25,13,28],[13,29,13,32],[15,41,15,45],[16,9,17,9],[16,10,16,12],[16,13,17,13],[16,14,16,16],[16,17,17,17],[16,18,16,20],[16,21,17,21],[16,22,16,24],[15,9,15,12],[15,13,15,16],[15,17,15,20],[15,21,15,24],[15,25,15,28],[15,29,15,32],[16,41,16,45],[17,30,17,32],[17,34,17,36],[16,25,17,25],[16,26,16,28],[16,29,17,29],[16,30,16,32],[16,33,17,33],[16,34,16,36],[15,33,15,36],[19,1,19,3],[19,9,19,12],[19,13,19,16],[19,17,19,20],[19,21,19,24],[19,25,19,28],[17,40,17,45],[18,9,18,12],[18,13,18,16],[18,17,18,20],[18,21,18,24],[18,25,18,28],[18,29,18,32],[18,33,18,36],[19,29,19,32],[19,33,19,36],[19,40,19,45],[17,1,17,2],[17,4,17,7],[17,10,17,12],[17,14,17,16],[17,18,17,20],[17,22,17,24],[17,26,17,28],[20,9,20,12],[20,13,20,16],[20,17,20,20],[20,21,20,24],[20,25,20,28],[20,29,20,32],[20,33,20,36],[20,40,20,41],[20,42,20,45],[21,9,21,12],[21,13,21,16],[21,17,21,20],[21,21,21,24],[21,25,21,28],[21,29,21,32],[21,33,21,36],[21,40,21,41],[21,42,21,45],[22,9,23,9],[22,10,22,12],[22,13,23,13],[22,14,22,16],[22,17,23,17],[22,18,22,20],[22,21,23,21],[22,22,22,24],[22,25,23,25],[22,42,22,45],[23,10,23,12],[23,14,23,16],[23,18,23,20],[23,22,23,24],[23,26,23,28],[23,30,23,32],[23,34,23,36],[23,40,23,41],[23,42,23,45],[22,26,22,28],[22,29,23,29],[22,30,22,32],[22,33,23,33],[22,34,22,36],[22,40,22,41],[24,33,24,36],[24,40,24,41],[24,42,24,45],[25,9,25,12],[25,13,25,16],[25,17,25,20],[25,21,25,24],[25,25,25,28],[25,29,25,32],[25,33,25,36],[24,9,24,12],[24,13,24,16],[24,17,24,20],[24,21,24,24],[24,25,24,28],[24,29,24,32],[25,40,25,41],[25,42,25,45],[26,9,26,12],[26,13,26,16],[26,17,26,20],[26,21,26,24],[26,25,26,28],[26,29,26,32],[26,33,26,36],[26,40,26,41],[26,42,26,45],[27,9,27,12],[27,13,27,16],[27,17,27,20],[27,21,27,24],[27,25,27,28],[27,29,27,32],[27,33,27,36],[27,40,27,45],[29,1,29,3],[29,10,29,12],[29,14,29,16],[29,18,29,20],[29,22,29,24],[29,26,29,28],[29,30,29,32],[28,21,29,21],[28,22,28,24],[28,25,29,25],[28,26,28,28],[28,29,29,29],[28,30,28,32],[28,9,29,9],[28,10,28,12],[28,13,29,13],[28,14,28,16],[28,17,29,17],[28,18,28,20],[29,34,29,36],[29,40,29,45],[30,9,30,12],[30,13,30,16],[30,17,30,20],[30,21,30,24],[30,25,30,28],[30,29,30,32],[30,33,30,36],[30,40,30,45],[28,33,29,33],[28,34,28,36],[28,40,28,45],[31,33,31,36],[31,40,31,45],[32,9,32,12],[32,13,32,16],[32,17,32,20],[32,21,32,24],[32,25,32,28],[32,29,32,32],[32,33,32,36],[32,40,32,45],[31,9,31,12],[31,13,31,16],[31,17,31,20],[31,21,31,24],[31,25,31,28],[31,29,31,32],[33,33,33,36],[33,40,33,45],[34,9,35,9],[34,10,34,12],[34,13,35,13],[34,14,34,16],[34,40,34,45],[35,10,35,12],[35,14,35,16],[35,40,35,45],[33,9,33,12],[33,13,33,16],[33,17,33,20],[33,21,33,24],[33,25,33,28],[33,29,33,32],[36,9,36,12],[36,13,36,16],[36,21,36,28],[36,29,36,36],[36,40,36,45],[37,9,37,12],[37,13,37,16],[37,21,37,28],[37,29,37,36],[37,40,37,45],[38,9,38,12],[38,13,38,16],[38,21,38,28],[38,29,38,36],[38,40,38,45],[39,9,39,12],[39,13,39,16],[39,21,39,28],[39,29,39,36]]}
["v1.01"]
[]
[null,null,null,null,null,null,null,null,null,"일 Sunday",null,null,null,"월 Monday",null,null,null,"화 Tuesday",null,null,null,"수 Wednesday",null,null,null,"목 Thursday",null,null,null,"금 Friday",null,null,null,"토 Saturday"]
[]
[null,null,null,null,null,null,null,null,null,null,{"$f":"IFERROR(IF(AND(J5<>\"\",VLOOKUP(J5,_공휴일날짜,3,FALSE)<>\"\"),VLOOKUP(J5,_공휴일날짜,3,FALSE),\"\"),\"\")","v":""},null,null,null,{"$f":"IFERROR(IF(AND(N5<>\"\",VLOOKUP(N5,_공휴일날짜,3,FALSE)<>\"\"),VLOOKUP(N5,_공휴일날짜,3,FALSE),\"\"),\"\")","v":""},null,null,"2025-07-01",{"$f":"IFERROR(IF(AND(R5<>\"\",VLOOKUP(R5,_공휴일날짜,3,FALSE)<>\"\"),VLOOKUP(R5,_공휴일날짜,3,FALSE),\"\"),\"\")","v":""},null,null,"2025-07-02",{"$f":"IFERROR(IF(AND(V5<>\"\",VLOOKUP(V5,_공휴일날짜,3,FALSE)<>\"\"),VLOOKUP(V5,_공휴일날짜,3,FALSE),\"\"),\"\")","v":""},null,null,"2025-07-03",{"$f":"IFERROR(IF(AND(Z5<>\"\",VLOOKUP(Z5,_공휴일날짜,3,FALSE)<>\"\"),VLOOKUP(Z5,_공휴일날짜,3,FALSE),\"\"),\"\")","v":""},null,null,"2025-07-04",{"$f":"IFERROR(IF(AND(AD5<>\"\",VLOOKUP(AD5,_공휴일날짜,3,FALSE)<>\"\"),VLOOKUP(AD5,_공휴일날짜,3,FALSE),\"\"),\"\")","v":""},null,null,"2025-07-05",{"$f":"IFERROR(IF(AND(AH5<>\"\",VLOOKUP(AH5,_공휴일날짜,3,FALSE)<>\"\"),VLOOKUP(AH5,_공휴일날짜,3,FALSE),\"\"),\"\")","v":""},null,null,null,null,null,false]
[null,null,null,{"$f":"'달력 설정'!B6","v":2025},7,{"$f":"VLOOKUP($E$6,_월별표기,2)","v":"July"},null,null,null,null,null,null,null,null,null,null,null,null,null,null,null,null,null,null,null,null,null,null,null,null,null,null,null,null,null,null,null,null,null,null,false]
[null,null,null,null,null,null,null,null,null,null,null,null,null,null,null,null,null,null,null,null,null,null,null,null,null,null,null,null,null,null,null,null,null,null,null,null,null,null,null,null,false]
[null,1,null,null,null,null,null,null,null,null,null,null,null,null,null,null,null,null,null,null,null,null,null,null,null,null,null,null,null,null,null,null,null,null,null,null,null,null,null,null,false]
[null,null,null,null,null,null,null,null,null,null,null,null,null,null,null,null,null,null,null,null,null,null,null,null,null,null,null,null,null,null,null,null,null,null,null,null,null,null,null,null,false]
[null,null,null,null,null,null,null,null,null,null,null,null,null,null,null,null,null,null,null,null,null,null,null,null,null,null,null,null,null,null,null,null,null,null,null,null,null,null,null,null,false]
[null,null,null,null,null,null,null,null,null,"2025-07-06",{"$f":"IFERROR(IF(AND(J11<>\"\",VLOOKUP(J11,_공휴일날짜,3,FALSE)<>\"\"),VLOOKUP(J11,_공휴일날짜,3,FALSE),\"\"),\"\")","v":""},null,null,"2025-07-07",{"$f":"IFERROR(IF(AND(N11<>\"\",VLOOKUP(N11,_공휴일날짜,3,FALSE)<>\"\"),VLOOKUP(N11,_공휴일날짜,3,FALSE),\"\"),\"\")","v":""},null,null,"2025-07-08",{"$f":"IFERROR(IF(AND(R11<>\"\",VLOOKUP(R11,_공휴일날짜,3,FALSE)<>\"\"),VLOOKUP(R11,_공휴일날짜,3,FALSE),\"\"),\"\")","v":""},null,null,"2025-07-09",{"$f":"IFERROR(IF(AND(V11<>\"\",VLOOKUP(V11,_공휴일날짜,3,FALSE)<>\"\"),VLOOKUP(V11,_공휴일날짜,3,FALSE),\"\"),\"\")","v":""},null,null,"2025-07-10",{"$f":"IFERROR(IF(AND(Z11<>\"\",VLOOKUP(Z11,_공휴일날짜,3,FALSE)<>\"\"),VLOOKUP(Z11,_공휴일날짜,3,FALSE),\"\"),\"\")","v":""},null,null,"2025-07-11",{"$f":"IFERROR(IF(AND(AD11<>\"\",VLOOKUP(AD11,_공휴일날짜,3,FALSE)<>\"\"),VLOOKUP(AD11,_공휴일날짜,3,FALSE),\"\"),\"\")","v":""},null,null,"2025-07-12",{"$f":"IFERROR(IF(AND(AH11<>\"\",VLOOKUP(AH11,_공휴일날짜,3,FALSE)<>\"\"),VLOOKUP(AH11,_공휴일날짜,3,FALSE),\"\"),\"\")","v":""},null,null,null,null,null,false]
[null,null,null,null,null,null,null,null,null,null,null,null,null,null,null,null,null,null,null,null,null,null,null,null,null,null,null,null,null,null,null,null,null,null,null,null,null,null,null,null,false]
[null,null,null,null,null,null,null,null,null,null,null,null,null,null,null,null,null,null,null,null,null,null,null,null,null,null,null,null,null,null,null,null,null,null,null,null,null,null,null,null,false]
[null,null,null,null,null,null,null,null,null,null,null,null,null,null,null,null,null,null,null,null,null,null,null,null,null,null,null,null,null,null,null,null,null,null,null,null,null,null,null,null,false]
[null,null,null,null,null,null,null,null,null,null,null,null,null,null,null,null,null,null,null,null,null,null,null,null,null,null,null,null,null,null,null,null,null,null,null,null,null,null,null,null,false]
[null,null,null,{"$f":"YEAR(TODAY())","v":2025},{"$f":"MONTH(TODAY())","v":2},{"$f":"DAY(TODAY())","v":24},null,null,null,null,null,null,null,null,null,null,null,null,null,null,null,null,null,null,null,null,null,null,null,null,null,null,null,null,null,null,null,null,null,null,false]
[null,null,null,null,null,null,null,null,null,"2025-07-13",{"$f":"IFERROR(IF(AND(J17<>\"\",VLOOKUP(J17,_공휴일날짜,3,FALSE)<>\"\"),VLOOKUP(J17,_공휴일날짜,3,FALSE),\"\"),\"\")","v":""},null,null,"2025-07-14",{"$f":"IFERROR(IF(AND(N17<>\"\",VLOOKUP(N17,_공휴일날짜,3,FALSE)<>\"\"),VLOOKUP(N17,_공휴일날짜,3,FALSE),\"\"),\"\")","v":""},null,null,"2025-07-15",{"$f":"IFERROR(IF(AND(R17<>\"\",VLOOKUP(R17,_공휴일날짜,3,FALSE)<>\"\"),VLOOKUP(R17,_공휴일날짜,3,FALSE),\"\"),\"\")","v":""},null,null,"2025-07-16",{"$f":"IFERROR(IF(AND(V17<>\"\",VLOOKUP(V17,_공휴일날짜,3,FALSE)<>\"\"),VLOOKUP(V17,_공휴일날짜,3,FALSE),\"\"),\"\")","v":""},null,null,"2025-07-17",{"$f":"IFERROR(IF(AND(Z17<>\"\",VLOOKUP(Z17,_공휴일날짜,3,FALSE)<>\"\"),VLOOKUP(Z17,_공휴일날짜,3,FALSE),\"\"),\"\")","v":""},null,null,"2025-07-18",{"$f":"IFERROR(IF(AND(AD17<>\"\",VLOOKUP(AD17,_공휴일날짜,3,FALSE)<>\"\"),VLOOKUP(AD17,_공휴일날짜,3,FALSE),\"\"),\"\")","v":""},null,null,"2025-07-19",{"$f":"IFERROR(IF(AND(AH17<>\"\",VLOOKUP(AH17,_공휴일날짜,3,FALSE)<>\"\"),VLOOKUP(AH17,_공휴일날짜,3,FALSE),\"\"),\"\")","v":""}]
[]
[]
[null,{"$f":"VLOOKUP($E$20,_월별표기,2)","v":"June"},null,null,6]
[null,"일","월","화","수","목","금","토"]
[null,"2025-06-01","2025-06-02","2025-06-03","2025-06-04","2025-06-05","2025-06-06","2025-06-07"]
[null,"2025-06-08","2025-06-09","2025-06-10","2025-06-11","2025-06-12","2025-06-13","2025-06-14",null,"2025-07-20",{"$f":"IFERROR(IF(AND(J23<>\"\",VLOOKUP(J23,_공휴일날짜,3,FALSE)<>\"\"),VLOOKUP(J23,_공휴일날짜,3,FALSE),\"\"),\"\")","v":""},null,null,"2025-07-21",{"$f":"IFERROR(IF(AND(N23<>\"\",VLOOKUP(N23,_공휴일날짜,3,FALSE)<>\"\"),VLOOKUP(N23,_공휴일날짜,3,FALSE),\"\"),\"\")","v":""},null,null,"2025-07-22",{"$f":"IFERROR(IF(AND(R23<>\"\",VLOOKUP(R23,_공휴일날짜,3,FALSE)<>\"\"),VLOOKUP(R23,_공휴일날짜,3,FALSE),\"\"),\"\")","v":""},null,null,"2025-07-23",{"$f":"IFERROR(IF(AND(V23<>\"\",VLOOKUP(V23,_공휴일날짜,3,FALSE)<>\"\"),VLOOKUP(V23,_공휴일날짜,3,FALSE),\"\"),\"\")","v":""},null,null,"2025-07-24",{"$f":"IFERROR(IF(AND(Z23<>\"\",VLOOKUP(Z23,_공휴일날짜,3,FALSE)<>\"\"),VLOOKUP(Z23,_공휴일날짜,3,FALSE),\"\"),\"\")","v":""},null,null,"2025-07-25",{"$f":"IFERROR(IF(AND(AD23<>\"\",VLOOKUP(AD23,_공휴일날짜,3,FALSE)<>\"\"),VLOOKUP(AD23,_공휴일날짜,3,FALSE),\"\"),\"\")","v":""},null,null,"2025-07-26",{"$f":"IFERROR(IF(AND(AH23<>\"\",VLOOKUP(AH23,_공휴일날짜,3,FALSE)<>\"\"),VLOOKUP(AH23,_공휴일날짜,3,FALSE),\"\"),\"\")","v":""}]
[null,"2025-06-15","2025-06-16","2025-06-17","2025-06-18","2025-06-19","2025-06-20","2025-06-21"]
[null,"2025-06-22","2025-06-23","2025-06-24","2025-06-25","2025-06-26","2025-06-27","2025-06-28"]
[null,"2025-06-29","2025-06-30"]
[]
[]
[null,null,null,null,null,null,null,null,null,"2025-07-27",{"$f":"IFERROR(IF(AND(J29<>\"\",VLOOKUP(J29,_공휴일날짜,3,FALSE)<>\"\"),VLOOKUP(J29,_공휴일날짜,3,FALSE),\"\"),\"\")","v":""},null,null,"2025-07-28",{"$f":"IFERROR(IF(AND(N29<>\"\",VLOOKUP(N29,_공휴일날짜,3,FALSE)<>\"\"),VLOOKUP(N29,_공휴일날짜,3,FALSE),\"\"),\"\")","v":""},null,null,"2025-07-29",{"$f":"IFERROR(IF(AND(R29<>\"\",VLOOKUP(R29,_공휴일날짜,3,FALSE)<>\"\"),VLOOKUP(R29,_공휴일날짜,3,FALSE),\"\"),\"\")","v":""},null,null,"2025-07-30",{"$f":"IFERROR(IF(AND(V29<>\"\",VLOOKUP(V29,_공휴일날짜,3,FALSE)<>\"\"),VLOOKUP(V29,_공휴일날짜,3,FALSE),\"\"),\"\")","v":""},null,null,"2025-07-31",{"$f":"IFERROR(IF(AND(Z29<>\"\",VLOOKUP(Z29,_공휴일날짜,3,FALSE)<>\"\"),VLOOKUP(Z29,_공휴일날짜,3,FALSE),\"\"),\"\")","v":""},null,null,null,{"$f":"IFERROR(IF(AND(AD29<>\"\",VLOOKUP(AD29,_공휴일날짜,3,FALSE)<>\"\"),VLOOKUP(AD29,_공휴일날짜,3,FALSE),\"\"),\"\")","v":""},null,null,null,{"$f":"IFERROR(IF(AND(AH29<>\"\",VLOOKUP(AH29,_공휴일날짜,3,FALSE)<>\"\"),VLOOKUP(AH29,_공휴일날짜,3,FALSE),\"\"),\"\")","v":""}]
[null,{"$f":"VLOOKUP($E$30,_월별표기,2)","v":"August"},null,null,8]
[null,"일","월","화","수","목","금","토"]
[null,null,null,null,null,null,"2025-08-01","2025-08-02"]
[null,"2025-08-03","2025-08-04","2025-08-05","2025-08-06","2025-08-07","2025-08-08","2025-08-09"]
[null,"2025-08-10","2025-08-11","2025-08-12","2025-08-13","2025-08-14","2025-08-15","2025-08-16"]
[null,"2025-08-17","2025-08-18","2025-08-19","2025-08-20","2025-08-21","2025-08-22","2025-08-23",null,null,{"$f":"IFERROR(IF(AND(J35<>\"\",VLOOKUP(J35,_공휴일날짜,3,FALSE)<>\"\"),VLOOKUP(J35,_공휴일날짜,3,FALSE),\"\"),\"\")","v":""},null,null,null,{"$f":"IFERROR(IF(AND(N35<>\"\",VLOOKUP(N35,_공휴일날짜,3,FALSE)<>\"\"),VLOOKUP(N35,_공휴일날짜,3,FALSE),\"\"),\"\")","v":""}]
[null,"2025-08-24","2025-08-25","2025-08-26","2025-08-27","2025-08-28","2025-08-29","2025-08-30"]
[null,"2025-08-31"]

{"sheet":"8월","index":7,"n_rows":36,"n_cols":41,"rows_kept":36,"cut":false,"hidden":false,"merged":[[5,41,5,45],[2,33,3,36],[4,9,5,9],[4,10,4,12],[4,13,5,13],[4,14,4,16],[4,17,5,17],[4,18,4,20],[4,21,5,21],[4,22,4,24],[4,25,5,25],[2,9,3,12],[2,13,3,16],[2,17,3,20],[2,21,3,24],[2,25,3,28],[2,29,3,32],[5,10,5,12],[5,14,5,16],[5,18,5,20],[5,22,5,24],[5,26,5,28],[5,30,5,32],[4,26,4,28],[4,29,5,29],[4,30,4,32],[6,33,6,36],[6,41,6,45],[7,9,7,12],[7,13,7,16],[7,17,7,20],[7,21,7,24],[7,25,7,28],[7,29,7,32],[7,33,7,36],[7,41,7,45],[6,9,6,12],[6,13,6,16],[6,17,6,20],[6,21,6,24],[6,25,6,28],[6,29,6,32],[4,33,5,33],[4,34,4,36],[4,41,4,45],[5,34,5,36],[10,9,11,9],[10,10,10,12],[10,13,11,13],[10,14,10,16],[10,17,11,17],[10,18,10,20],[8,33,8,36],[8,41,8,45],[9,9,9,12],[9,13,9,16],[9,17,9,20],[9,21,9,24],[9,25,9,28],[9,29,9,32],[9,33,9,36],[9,41,9,45],[8,9,8,12],[8,13,8,16],[8,17,8,20],[8,21,8,24],[8,25,8,28],[8,29,8,32],[11,41,11,45],[12,9,12,12],[12,13,12,16],[12,17,12,20],[12,21,12,24],[12,25,12,28],[12,29,12,32],[12,33,12,36],[12,41,12,45],[10,33,11,33],[10,34,10,36],[10,41,10,45],[11,10,11,12],[11,14,11,16],[11,18,11,20],[11,22,11,24],[11,26,11,28],[11,30,11,32],[11,34,11,36],[10,21,11,21],[10,22,10,24],[10,25,11,25],[10,26,10,28],[10,29,11,29],[10,30,10,32],[13,33,13,36],[13,41,13,45],[14,9,14,12],[14,13,14,16],[14,17,14,20],[14,21,14,24],[14,25,14,28],[14,29,14,32],[14,33,14,36],[14,41,14,45],[13,9,13,12],[13,13,13,16],[13,17,13,20],[13,21,13,24],[13,25,13,28],[13,29,13,32],[15,41,15,45],[16,9,17,9],[16,10,16,12],[16,13,17,13],[16,14,16,16],[16,17,17,17],[16,18,16,20],[16,21,17,21],[16,22,16,24],[15,9,15,12],[15,13,15,16],[15,17,15,20],[15,21,15,24],[15,25,15,28],[15,29,15,32],[16,41,16,45],[17,30,17,32],[17,34,17,36],[16,25,17,25],[16,26,16,28],[16,29,17,29],[16,30,16,32],[16,33,17,33],[16,34,16,36],[15,33,15,36],[19,1,19,3],[19,9,19,12],[19,13,19,16],[19,17,19,20],[19,21,19,24],[19,25,19,28],[17,40,17,45],[18,9,18,12],[18,13,18,16],[18,17,18,20],[18,21,18,24],[18,25,18,28],[18,29,18,32],[18,33,18,36],[19,29,19,32],[19,33,19,36],[19,40,19,45],[17,1,17,2],[17,4,17,7],[17,10,17,12],[17,14,17,16],[17,18,17,20],[17,22,17,24],[17,26,17,28],[20,9,20,12],[20,13,20,16],[20,17,20,20],[20,21,20,24],[20,25,20,28],[20,29,20,32],[20,33,20,36],[20,40,20,41],[20,42,20,45],[21,9,21,12],[21,13,21,16],[21,17,21,20],[21,21,21,24],[21,25,21,28],[21,29,21,32],[21,33,21,36],[21,40,21,41],[21,42,21,45],[22,9,23,9],[22,10,22,12],[22,13,23,13],[22,14,22,16],[22,17,23,17],[22,18,22,20],[22,21,23,21],[22,22,22,24],[22,25,23,25],[22,42,22,45],[23,10,23,12],[23,14,23,16],[23,18,23,20],[23,22,23,24],[23,26,23,28],[23,30,23,32],[23,34,23,36],[23,40,23,41],[23,42,23,45],[22,26,22,28],[22,29,23,29],[22,30,22,32],[22,33,23,33],[22,34,22,36],[22,40,22,41],[24,33,24,36],[24,40,24,41],[24,42,24,45],[25,9,25,12],[25,13,25,16],[25,17,25,20],[25,21,25,24],[25,25,25,28],[25,29,25,32],[25,33,25,36],[24,9,24,12],[24,13,24,16],[24,17,24,20],[24,21,24,24],[24,25,24,28],[24,29,24,32],[25,40,25,41],[25,42,25,45],[26,9,26,12],[26,13,26,16],[26,17,26,20],[26,21,26,24],[26,25,26,28],[26,29,26,32],[26,33,26,36],[26,40,26,41],[26,42,26,45],[27,9,27,12],[27,13,27,16],[27,17,27,20],[27,21,27,24],[27,25,27,28],[27,29,27,32],[27,33,27,36],[27,40,27,45],[29,1,29,3],[29,10,29,12],[29,14,29,16],[29,18,29,20],[29,22,29,24],[29,26,29,28],[29,30,29,32],[28,21,29,21],[28,22,28,24],[28,25,29,25],[28,26,28,28],[28,29,29,29],[28,30,28,32],[28,9,29,9],[28,10,28,12],[28,13,29,13],[28,14,28,16],[28,17,29,17],[28,18,28,20],[29,34,29,36],[29,40,29,45],[30,9,30,12],[30,13,30,16],[30,17,30,20],[30,21,30,24],[30,25,30,28],[30,29,30,32],[30,33,30,36],[30,40,30,45],[28,33,29,33],[28,34,28,36],[28,40,28,45],[31,33,31,36],[31,40,31,45],[32,9,32,12],[32,13,32,16],[32,17,32,20],[32,21,32,24],[32,25,32,28],[32,29,32,32],[32,33,32,36],[32,40,32,45],[31,9,31,12],[31,13,31,16],[31,17,31,20],[31,21,31,24],[31,25,31,28],[31,29,31,32],[33,33,33,36],[33,40,33,45],[34,9,35,9],[34,10,34,12],[34,13,35,13],[34,14,34,16],[34,40,34,45],[35,10,35,12],[35,14,35,16],[35,40,35,45],[33,9,33,12],[33,13,33,16],[33,17,33,20],[33,21,33,24],[33,25,33,28],[33,29,33,32],[36,9,36,12],[36,13,36,16],[36,21,36,28],[36,29,36,36],[36,40,36,45],[37,9,37,12],[37,13,37,16],[37,21,37,28],[37,29,37,36],[37,40,37,45],[38,9,38,12],[38,13,38,16],[38,21,38,28],[38,29,38,36],[38,40,38,45],[39,9,39,12],[39,13,39,16],[39,21,39,28],[39,29,39,36]]}
["v1.01"]
[]
[null,null,null,null,null,null,null,null,null,"일 Sunday",null,null,null,"월 Monday",null,null,null,"화 Tuesday",null,null,null,"수 Wednesday",null,null,null,"목 Thursday",null,null,null,"금 Friday",null,null,null,"토 Saturday"]
[]
[null,null,null,null,null,null,null,null,null,null,{"$f":"IFERROR(IF(AND(J5<>\"\",VLOOKUP(J5,_공휴일날짜,3,FALSE)<>\"\"),VLOOKUP(J5,_공휴일날짜,3,FALSE),\"\"),\"\")","v":""},null,null,null,{"$f":"IFERROR(IF(AND(N5<>\"\",VLOOKUP(N5,_공휴일날짜,3,FALSE)<>\"\"),VLOOKUP(N5,_공휴일날짜,3,FALSE),\"\"),\"\")","v":""},null,null,null,{"$f":"IFERROR(IF(AND(R5<>\"\",VLOOKUP(R5,_공휴일날짜,3,FALSE)<>\"\"),VLOOKUP(R5,_공휴일날짜,3,FALSE),\"\"),\"\")","v":""},null,null,null,{"$f":"IFERROR(IF(AND(V5<>\"\",VLOOKUP(V5,_공휴일날짜,3,FALSE)<>\"\"),VLOOKUP(V5,_공휴일날짜,3,FALSE),\"\"),\"\")","v":""},null,null,null,{"$f":"IFERROR(IF(AND(Z5<>\"\",VLOOKUP(Z5,_공휴일날짜,3,FALSE)<>\"\"),VLOOKUP(Z5,_공휴일날짜,3,FALSE),\"\"),\"\")","v":""},null,null,"2025-08-01",{"$f":"IFERROR(IF(AND(AD5<>\"\",VLOOKUP(AD5,_공휴일날짜,3,FALSE)<>\"\"),VLOOKUP(AD5,_공휴일날짜,3,FALSE),\"\"),\"\")","v":""},null,null,"2025-08-02",{"$f":"IFERROR(IF(AND(AH5<>\"\",VLOOKUP(AH5,_공휴일날짜,3,FALSE)<>\"\"),VLOOKUP(AH5,_공휴일날짜,3,FALSE),\"\"),\"\")","v":""},null,null,null,null,null,false]
[null,null,null,{"$f":"'달력 설정'!B6","v":2025},8,{"$f":"VLOOKUP($E$6,_월별표기,2)","v":"August"},null,null,null,null,null,null,null,null,null,null,null,null,null,null,null,null,null,null,null,null,null,null,null,null,null,null,null,null,null,null,null,null,null,null,false]
[null,null,null,null,null,null,null,null,null,null,null,null,null,null,null,null,null,null,null,null,null,null,null,null,null,null,null,null,null,null,null,null,null,null,null,null,null,null,null,null,false]
[null,1,null,null,null,null,null,null,null,null,null,null,null,null,null,null,null,null,null,null,null,null,null,null,null,null,null,null,null,null,null,null,null,null,null,null,null,null,null,null,false]
[null,null,null,null,null,null,null,null,null,null,null,null,null,null,null,null,null,null,null,null,null,null,null,null,null,null,null,null,null,null,null,null,null,null,null,null,null,null,null,null,false]
[null,null,null,null,null,null,null,null,null,null,null,null,null,null,null,null,null,null,null,null,null,null,null,null,null,null,null,null,null,null,null,null,null,null,null,null,null,null,null,null,false]
[null,null,null,null,null,null,null,null,null,"2025-08-03",{"$f":"IFERROR(IF(AND(J11<>\"\",VLOOKUP(J11,_공휴일날짜,3,FALSE)<>\"\"),VLOOKUP(J11,_공휴일날짜,3,FALSE),\"\"),\"\")","v":""},null,null,"2025-08-04",{"$f":"IFERROR(IF(AND(N11<>\"\",VLOOKUP(N11,_공휴일날짜,3,FALSE)<>\"\"),VLOOKUP(N11,_공휴일날짜,3,FALSE),\"\"),\"\")","v":""},null,null,"2025-08-05",{"$f":"IFERROR(IF(AND(R11<>\"\",VLOOKUP(R11,_공휴일날짜,3,FALSE)<>\"\"),VLOOKUP(R11,_공휴일날짜,3,FALSE),\"\"),\"\")","v":""},null,null,"2025-08-06",{"$f":"IFERROR(IF(AND(V11<>\"\",VLOOKUP(V11,_공휴일날짜,3,FALSE)<>\"\"),VLOOKUP(V11,_공휴일날짜,3,FALSE),\"\"),\"\")","v":""},null,null,"2025-08-07",{"$f":"IFERROR(IF(AND(Z11<>\"\",VLOOKUP(Z11,_공휴일날짜,3,FALSE)<>\"\"),VLOOKUP(Z11,_공휴일날짜,3,FALSE),\"\"),\"\")","v":""},null,null,"2025-08-08",{"$f":"IFERROR(IF(AND(AD11<>\"\",VLOOKUP(AD11,_공휴일날짜,3,FALSE)<>\"\"),VLOOKUP(AD11,_공휴일날짜,3,FALSE),\"\"),\"\")","v":""},null,null,"2025-08-09",{"$f":"IFERROR(IF(AND(AH11<>\"\",VLOOKUP(AH11,_공휴일날짜,3,FALSE)<>\"\"),VLOOKUP(AH11,_공휴일날짜,3,FALSE),\"\"),\"\")","v":""},null,null,null,null,null,false]
[null,null,null,null,null,null,null,null,null,null,null,null,null,null,null,null,null,null,null,null,null,null,null,null,null,null,null,null,null,null,null,null,null,null,null,null,null,null,null,null,false]
[null,null,null,null,null,null,null,null,null,null,null,null,null,null,null,null,null,null,null,null,null,null,null,null,null,null,null,null,null,null,null,null,null,null,null,null,null,null,null,null,false]
[null,null,null,null,null,null,null,null,null,null,null,null,null,null,null,null,null,null,null,null,null,null,null,null,null,null,null,null,null,null,null,null,null,null,null,null,null,null,null,null,false]
[null,null,null,null,null,null,null,null,null,null,null,null,null,null,null,null,null,null,null,null,null,null,null,null,null,null,null,null,null,null,null,null,null,null,null,null,null,null,null,null,false]
[null,null,null,{"$f":"YEAR(TODAY())","v":2025},{"$f":"MONTH(TODAY())","v":2},{"$f":"DAY(TODAY())","v":24},null,null,null,null,null,null,null,null,null,null,null,null,null,null,null,null,null,null,null,null,null,null,null,null,null,null,null,null,null,null,null,null,null,null,false]
[null,null,null,null,null,null,null,null,null,"2025-08-10",{"$f":"IFERROR(IF(AND(J17<>\"\",VLOOKUP(J17,_공휴일날짜,3,FALSE)<>\"\"),VLOOKUP(J17,_공휴일날짜,3,FALSE),\"\"),\"\")","v":""},null,null,"2025-08-11",{"$f":"IFERROR(IF(AND(N17<>\"\",VLOOKUP(N17,_공휴일날짜,3,FALSE)<>\"\"),VLOOKUP(N17,_공휴일날짜,3,FALSE),\"\"),\"\")","v":""},null,null,"2025-08-12",{"$f":"IFERROR(IF(AND(R17<>\"\",VLOOKUP(R17,_공휴일날짜,3,FALSE)<>\"\"),VLOOKUP(R17,_공휴일날짜,3,FALSE),\"\"),\"\")","v":""},null,null,"2025-08-13",{"$f":"IFERROR(IF(AND(V17<>\"\",VLOOKUP(V17,_공휴일날짜,3,FALSE)<>\"\"),VLOOKUP(V17,_공휴일날짜,3,FALSE),\"\"),\"\")","v":""},null,null,"2025-08-14",{"$f":"IFERROR(IF(AND(Z17<>\"\",VLOOKUP(Z17,_공휴일날짜,3,FALSE)<>\"\"),VLOOKUP(Z17,_공휴일날짜,3,FALSE),\"\"),\"\")","v":""},null,null,"2025-08-15",{"$f":"IFERROR(IF(AND(AD17<>\"\",VLOOKUP(AD17,_공휴일날짜,3,FALSE)<>\"\"),VLOOKUP(AD17,_공휴일날짜,3,FALSE),\"\"),\"\")","v":"광복절"},null,null,"2025-08-16",{"$f":"IFERROR(IF(AND(AH17<>\"\",VLOOKUP(AH17,_공휴일날짜,3,FALSE)<>\"\"),VLOOKUP(AH17,_공휴일날짜,3,FALSE),\"\"),\"\")","v":""}]
[]
[]
[null,{"$f":"VLOOKUP($E$20,_월별표기,2)","v":"July"},null,null,7]
[null,"일","월","화","수","목","금","토"]
[null,null,null,"2025-07-01","2025-07-02","2025-07-03","2025-07-04","2025-07-05"]
[null,"2025-07-06","2025-07-07","2025-07-08","2025-07-09","2025-07-10","2025-07-11","2025-07-12",null,"2025-08-17",{"$f":"IFERROR(IF(AND(J23<>\"\",VLOOKUP(J23,_공휴일날짜,3,FALSE)<>\"\"),VLOOKUP(J23,_공휴일날짜,3,FALSE),\"\"),\"\")","v":""},null,null,"2025-08-18",{"$f":"IFERROR(IF(AND(N23<>\"\",VLOOKUP(N23,_공휴일날짜,3,FALSE)<>\"\"),VLOOKUP(N23,_공휴일날짜,3,FALSE),\"\"),\"\")","v":""},null,null,"2025-08-19",{"$f":"IFERROR(IF(AND(R23<>\"\",VLOOKUP(R23,_공휴일날짜,3,FALSE)<>\"\"),VLOOKUP(R23,_공휴일날짜,3,FALSE),\"\"),\"\")","v":""},null,null,"2025-08-20",{"$f":"IFERROR(IF(AND(V23<>\"\",VLOOKUP(V23,_공휴일날짜,3,FALSE)<>\"\"),VLOOKUP(V23,_공휴일날짜,3,FALSE),\"\"),\"\")","v":""},null,null,"2025-08-21",{"$f":"IFERROR(IF(AND(Z23<>\"\",VLOOKUP(Z23,_공휴일날짜,3,FALSE)<>\"\"),VLOOKUP(Z23,_공휴일날짜,3,FALSE),\"\"),\"\")","v":""},null,null,"2025-08-22",{"$f":"IFERROR(IF(AND(AD23<>\"\",VLOOKUP(AD23,_공휴일날짜,3,FALSE)<>\"\"),VLOOKUP(AD23,_공휴일날짜,3,FALSE),\"\"),\"\")","v":""},null,null,"2025-08-23",{"$f":"IFERROR(IF(AND(AH23<>\"\",VLOOKUP(AH23,_공휴일날짜,3,FALSE)<>\"\"),VLOOKUP(AH23,_공휴일날짜,3,FALSE),\"\"),\"\")","v":""}]
[null,"2025-07-13","2025-07-14","2025-07-15","2025-07-16","2025-07-17","2025-07-18","2025-07-19"]
[null,"2025-07-20","2025-07-21","2025-07-22","2025-07-23","2025-07-24","2025-07-25","2025-07-26"]
[null,"2025-07-27","2025-07-28","2025-07-29","2025-07-30","2025-07-31"]
[]
[]
[null,null,null,null,null,null,null,null,null,"2025-08-24",{"$f":"IFERROR(IF(AND(J29<>\"\",VLOOKUP(J29,_공휴일날짜,3,FALSE)<>\"\"),VLOOKUP(J29,_공휴일날짜,3,FALSE),\"\"),\"\")","v":""},null,null,"2025-08-25",{"$f":"IFERROR(IF(AND(N29<>\"\",VLOOKUP(N29,_공휴일날짜,3,FALSE)<>\"\"),VLOOKUP(N29,_공휴일날짜,3,FALSE),\"\"),\"\")","v":""},null,null,"2025-08-26",{"$f":"IFERROR(IF(AND(R29<>\"\",VLOOKUP(R29,_공휴일날짜,3,FALSE)<>\"\"),VLOOKUP(R29,_공휴일날짜,3,FALSE),\"\"),\"\")","v":""},null,null,"2025-08-27",{"$f":"IFERROR(IF(AND(V29<>\"\",VLOOKUP(V29,_공휴일날짜,3,FALSE)<>\"\"),VLOOKUP(V29,_공휴일날짜,3,FALSE),\"\"),\"\")","v":""},null,null,"2025-08-28",{"$f":"IFERROR(IF(AND(Z29<>\"\",VLOOKUP(Z29,_공휴일날짜,3,FALSE)<>\"\"),VLOOKUP(Z29,_공휴일날짜,3,FALSE),\"\"),\"\")","v":""},null,null,"2025-08-29",{"$f":"IFERROR(IF(AND(AD29<>\"\",VLOOKUP(AD29,_공휴일날짜,3,FALSE)<>\"\"),VLOOKUP(AD29,_공휴일날짜,3,FALSE),\"\"),\"\")","v":""},null,null,"2025-08-30",{"$f":"IFERROR(IF(AND(AH29<>\"\",VLOOKUP(AH29,_공휴일날짜,3,FALSE)<>\"\"),VLOOKUP(AH29,_공휴일날짜,3,FALSE),\"\"),\"\")","v":""}]
[null,{"$f":"VLOOKUP($E$30,_월별표기,2)","v":"September"},null,null,9]
[null,"일","월","화","수","목","금","토"]
[null,null,"2025-09-01","2025-09-02","2025-09-03","2025-09-04","2025-09-05","2025-09-06"]
[null,"2025-09-07","2025-09-08","2025-09-09","2025-09-10","2025-09-11","2025-09-12","2025-09-13"]
[null,"2025-09-14","2025-09-15","2025-09-16","2025-09-17","2025-09-18","2025-09-19","2025-09-20"]
[null,"2025-09-21","2025-09-22","2025-09-23","2025-09-24","2025-09-25","2025-09-26","2025-09-27",null,"2025-08-31",{"$f":"IFERROR(IF(AND(J35<>\"\",VLOOKUP(J35,_공휴일날짜,3,FALSE)<>\"\"),VLOOKUP(J35,_공휴일날짜,3,FALSE),\"\"),\"\")","v":""},null,null,null,{"$f":"IFERROR(IF(AND(N35<>\"\",VLOOKUP(N35,_공휴일날짜,3,FALSE)<>\"\"),VLOOKUP(N35,_공휴일날짜,3,FALSE),\"\"),\"\")","v":""}]
[null,"2025-09-28","2025-09-29","2025-09-30"]

{"sheet":"9월","index":8,"n_rows":36,"n_cols":41,"rows_kept":36,"cut":false,"hidden":false,"merged":[[5,41,5,45],[2,33,3,36],[4,9,5,9],[4,10,4,12],[4,13,5,13],[4,14,4,16],[4,17,5,17],[4,18,4,20],[4,21,5,21],[4,22,4,24],[4,25,5,25],[2,9,3,12],[2,13,3,16],[2,17,3,20],[2,21,3,24],[2,25,3,28],[2,29,3,32],[5,10,5,12],[5,14,5,16],[5,18,5,20],[5,22,5,24],[5,26,5,28],[5,30,5,32],[4,26,4,28],[4,29,5,29],[4,30,4,32],[6,33,6,36],[6,41,6,45],[7,9,7,12],[7,13,7,16],[7,17,7,20],[7,21,7,24],[7,25,7,28],[7,29,7,32],[7,33,7,36],[7,41,7,45],[6,9,6,12],[6,13,6,16],[6,17,6,20],[6,21,6,24],[6,25,6,28],[6,29,6,32],[4,33,5,33],[4,34,4,36],[4,41,4,45],[5,34,5,36],[10,9,11,9],[10,10,10,12],[10,13,11,13],[10,14,10,16],[10,17,11,17],[10,18,10,20],[8,33,8,36],[8,41,8,45],[9,9,9,12],[9,13,9,16],[9,17,9,20],[9,21,9,24],[9,25,9,28],[9,29,9,32],[9,33,9,36],[9,41,9,45],[8,9,8,12],[8,13,8,16],[8,17,8,20],[8,21,8,24],[8,25,8,28],[8,29,8,32],[11,41,11,45],[12,9,12,12],[12,13,12,16],[12,17,12,20],[12,21,12,24],[12,25,12,28],[12,29,12,32],[12,33,12,36],[12,41,12,45],[10,33,11,33],[10,34,10,36],[10,41,10,45],[11,10,11,12],[11,14,11,16],[11,18,11,20],[11,22,11,24],[11,26,11,28],[11,30,11,32],[11,34,11,36],[10,21,11,21],[10,22,10,24],[10,25,11,25],[10,26,10,28],[10,29,11,29],[10,30,10,32],[13,33,13,36],[13,41,13,45],[14,9,14,12],[14,13,14,16],[14,17,14,20],[14,21,14,24],[14,25,14,28],[14,29,14,32],[14,33,14,36],[14,41,14,45],[13,9,13,12],[13,13,13,16],[13,17,13,20],[13,21,13,24],[13,25,13,28],[13,29,13,32],[15,41,15,45],[16,9,17,9],[16,10,16,12],[16,13,17,13],[16,14,16,16],[16,17,17,17],[16,18,16,20],[16,21,17,21],[16,22,16,24],[15,9,15,12],[15,13,15,16],[15,17,15,20],[15,21,15,24],[15,25,15,28],[15,29,15,32],[16,41,16,45],[17,30,17,32],[17,34,17,36],[16,25,17,25],[16,26,16,28],[16,29,17,29],[16,30,16,32],[16,33,17,33],[16,34,16,36],[15,33,15,36],[19,1,19,3],[19,9,19,12],[19,13,19,16],[19,17,19,20],[19,21,19,24],[19,25,19,28],[17,40,17,45],[18,9,18,12],[18,13,18,16],[18,17,18,20],[18,21,18,24],[18,25,18,28],[18,29,18,32],[18,33,18,36],[19,29,19,32],[19,33,19,36],[19,40,19,45],[17,1,17,2],[17,4,17,7],[17,10,17,12],[17,14,17,16],[17,18,17,20],[17,22,17,24],[17,26,17,28],[20,9,20,12],[20,13,20,16],[20,17,20,20],[20,21,20,24],[20,25,20,28],[20,29,20,32],[20,33,20,36],[20,40,20,41],[20,42,20,45],[21,9,21,12],[21,13,21,16],[21,17,21,20],[21,21,21,24],[21,25,21,28],[21,29,21,32],[21,33,21,36],[21,40,21,41],[21,42,21,45],[22,9,23,9],[22,10,22,12],[22,13,23,13],[22,14,22,16],[22,17,23,17],[22,18,22,20],[22,21,23,21],[22,22,22,24],[22,25,23,25],[22,42,22,45],[23,10,23,12],[23,14,23,16],[23,18,23,20],[23,22,23,24],[23,26,23,28],[23,30,23,32],[23,34,23,36],[23,40,23,41],[23,42,23,45],[22,26,22,28],[22,29,23,29],[22,30,22,32],[22,33,23,33],[22,34,22,36],[22,40,22,41],[24,33,24,36],[24,40,24,41],[24,42,24,45],[25,9,25,12],[25,13,25,16],[25,17,25,20],[25,21,25,24],[25,25,25,28],[25,29,25,32],[25,33,25,36],[24,9,24,12],[24,13,24,16],[24,17,24,20],[24,21,24,24],[24,25,24,28],[24,29,24,32],[25,40,25,41],[25,42,25,45],[26,9,26,12],[26,13,26,16],[26,17,26,20],[26,21,26,24],[26,25,26,28],[26,29,26,32],[26,33,26,36],[26,40,26,41],[26,42,26,45],[27,9,27,12],[27,13,27,16],[27,17,27,20],[27,21,27,24],[27,25,27,28],[27,29,27,32],[27,33,27,36],[27,40,27,45],[29,1,29,3],[29,10,29,12],[29,14,29,16],[29,18,29,20],[29,22,29,24],[29,26,29,28],[29,30,29,32],[28,21,29,21],[28,22,28,24],[28,25,29,25],[28,26,28,28],[28,29,29,29],[28,30,28,32],[28,9,29,9],[28,10,28,12],[28,13,29,13],[28,14,28,16],[28,17,29,17],[28,18,28,20],[29,34,29,36],[29,40,29,45],[30,9,30,12],[30,13,30,16],[30,17,30,20],[30,21,30,24],[30,25,30,28],[30,29,30,32],[30,33,30,36],[30,40,30,45],[28,33,29,33],[28,34,28,36],[28,40,28,45],[31,33,31,36],[31,40,31,45],[32,9,32,12],[32,13,32,16],[32,17,32,20],[32,21,32,24],[32,25,32,28],[32,29,32,32],[32,33,32,36],[32,40,32,45],[31,9,31,12],[31,13,31,16],[31,17,31,20],[31,21,31,24],[31,25,31,28],[31,29,31,32],[33,33,33,36],[33,40,33,45],[34,9,35,9],[34,10,34,12],[34,13,35,13],[34,14,34,16],[34,40,34,45],[35,10,35,12],[35,14,35,16],[35,40,35,45],[33,9,33,12],[33,13,33,16],[33,17,33,20],[33,21,33,24],[33,25,33,28],[33,29,33,32],[36,9,36,12],[36,13,36,16],[36,21,36,28],[36,29,36,36],[36,40,36,45],[37,9,37,12],[37,13,37,16],[37,21,37,28],[37,29,37,36],[37,40,37,45],[38,9,38,12],[38,13,38,16],[38,21,38,28],[38,29,38,36],[38,40,38,45],[39,9,39,12],[39,13,39,16],[39,21,39,28],[39,29,39,36]]}
["v1.01"]
[]
[null,null,null,null,null,null,null,null,null,"일 Sunday",null,null,null,"월 Monday",null,null,null,"화 Tuesday",null,null,null,"수 Wednesday",null,null,null,"목 Thursday",null,null,null,"금 Friday",null,null,null,"토 Saturday"]
[]
[null,null,null,null,null,null,null,null,null,null,{"$f":"IFERROR(IF(AND(J5<>\"\",VLOOKUP(J5,_공휴일날짜,3,FALSE)<>\"\"),VLOOKUP(J5,_공휴일날짜,3,FALSE),\"\"),\"\")","v":""},null,null,"2025-09-01",{"$f":"IFERROR(IF(AND(N5<>\"\",VLOOKUP(N5,_공휴일날짜,3,FALSE)<>\"\"),VLOOKUP(N5,_공휴일날짜,3,FALSE),\"\"),\"\")","v":""},null,null,"2025-09-02",{"$f":"IFERROR(IF(AND(R5<>\"\",VLOOKUP(R5,_공휴일날짜,3,FALSE)<>\"\"),VLOOKUP(R5,_공휴일날짜,3,FALSE),\"\"),\"\")","v":""},null,null,"2025-09-03",{"$f":"IFERROR(IF(AND(V5<>\"\",VLOOKUP(V5,_공휴일날짜,3,FALSE)<>\"\"),VLOOKUP(V5,_공휴일날짜,3,FALSE),\"\"),\"\")","v":""},null,null,"2025-09-04",{"$f":"IFERROR(IF(AND(Z5<>\"\",VLOOKUP(Z5,_공휴일날짜,3,FALSE)<>\"\"),VLOOKUP(Z5,_공휴일날짜,3,FALSE),\"\"),\"\")","v":""},null,null,"2025-09-05",{"$f":"IFERROR(IF(AND(AD5<>\"\",VLOOKUP(AD5,_공휴일날짜,3,FALSE)<>\"\"),VLOOKUP(AD5,_공휴일날짜,3,FALSE),\"\"),\"\")","v":""},null,null,"2025-09-06",{"$f":"IFERROR(IF(AND(AH5<>\"\",VLOOKUP(AH5,_공휴일날짜,3,FALSE)<>\"\"),VLOOKUP(AH5,_공휴일날짜,3,FALSE),\"\"),\"\")","v":""},null,null,null,null,null,false]
[null,null,null,{"$f":"'달력 설정'!B6","v":2025},9,{"$f":"VLOOKUP($E$6,_월별표기,2)","v":"September"},null,null,null,null,null,null,null,null,null,null,null,null,null,null,null,null,null,null,null,null,null,null,null,null,null,null,null,null,null,null,null,null,null,null,false]
[null,null,null,null,null,null,null,null,null,null,null,null,null,null,null,null,null,null,null,null,null,null,null,null,null,null,null,null,null,null,null,null,null,null,null,null,null,null,null,null,false]
[null,1,null,null,null,null,null,null,null,null,null,null,null,null,null,null,null,null,null,null,null,null,null,null,null,null,null,null,null,null,null,null,null,null,null,null,null,null,null,null,false]
[null,null,null,null,null,null,null,null,null,null,null,null,null,null,null,null,null,null,null,null,null,null,null,null,null,null,null,null,null,null,null,null,null,null,null,null,null,null,null,null,false]
[null,null,null,null,null,null,null,null,null,null,null,null,null,null,null,null,null,null,null,null,null,null,null,null,null,null,null,null,null,null,null,null,null,null,null,null,null,null,null,null,false]
[null,null,null,null,null,null,null,null,null,"2025-09-07",{"$f":"IFERROR(IF(AND(J11<>\"\",VLOOKUP(J11,_공휴일날짜,3,FALSE)<>\"\"),VLOOKUP(J11,_공휴일날짜,3,FALSE),\"\"),\"\")","v":""},null,null,"2025-09-08",{"$f":"IFERROR(IF(AND(N11<>\"\",VLOOKUP(N11,_공휴일날짜,3,FALSE)<>\"\"),VLOOKUP(N11,_공휴일날짜,3,FALSE),\"\"),\"\")","v":""},null,null,"2025-09-09",{"$f":"IFERROR(IF(AND(R11<>\"\",VLOOKUP(R11,_공휴일날짜,3,FALSE)<>\"\"),VLOOKUP(R11,_공휴일날짜,3,FALSE),\"\"),\"\")","v":""},null,null,"2025-09-10",{"$f":"IFERROR(IF(AND(V11<>\"\",VLOOKUP(V11,_공휴일날짜,3,FALSE)<>\"\"),VLOOKUP(V11,_공휴일날짜,3,FALSE),\"\"),\"\")","v":""},null,null,"2025-09-11",{"$f":"IFERROR(IF(AND(Z11<>\"\",VLOOKUP(Z11,_공휴일날짜,3,FALSE)<>\"\"),VLOOKUP(Z11,_공휴일날짜,3,FALSE),\"\"),\"\")","v":""},null,null,"2025-09-12",{"$f":"IFERROR(IF(AND(AD11<>\"\",VLOOKUP(AD11,_공휴일날짜,3,FALSE)<>\"\"),VLOOKUP(AD11,_공휴일날짜,3,FALSE),\"\"),\"\")","v":""},null,null,"2025-09-13",{"$f":"IFERROR(IF(AND(AH11<>\"\",VLOOKUP(AH11,_공휴일날짜,3,FALSE)<>\"\"),VLOOKUP(AH11,_공휴일날짜,3,FALSE),\"\"),\"\")","v":""},null,null,null,null,null,false]
[null,null,null,null,null,null,null,null,null,null,null,null,null,null,null,null,null,null,null,null,null,null,null,null,null,null,null,null,null,null,null,null,null,null,null,null,null,null,null,null,false]
[null,null,null,null,null,null,null,null,null,null,null,null,null,null,null,null,null,null,null,null,null,null,null,null,null,null,null,null,null,null,null,null,null,null,null,null,null,null,null,null,false]
[null,null,null,null,null,null,null,null,null,null,null,null,null,null,null,null,null,null,null,null,null,null,null,null,null,null,null,null,null,null,null,null,null,null,null,null,null,null,null,null,false]
[null,null,null,null,null,null,null,null,null,null,null,null,null,null,null,null,null,null,null,null,null,null,null,null,null,null,null,null,null,null,null,null,null,null,null,null,null,null,null,null,false]
[null,null,null,{"$f":"YEAR(TODAY())","v":2025},{"$f":"MONTH(TODAY())","v":2},{"$f":"DAY(TODAY())","v":24},null,null,null,null,null,null,null,null,null,null,null,null,null,null,null,null,null,null,null,null,null,null,null,null,null,null,null,null,null,null,null,null,null,null,false]
[null,null,null,null,null,null,null,null,null,"2025-09-14",{"$f":"IFERROR(IF(AND(J17<>\"\",VLOOKUP(J17,_공휴일날짜,3,FALSE)<>\"\"),VLOOKUP(J17,_공휴일날짜,3,FALSE),\"\"),\"\")","v":""},null,null,"2025-09-15",{"$f":"IFERROR(IF(AND(N17<>\"\",VLOOKUP(N17,_공휴일날짜,3,FALSE)<>\"\"),VLOOKUP(N17,_공휴일날짜,3,FALSE),\"\"),\"\")","v":""},null,null,"2025-09-16",{"$f":"IFERROR(IF(AND(R17<>\"\",VLOOKUP(R17,_공휴일날짜,3,FALSE)<>\"\"),VLOOKUP(R17,_공휴일날짜,3,FALSE),\"\"),\"\")","v":""},null,null,"2025-09-17",{"$f":"IFERROR(IF(AND(V17<>\"\",VLOOKUP(V17,_공휴일날짜,3,FALSE)<>\"\"),VLOOKUP(V17,_공휴일날짜,3,FALSE),\"\"),\"\")","v":""},null,null,"2025-09-18",{"$f":"IFERROR(IF(AND(Z17<>\"\",VLOOKUP(Z17,_공휴일날짜,3,FALSE)<>\"\"),VLOOKUP(Z17,_공휴일날짜,3,FALSE),\"\"),\"\")","v":""},null,null,"2025-09-19",{"$f":"IFERROR(IF(AND(AD17<>\"\",VLOOKUP(AD17,_공휴일날짜,3,FALSE)<>\"\"),VLOOKUP(AD17,_공휴일날짜,3,FALSE),\"\"),\"\")","v":""},null,null,"2025-09-20",{"$f":"IFERROR(IF(AND(AH17<>\"\",VLOOKUP(AH17,_공휴일날짜,3,FALSE)<>\"\"),VLOOKUP(AH17,_공휴일날짜,3,FALSE),\"\"),\"\")","v":""}]
[]
[]
[null,{"$f":"VLOOKUP($E$20,_월별표기,2)","v":"August"},null,null,8]
[null,"일","월","화","수","목","금","토"]
[null,null,null,null,null,null,"2025-08-01","2025-08-02"]
[null,"2025-08-03","2025-08-04","2025-08-05","2025-08-06","2025-08-07","2025-08-08","2025-08-09",null,"2025-09-21",{"$f":"IFERROR(IF(AND(J23<>\"\",VLOOKUP(J23,_공휴일날짜,3,FALSE)<>\"\"),VLOOKUP(J23,_공휴일날짜,3,FALSE),\"\"),\"\")","v":""},null,null,"2025-09-22",{"$f":"IFERROR(IF(AND(N23<>\"\",VLOOKUP(N23,_공휴일날짜,3,FALSE)<>\"\"),VLOOKUP(N23,_공휴일날짜,3,FALSE),\"\"),\"\")","v":""},null,null,"2025-09-23",{"$f":"IFERROR(IF(AND(R23<>\"\",VLOOKUP(R23,_공휴일날짜,3,FALSE)<>\"\"),VLOOKUP(R23,_공휴일날짜,3,FALSE),\"\"),\"\")","v":""},null,null,"2025-09-24",{"$f":"IFERROR(IF(AND(V23<>\"\",VLOOKUP(V23,_공휴일날짜,3,FALSE)<>\"\"),VLOOKUP(V23,_공휴일날짜,3,FALSE),\"\"),\"\")","v":""},null,null,"2025-09-25",{"$f":"IFERROR(IF(AND(Z23<>\"\",VLOOKUP(Z23,_공휴일날짜,3,FALSE)<>\"\"),VLOOKUP(Z23,_공휴일날짜,3,FALSE),\"\"),\"\")","v":""},null,null,"2025-09-26",{"$f":"IFERROR(IF(AND(AD23<>\"\",VLOOKUP(AD23,_공휴일날짜,3,FALSE)<>\"\"),VLOOKUP(AD23,_공휴일날짜,3,FALSE),\"\"),\"\")","v":""},null,null,"2025-09-27",{"$f":"IFERROR(IF(AND(AH23<>\"\",VLOOKUP(AH23,_공휴일날짜,3,FALSE)<>\"\"),VLOOKUP(AH23,_공휴일날짜,3,FALSE),\"\"),\"\")","v":""}]
[null,"2025-08-10","2025-08-11","2025-08-12","2025-08-13","2025-08-14","2025-08-15","2025-08-16"]
[null,"2025-08-17","2025-08-18","2025-08-19","2025-08-20","2025-08-21","2025-08-22","2025-08-23"]
[null,"2025-08-24","2025-08-25","2025-08-26","2025-08-27","2025-08-28","2025-08-29","2025-08-30"]
[null,"2025-08-31"]
[]
[null,null,null,null,null,null,null,null,null,"2025-09-28",{"$f":"IFERROR(IF(AND(J29<>\"\",VLOOKUP(J29,_공휴일날짜,3,FALSE)<>\"\"),VLOOKUP(J29,_공휴일날짜,3,FALSE),\"\"),\"\")","v":""},null,null,"2025-09-29",{"$f":"IFERROR(IF(AND(N29<>\"\",VLOOKUP(N29,_공휴일날짜,3,FALSE)<>\"\"),VLOOKUP(N29,_공휴일날짜,3,FALSE),\"\"),\"\")","v":""},null,null,"2025-09-30",{"$f":"IFERROR(IF(AND(R29<>\"\",VLOOKUP(R29,_공휴일날짜,3,FALSE)<>\"\"),VLOOKUP(R29,_공휴일날짜,3,FALSE),\"\"),\"\")","v":""},null,null,null,{"$f":"IFERROR(IF(AND(V29<>\"\",VLOOKUP(V29,_공휴일날짜,3,FALSE)<>\"\"),VLOOKUP(V29,_공휴일날짜,3,FALSE),\"\"),\"\")","v":""},null,null,null,{"$f":"IFERROR(IF(AND(Z29<>\"\",VLOOKUP(Z29,_공휴일날짜,3,FALSE)<>\"\"),VLOOKUP(Z29,_공휴일날짜,3,FALSE),\"\"),\"\")","v":""},null,null,null,{"$f":"IFERROR(IF(AND(AD29<>\"\",VLOOKUP(AD29,_공휴일날짜,3,FALSE)<>\"\"),VLOOKUP(AD29,_공휴일날짜,3,FALSE),\"\"),\"\")","v":""},null,null,null,{"$f":"IFERROR(IF(AND(AH29<>\"\",VLOOKUP(AH29,_공휴일날짜,3,FALSE)<>\"\"),VLOOKUP(AH29,_공휴일날짜,3,FALSE),\"\"),\"\")","v":""}]
[null,{"$f":"VLOOKUP($E$30,_월별표기,2)","v":"October"},null,null,10]
[null,"일","월","화","수","목","금","토"]
[null,null,null,null,"2025-10-01","2025-10-02","2025-10-03","2025-10-04"]
[null,"2025-10-05","2025-10-06","2025-10-07","2025-10-08","2025-10-09","2025-10-10","2025-10-11"]
[null,"2025-10-12","2025-10-13","2025-10-14","2025-10-15","2025-10-16","2025-10-17","2025-10-18"]
[null,"2025-10-19","2025-10-20","2025-10-21","2025-10-22","2025-10-23","2025-10-24","2025-10-25",null,null,{"$f":"IFERROR(IF(AND(J35<>\"\",VLOOKUP(J35,_공휴일날짜,3,FALSE)<>\"\"),VLOOKUP(J35,_공휴일날짜,3,FALSE),\"\"),\"\")","v":""},null,null,null,{"$f":"IFERROR(IF(AND(N35<>\"\",VLOOKUP(N35,_공휴일날짜,3,FALSE)<>\"\"),VLOOKUP(N35,_공휴일날짜,3,FALSE),\"\"),\"\")","v":""}]
[null,"2025-10-26","2025-10-27","2025-10-28","2025-10-29","2025-10-30","2025-10-31"]

{"sheet":"10월","index":9,"n_rows":37,"n_cols":41,"rows_kept":37,"cut":false,"hidden":false,"merged":[[5,41,5,45],[2,33,3,36],[4,9,5,9],[4,10,4,12],[4,13,5,13],[4,14,4,16],[4,17,5,17],[4,18,4,20],[4,21,5,21],[4,22,4,24],[4,25,5,25],[2,9,3,12],[2,13,3,16],[2,17,3,20],[2,21,3,24],[2,25,3,28],[2,29,3,32],[5,10,5,12],[5,14,5,16],[5,18,5,20],[5,22,5,24],[5,26,5,28],[5,30,5,32],[4,26,4,28],[4,29,5,29],[4,30,4,32],[6,33,6,36],[6,41,6,45],[7,9,7,12],[7,13,7,16],[7,17,7,20],[7,21,7,24],[7,25,7,28],[7,29,7,32],[7,33,7,36],[7,41,7,45],[6,9,6,12],[6,13,6,16],[6,17,6,20],[6,21,6,24],[6,25,6,28],[6,29,6,32],[4,33,5,33],[4,34,4,36],[4,41,4,45],[5,34,5,36],[10,9,11,9],[10,10,10,12],[10,13,11,13],[10,14,10,16],[10,17,11,17],[10,18,10,20],[8,33,8,36],[8,41,8,45],[9,9,9,12],[9,13,9,16],[9,17,9,20],[9,21,9,24],[9,25,9,28],[9,29,9,32],[9,33,9,36],[9,41,9,45],[8,9,8,12],[8,13,8,16],[8,17,8,20],[8,21,8,24],[8,25,8,28],[8,29,8,32],[11,41,11,45],[12,9,12,12],[12,13,12,16],[12,17,12,20],[12,21,12,24],[12,25,12,28],[12,29,12,32],[12,33,12,36],[12,41,12,45],[10,33,11,33],[10,34,10,36],[10,41,10,45],[11,10,11,12],[11,14,11,16],[11,18,11,20],[11,22,11,24],[11,26,11,28],[11,30,11,32],[11,34,11,36],[10,21,11,21],[10,22,10,24],[10,25,11,25],[10,26,10,28],[10,29,11,29],[10,30,10,32],[13,33,13,36],[13,41,13,45],[14,9,14,12],[14,13,14,16],[14,17,14,20],[14,21,14,24],[14,25,14,28],[14,29,14,32],[14,33,14,36],[14,41,14,45],[13,9,13,12],[13,13,13,16],[13,17,13,20],[13,21,13,24],[13,25,13,28],[13,29,13,32],[15,41,15,45],[16,9,17,9],[16,10,16,12],[16,13,17,13],[16,14,16,16],[16,17,17,17],[16,18,16,20],[16,21,17,21],[16,22,16,24],[15,9,15,12],[15,13,15,16],[15,17,15,20],[15,21,15,24],[15,25,15,28],[15,29,15,32],[16,41,16,45],[17,30,17,32],[17,34,17,36],[16,25,17,25],[16,26,16,28],[16,29,17,29],[16,30,16,32],[16,33,17,33],[16,34,16,36],[15,33,15,36],[19,1,19,3],[19,9,19,12],[19,13,19,16],[19,17,19,20],[19,21,19,24],[19,25,19,28],[17,40,17,45],[18,9,18,12],[18,13,18,16],[18,17,18,20],[18,21,18,24],[18,25,18,28],[18,29,18,32],[18,33,18,36],[19,29,19,32],[19,33,19,36],[19,40,19,45],[17,1,17,2],[17,4,17,7],[17,10,17,12],[17,14,17,16],[17,18,17,20],[17,22,17,24],[17,26,17,28],[20,9,20,12],[20,13,20,16],[20,17,20,20],[20,21,20,24],[20,25,20,28],[20,29,20,32],[20,33,20,36],[20,40,20,41],[20,42,20,45],[21,9,21,12],[21,13,21,16],[21,17,21,20],[21,21,21,24],[21,25,21,28],[21,29,21,32],[21,33,21,36],[21,40,21,41],[21,42,21,45],[22,9,23,9],[22,10,22,12],[22,13,23,13],[22,14,22,16],[22,17,23,17],[22,18,22,20],[22,21,23,21],[22,22,22,24],[22,25,23,25],[22,42,22,45],[23,10,23,12],[23,14,23,16],[23,18,23,20],[23,22,23,24],[23,26,23,28],[23,30,23,32],[23,34,23,36],[23,40,23,41],[23,42,23,45],[22,26,22,28],[22,29,23,29],[22,30,22,32],[22,33,23,33],[22,34,22,36],[22,40,22,41],[24,33,24,36],[24,40,24,41],[24,42,24,45],[25,9,25,12],[25,13,25,16],[25,17,25,20],[25,21,25,24],[25,25,25,28],[25,29,25,32],[25,33,25,36],[24,9,24,12],[24,13,24,16],[24,17,24,20],[24,21,24,24],[24,25,24,28],[24,29,24,32],[25,40,25,41],[25,42,25,45],[26,9,26,12],[26,13,26,16],[26,17,26,20],[26,21,26,24],[26,25,26,28],[26,29,26,32],[26,33,26,36],[26,40,26,41],[26,42,26,45],[27,9,27,12],[27,13,27,16],[27,17,27,20],[27,21,27,24],[27,25,27,28],[27,29,27,32],[27,33,27,36],[27,40,27,45],[29,1,29,3],[29,10,29,12],[29,14,29,16],[29,18,29,20],[29,22,29,24],[29,26,29,28],[29,30,29,32],[28,21,29,21],[28,22,28,24],[28,25,29,25],[28,26,28,28],[28,29,29,29],[28,30,28,32],[28,9,29,9],[28,10,28,12],[28,13,29,13],[28,14,28,16],[28,17,29,17],[28,18,28,20],[29,34,29,36],[29,40,29,45],[30,9,30,12],[30,13,30,16],[30,17,30,20],[30,21,30,24],[30,25,30,28],[30,29,30,32],[30,33,30,36],[30,40,30,45],[28,33,29,33],[28,34,28,36],[28,40,28,45],[31,33,31,36],[31,40,31,45],[32,9,32,12],[32,13,32,16],[32,17,32,20],[32,21,32,24],[32,25,32,28],[32,29,32,32],[32,33,32,36],[32,40,32,45],[31,9,31,12],[31,13,31,16],[31,17,31,20],[31,21,31,24],[31,25,31,28],[31,29,31,32],[33,33,33,36],[33,40,33,45],[34,9,35,9],[34,10,34,12],[34,13,35,13],[34,14,34,16],[34,40,34,45],[35,10,35,12],[35,14,35,16],[35,40,35,45],[33,9,33,12],[33,13,33,16],[33,17,33,20],[33,21,33,24],[33,25,33,28],[33,29,33,32],[36,9,36,12],[36,13,36,16],[36,21,36,28],[36,29,36,36],[36,40,36,45],[37,9,37,12],[37,13,37,16],[37,21,37,28],[37,29,37,36],[37,40,37,45],[38,9,38,12],[38,13,38,16],[38,21,38,28],[38,29,38,36],[38,40,38,45],[39,9,39,12],[39,13,39,16],[39,21,39,28],[39,29,39,36]]}
["v1.01"]
[]
[null,null,null,null,null,null,null,null,null,"일 Sunday",null,null,null,"월 Monday",null,null,null,"화 Tuesday",null,null,null,"수 Wednesday",null,null,null,"목 Thursday",null,null,null,"금 Friday",null,null,null,"토 Saturday"]
[]
[null,null,null,null,null,null,null,null,null,null,{"$f":"IFERROR(IF(AND(J5<>\"\",VLOOKUP(J5,_공휴일날짜,3,FALSE)<>\"\"),VLOOKUP(J5,_공휴일날짜,3,FALSE),\"\"),\"\")","v":""},null,null,null,{"$f":"IFERROR(IF(AND(N5<>\"\",VLOOKUP(N5,_공휴일날짜,3,FALSE)<>\"\"),VLOOKUP(N5,_공휴일날짜,3,FALSE),\"\"),\"\")","v":""},null,null,null,{"$f":"IFERROR(IF(AND(R5<>\"\",VLOOKUP(R5,_공휴일날짜,3,FALSE)<>\"\"),VLOOKUP(R5,_공휴일날짜,3,FALSE),\"\"),\"\")","v":""},null,null,"2025-10-01",{"$f":"IFERROR(IF(AND(V5<>\"\",VLOOKUP(V5,_공휴일날짜,3,FALSE)<>\"\"),VLOOKUP(V5,_공휴일날짜,3,FALSE),\"\"),\"\")","v":""},null,null,"2025-10-02",{"$f":"IFERROR(IF(AND(Z5<>\"\",VLOOKUP(Z5,_공휴일날짜,3,FALSE)<>\"\"),VLOOKUP(Z5,_공휴일날짜,3,FALSE),\"\"),\"\")","v":""},null,null,"2025-10-03",{"$f":"IFERROR(IF(AND(AD5<>\"\",VLOOKUP(AD5,_공휴일날짜,3,FALSE)<>\"\"),VLOOKUP(AD5,_공휴일날짜,3,FALSE),\"\"),\"\")","v":"개천절"},null,null,"2025-10-04",{"$f":"IFERROR(IF(AND(AH5<>\"\",VLOOKUP(AH5,_공휴일날짜,3,FALSE)<>\"\"),VLOOKUP(AH5,_공휴일날짜,3,FALSE),\"\"),\"\")","v":""},null,null,null,null,null,false]
[null,null,null,{"$f":"'달력 설정'!B6","v":2025},10,{"$f":"VLOOKUP($E$6,_월별표기,2)","v":"October"},null,null,null,null,null,null,null,null,null,null,null,null,null,null,null,null,null,null,null,null,null,null,null,null,null,null,null,null,null,null,null,null,null,null,false]
[null,null,null,null,null,null,null,null,null,null,null,null,null,null,null,null,null,null,null,null,null,null,null,null,null,null,null,null,null,null,null,null,null,null,null,null,null,null,null,null,false]
[null,1,null,null,null,null,null,null,null,null,null,null,null,null,null,null,null,null,null,null,null,null,null,null,null,null,null,null,null,null,null,null,null,null,null,null,null,null,null,null,false]
[null,null,null,null,null,null,null,null,null,null,null,null,null,null,null,null,null,null,null,null,null,null,null,null,null,null,null,null,null,null,null,null,null,null,null,null,null,null,null,null,false]
[null,null,null,null,null,null,null,null,null,null,null,null,null,null,null,null,null,null,null,null,null,null,null,null,null,null,null,null,null,null,null,null,null,null,null,null,null,null,null,null,false]
[null,null,null,null,null,null,null,null,null,"2025-10-05",{"$f":"IFERROR(IF(AND(J11<>\"\",VLOOKUP(J11,_공휴일날짜,3,FALSE)<>\"\"),VLOOKUP(J11,_공휴일날짜,3,FALSE),\"\"),\"\")","v":""},null,null,"2025-10-06",{"$f":"IFERROR(IF(AND(N11<>\"\",VLOOKUP(N11,_공휴일날짜,3,FALSE)<>\"\"),VLOOKUP(N11,_공휴일날짜,3,FALSE),\"\"),\"\")","v":"추석"},null,null,"2025-10-07",{"$f":"IFERROR(IF(AND(R11<>\"\",VLOOKUP(R11,_공휴일날짜,3,FALSE)<>\"\"),VLOOKUP(R11,_공휴일날짜,3,FALSE),\"\"),\"\")","v":""},null,null,"2025-10-08",{"$f":"IFERROR(IF(AND(V11<>\"\",VLOOKUP(V11,_공휴일날짜,3,FALSE)<>\"\"),VLOOKUP(V11,_공휴일날짜,3,FALSE),\"\"),\"\")","v":"대체 휴일"},null,null,"2025-10-09",{"$f":"IFERROR(IF(AND(Z11<>\"\",VLOOKUP(Z11,_공휴일날짜,3,FALSE)<>\"\"),VLOOKUP(Z11,_공휴일날짜,3,FALSE),\"\"),\"\")","v":"한글날"},null,null,"2025-10-10",{"$f":"IFERROR(IF(AND(AD11<>\"\",VLOOKUP(AD11,_공휴일날짜,3,FALSE)<>\"\"),VLOOKUP(AD11,_공휴일날짜,3,FALSE),\"\"),\"\")","v":""},null,null,"2025-10-11",{"$f":"IFERROR(IF(AND(AH11<>\"\",VLOOKUP(AH11,_공휴일날짜,3,FALSE)<>\"\"),VLOOKUP(AH11,_공휴일날짜,3,FALSE),\"\"),\"\")","v":""},null,null,null,null,null,false]
[null,null,null,null,null,null,null,null,null,null,null,null,null,null,null,null,null,null,null,null,null,null,null,null,null,null,null,null,null,null,null,null,null,null,null,null,null,null,null,null,false]
[null,null,null,null,null,null,null,null,null,null,null,null,null,null,null,null,null,null,null,null,null,null,null,null,null,null,null,null,null,null,null,null,null,null,null,null,null,null,null,null,false]
[null,null,null,null,null,null,null,null,null,null,null,null,null,null,null,null,null,null,null,null,null,null,null,null,null,null,null,null,null,null,null,null,null,null,null,null,null,null,null,null,false]
[null,null,null,null,null,null,null,null,null,null,null,null,null,null,null,null,null,null,null,null,null,null,null,null,null,null,null,null,null,null,null,null,null,null,null,null,null,null,null,null,false]
[null,null,null,{"$f":"YEAR(TODAY())","v":2025},{"$f":"MONTH(TODAY())","v":2},{"$f":"DAY(TODAY())","v":24},null,null,null,null,null,null,null,null,null,null,null,null,null,null,null,null,null,null,null,null,null,null,null,null,null,null,null,null,null,null,null,null,null,null,false]
[null,null,null,null,null,null,null,null,null,"2025-10-12",{"$f":"IFERROR(IF(AND(J17<>\"\",VLOOKUP(J17,_공휴일날짜,3,FALSE)<>\"\"),VLOOKUP(J17,_공휴일날짜,3,FALSE),\"\"),\"\")","v":""},null,null,"2025-10-13",{"$f":"IFERROR(IF(AND(N17<>\"\",VLOOKUP(N17,_공휴일날짜,3,FALSE)<>\"\"),VLOOKUP(N17,_공휴일날짜,3,FALSE),\"\"),\"\")","v":""},null,null,"2025-10-14",{"$f":"IFERROR(IF(AND(R17<>\"\",VLOOKUP(R17,_공휴일날짜,3,FALSE)<>\"\"),VLOOKUP(R17,_공휴일날짜,3,FALSE),\"\"),\"\")","v":""},null,null,"2025-10-15",{"$f":"IFERROR(IF(AND(V17<>\"\",VLOOKUP(V17,_공휴일날짜,3,FALSE)<>\"\"),VLOOKUP(V17,_공휴일날짜,3,FALSE),\"\"),\"\")","v":""},null,null,"2025-10-16",{"$f":"IFERROR(IF(AND(Z17<>\"\",VLOOKUP(Z17,_공휴일날짜,3,FALSE)<>\"\"),VLOOKUP(Z17,_공휴일날짜,3,FALSE),\"\"),\"\")","v":""},null,null,"2025-10-17",{"$f":"IFERROR(IF(AND(AD17<>\"\",VLOOKUP(AD17,_공휴일날짜,3,FALSE)<>\"\"),VLOOKUP(AD17,_공휴일날짜,3,FALSE),\"\"),\"\")","v":""},null,null,"2025-10-18",{"$f":"IFERROR(IF(AND(AH17<>\"\",VLOOKUP(AH17,_공휴일날짜,3,FALSE)<>\"\"),VLOOKUP(AH17,_공휴일날짜,3,FALSE),\"\"),\"\")","v":""}]
[]
[]
[null,{"$f":"VLOOKUP($E$20,_월별표기,2)","v":"September"},null,null,9]
[null,"일","월","화","수","목","금","토"]
[null,null,"2025-09-01","2025-09-02","2025-09-03","2025-09-04","2025-09-05","2025-09-06"]
[null,"2025-09-07","2025-09-08","2025-09-09","2025-09-10","2025-09-11","2025-09-12","2025-09-13",null,"2025-10-19",{"$f":"IFERROR(IF(AND(J23<>\"\",VLOOKUP(J23,_공휴일날짜,3,FALSE)<>\"\"),VLOOKUP(J23,_공휴일날짜,3,FALSE),\"\"),\"\")","v":""},null,null,"2025-10-20",{"$f":"IFERROR(IF(AND(N23<>\"\",VLOOKUP(N23,_공휴일날짜,3,FALSE)<>\"\"),VLOOKUP(N23,_공휴일날짜,3,FALSE),\"\"),\"\")","v":""},null,null,"2025-10-21",{"$f":"IFERROR(IF(AND(R23<>\"\",VLOOKUP(R23,_공휴일날짜,3,FALSE)<>\"\"),VLOOKUP(R23,_공휴일날짜,3,FALSE),\"\"),\"\")","v":""},null,null,"2025-10-22",{"$f":"IFERROR(IF(AND(V23<>\"\",VLOOKUP(V23,_공휴일날짜,3,FALSE)<>\"\"),VLOOKUP(V23,_공휴일날짜,3,FALSE),\"\"),\"\")","v":""},null,null,"2025-10-23",{"$f":"IFERROR(IF(AND(Z23<>\"\",VLOOKUP(Z23,_공휴일날짜,3,FALSE)<>\"\"),VLOOKUP(Z23,_공휴일날짜,3,FALSE),\"\"),\"\")","v":""},null,null,"2025-10-24",{"$f":"IFERROR(IF(AND(AD23<>\"\",VLOOKUP(AD23,_공휴일날짜,3,FALSE)<>\"\"),VLOOKUP(AD23,_공휴일날짜,3,FALSE),\"\"),\"\")","v":""},null,null,"2025-10-25",{"$f":"IFERROR(IF(AND(AH23<>\"\",VLOOKUP(AH23,_공휴일날짜,3,FALSE)<>\"\"),VLOOKUP(AH23,_공휴일날짜,3,FALSE),\"\"),\"\")","v":""}]
[null,"2025-09-14","2025-09-15","2025-09-16","2025-09-17","2025-09-18","2025-09-19","2025-09-20"]
[null,"2025-09-21","2025-09-22","2025-09-23","2025-09-24","2025-09-25","2025-09-26","2025-09-27"]
[null,"2025-09-28","2025-09-29","2025-09-30"]
[]
[]
[null,null,null,null,null,null,null,null,null,"2025-10-26",{"$f":"IFERROR(IF(AND(J29<>\"\",VLOOKUP(J29,_공휴일날짜,3,FALSE)<>\"\"),VLOOKUP(J29,_공휴일날짜,3,FALSE),\"\"),\"\")","v":""},null,null,"2025-10-27",{"$f":"IFERROR(IF(AND(N29<>\"\",VLOOKUP(N29,_공휴일날짜,3,FALSE)<>\"\"),VLOOKUP(N29,_공휴일날짜,3,FALSE),\"\"),\"\")","v":""},null,null,"2025-10-28",{"$f":"IFERROR(IF(AND(R29<>\"\",VLOOKUP(R29,_공휴일날짜,3,FALSE)<>\"\"),VLOOKUP(R29,_공휴일날짜,3,FALSE),\"\"),\"\")","v":""},null,null,"2025-10-29",{"$f":"IFERROR(IF(AND(V29<>\"\",VLOOKUP(V29,_공휴일날짜,3,FALSE)<>\"\"),VLOOKUP(V29,_공휴일날짜,3,FALSE),\"\"),\"\")","v":""},null,null,"2025-10-30",{"$f":"IFERROR(IF(AND(Z29<>\"\",VLOOKUP(Z29,_공휴일날짜,3,FALSE)<>\"\"),VLOOKUP(Z29,_공휴일날짜,3,FALSE),\"\"),\"\")","v":""},null,null,"2025-10-31",{"$f":"IFERROR(IF(AND(AD29<>\"\",VLOOKUP(AD29,_공휴일날짜,3,FALSE)<>\"\"),VLOOKUP(AD29,_공휴일날짜,3,FALSE),\"\"),\"\")","v":""},null,null,null,{"$f":"IFERROR(IF(AND(AH29<>\"\",VLOOKUP(AH29,_공휴일날짜,3,FALSE)<>\"\"),VLOOKUP(AH29,_공휴일날짜,3,FALSE),\"\"),\"\")","v":""}]
[null,{"$f":"VLOOKUP($E$30,_월별표기,2)","v":"November"},null,null,11]
[null,"일","월","화","수","목","금","토"]
[null,null,null,null,null,null,null,"2025-11-01"]
[null,"2025-11-02","2025-11-03","2025-11-04","2025-11-05","2025-11-06","2025-11-07","2025-11-08"]
[null,"2025-11-09","2025-11-10","2025-11-11","2025-11-12","2025-11-13","2025-11-14","2025-11-15"]
[null,"2025-11-16","2025-11-17","2025-11-18","2025-11-19","2025-11-20","2025-11-21","2025-11-22",null,null,{"$f":"IFERROR(IF(AND(J35<>\"\",VLOOKUP(J35,_공휴일날짜,3,FALSE)<>\"\"),VLOOKUP(J35,_공휴일날짜,3,FALSE),\"\"),\"\")","v":""},null,null,null,{"$f":"IFERROR(IF(AND(N35<>\"\",VLOOKUP(N35,_공휴일날짜,3,FALSE)<>\"\"),VLOOKUP(N35,_공휴일날짜,3,FALSE),\"\"),\"\")","v":""}]
[null,"2025-11-23","2025-11-24","2025-11-25","2025-11-26","2025-11-27","2025-11-28","2025-11-29"]
[null,"2025-11-30"]

{"sheet":"11월","index":10,"n_rows":36,"n_cols":41,"rows_kept":36,"cut":false,"hidden":false,"merged":[[5,41,5,45],[2,33,3,36],[4,9,5,9],[4,10,4,12],[4,13,5,13],[4,14,4,16],[4,17,5,17],[4,18,4,20],[4,21,5,21],[4,22,4,24],[4,25,5,25],[2,9,3,12],[2,13,3,16],[2,17,3,20],[2,21,3,24],[2,25,3,28],[2,29,3,32],[5,10,5,12],[5,14,5,16],[5,18,5,20],[5,22,5,24],[5,26,5,28],[5,30,5,32],[4,26,4,28],[4,29,5,29],[4,30,4,32],[6,33,6,36],[6,41,6,45],[7,9,7,12],[7,13,7,16],[7,17,7,20],[7,21,7,24],[7,25,7,28],[7,29,7,32],[7,33,7,36],[7,41,7,45],[6,9,6,12],[6,13,6,16],[6,17,6,20],[6,21,6,24],[6,25,6,28],[6,29,6,32],[4,33,5,33],[4,34,4,36],[4,41,4,45],[5,34,5,36],[10,9,11,9],[10,10,10,12],[10,13,11,13],[10,14,10,16],[10,17,11,17],[10,18,10,20],[8,33,8,36],[8,41,8,45],[9,9,9,12],[9,13,9,16],[9,17,9,20],[9,21,9,24],[9,25,9,28],[9,29,9,32],[9,33,9,36],[9,41,9,45],[8,9,8,12],[8,13,8,16],[8,17,8,20],[8,21,8,24],[8,25,8,28],[8,29,8,32],[11,41,11,45],[12,9,12,12],[12,13,12,16],[12,17,12,20],[12,21,12,24],[12,25,12,28],[12,29,12,32],[12,33,12,36],[12,41,12,45],[10,33,11,33],[10,34,10,36],[10,41,10,45],[11,10,11,12],[11,14,11,16],[11,18,11,20],[11,22,11,24],[11,26,11,28],[11,30,11,32],[11,34,11,36],[10,21,11,21],[10,22,10,24],[10,25,11,25],[10,26,10,28],[10,29,11,29],[10,30,10,32],[13,33,13,36],[13,41,13,45],[14,9,14,12],[14,13,14,16],[14,17,14,20],[14,21,14,24],[14,25,14,28],[14,29,14,32],[14,33,14,36],[14,41,14,45],[13,9,13,12],[13,13,13,16],[13,17,13,20],[13,21,13,24],[13,25,13,28],[13,29,13,32],[15,41,15,45],[16,9,17,9],[16,10,16,12],[16,13,17,13],[16,14,16,16],[16,17,17,17],[16,18,16,20],[16,21,17,21],[16,22,16,24],[15,9,15,12],[15,13,15,16],[15,17,15,20],[15,21,15,24],[15,25,15,28],[15,29,15,32],[16,41,16,45],[17,30,17,32],[17,34,17,36],[16,25,17,25],[16,26,16,28],[16,29,17,29],[16,30,16,32],[16,33,17,33],[16,34,16,36],[15,33,15,36],[19,1,19,3],[19,9,19,12],[19,13,19,16],[19,17,19,20],[19,21,19,24],[19,25,19,28],[17,40,17,45],[18,9,18,12],[18,13,18,16],[18,17,18,20],[18,21,18,24],[18,25,18,28],[18,29,18,32],[18,33,18,36],[19,29,19,32],[19,33,19,36],[19,40,19,45],[17,1,17,2],[17,4,17,7],[17,10,17,12],[17,14,17,16],[17,18,17,20],[17,22,17,24],[17,26,17,28],[20,9,20,12],[20,13,20,16],[20,17,20,20],[20,21,20,24],[20,25,20,28],[20,29,20,32],[20,33,20,36],[20,40,20,41],[20,42,20,45],[21,9,21,12],[21,13,21,16],[21,17,21,20],[21,21,21,24],[21,25,21,28],[21,29,21,32],[21,33,21,36],[21,40,21,41],[21,42,21,45],[22,9,23,9],[22,10,22,12],[22,13,23,13],[22,14,22,16],[22,17,23,17],[22,18,22,20],[22,21,23,21],[22,22,22,24],[22,25,23,25],[22,42,22,45],[23,10,23,12],[23,14,23,16],[23,18,23,20],[23,22,23,24],[23,26,23,28],[23,30,23,32],[23,34,23,36],[23,40,23,41],[23,42,23,45],[22,26,22,28],[22,29,23,29],[22,30,22,32],[22,33,23,33],[22,34,22,36],[22,40,22,41],[24,33,24,36],[24,40,24,41],[24,42,24,45],[25,9,25,12],[25,13,25,16],[25,17,25,20],[25,21,25,24],[25,25,25,28],[25,29,25,32],[25,33,25,36],[24,9,24,12],[24,13,24,16],[24,17,24,20],[24,21,24,24],[24,25,24,28],[24,29,24,32],[25,40,25,41],[25,42,25,45],[26,9,26,12],[26,13,26,16],[26,17,26,20],[26,21,26,24],[26,25,26,28],[26,29,26,32],[26,33,26,36],[26,40,26,41],[26,42,26,45],[27,9,27,12],[27,13,27,16],[27,17,27,20],[27,21,27,24],[27,25,27,28],[27,29,27,32],[27,33,27,36],[27,40,27,45],[29,1,29,3],[29,10,29,12],[29,14,29,16],[29,18,29,20],[29,22,29,24],[29,26,29,28],[29,30,29,32],[28,21,29,21],[28,22,28,24],[28,25,29,25],[28,26,28,28],[28,29,29,29],[28,30,28,32],[28,9,29,9],[28,10,28,12],[28,13,29,13],[28,14,28,16],[28,17,29,17],[28,18,28,20],[29,34,29,36],[29,40,29,45],[30,9,30,12],[30,13,30,16],[30,17,30,20],[30,21,30,24],[30,25,30,28],[30,29,30,32],[30,33,30,36],[30,40,30,45],[28,33,29,33],[28,34,28,36],[28,40,28,45],[31,33,31,36],[31,40,31,45],[32,9,32,12],[32,13,32,16],[32,17,32,20],[32,21,32,24],[32,25,32,28],[32,29,32,32],[32,33,32,36],[32,40,32,45],[31,9,31,12],[31,13,31,16],[31,17,31,20],[31,21,31,24],[31,25,31,28],[31,29,31,32],[33,33,33,36],[33,40,33,45],[34,9,35,9],[34,10,34,12],[34,13,35,13],[34,14,34,16],[34,40,34,45],[35,10,35,12],[35,14,35,16],[35,40,35,45],[33,9,33,12],[33,13,33,16],[33,17,33,20],[33,21,33,24],[33,25,33,28],[33,29,33,32],[36,9,36,12],[36,13,36,16],[36,21,36,28],[36,29,36,36],[36,40,36,45],[37,9,37,12],[37,13,37,16],[37,21,37,28],[37,29,37,36],[37,40,37,45],[38,9,38,12],[38,13,38,16],[38,21,38,28],[38,29,38,36],[38,40,38,45],[39,9,39,12],[39,13,39,16],[39,21,39,28],[39,29,39,36]]}
["v1.01"]
[]
[null,null,null,null,null,null,null,null,null,"일 Sunday",null,null,null,"월 Monday",null,null,null,"화 Tuesday",null,null,null,"수 Wednesday",null,null,null,"목 Thursday",null,null,null,"금 Friday",null,null,null,"토 Saturday"]
[]
[null,null,null,null,null,null,null,null,null,null,{"$f":"IFERROR(IF(AND(J5<>\"\",VLOOKUP(J5,_공휴일날짜,3,FALSE)<>\"\"),VLOOKUP(J5,_공휴일날짜,3,FALSE),\"\"),\"\")","v":""},null,null,null,{"$f":"IFERROR(IF(AND(N5<>\"\",VLOOKUP(N5,_공휴일날짜,3,FALSE)<>\"\"),VLOOKUP(N5,_공휴일날짜,3,FALSE),\"\"),\"\")","v":""},null,null,null,{"$f":"IFERROR(IF(AND(R5<>\"\",VLOOKUP(R5,_공휴일날짜,3,FALSE)<>\"\"),VLOOKUP(R5,_공휴일날짜,3,FALSE),\"\"),\"\")","v":""},null,null,null,{"$f":"IFERROR(IF(AND(V5<>\"\",VLOOKUP(V5,_공휴일날짜,3,FALSE)<>\"\"),VLOOKUP(V5,_공휴일날짜,3,FALSE),\"\"),\"\")","v":""},null,null,null,{"$f":"IFERROR(IF(AND(Z5<>\"\",VLOOKUP(Z5,_공휴일날짜,3,FALSE)<>\"\"),VLOOKUP(Z5,_공휴일날짜,3,FALSE),\"\"),\"\")","v":""},null,null,null,{"$f":"IFERROR(IF(AND(AD5<>\"\",VLOOKUP(AD5,_공휴일날짜,3,FALSE)<>\"\"),VLOOKUP(AD5,_공휴일날짜,3,FALSE),\"\"),\"\")","v":""},null,null,"2025-11-01",{"$f":"IFERROR(IF(AND(AH5<>\"\",VLOOKUP(AH5,_공휴일날짜,3,FALSE)<>\"\"),VLOOKUP(AH5,_공휴일날짜,3,FALSE),\"\"),\"\")","v":""},null,null,null,null,null,false]
[null,null,null,{"$f":"'달력 설정'!B6","v":2025},11,{"$f":"VLOOKUP($E$6,_월별표기,2)","v":"November"},null,null,null,null,null,null,null,null,null,null,null,null,null,null,null,null,null,null,null,null,null,null,null,null,null,null,null,null,null,null,null,null,null,null,false]
[null,null,null,null,null,null,null,null,null,null,null,null,null,null,null,null,null,null,null,null,null,null,null,null,null,null,null,null,null,null,null,null,null,null,null,null,null,null,null,null,false]
[null,1,null,null,null,null,null,null,null,null,null,null,null,null,null,null,null,null,null,null,null,null,null,null,null,null,null,null,null,null,null,null,null,null,null,null,null,null,null,null,false]
[null,null,null,null,null,null,null,null,null,null,null,null,null,null,null,null,null,null,null,null,null,null,null,null,null,null,null,null,null,null,null,null,null,null,null,null,null,null,null,null,false]
[null,null,null,null,null,null,null,null,null,null,null,null,null,null,null,null,null,null,null,null,null,null,null,null,null,null,null,null,null,null,null,null,null,null,null,null,null,null,null,null,false]
[null,null,null,null,null,null,null,null,null,"2025-11-02",{"$f":"IFERROR(IF(AND(J11<>\"\",VLOOKUP(J11,_공휴일날짜,3,FALSE)<>\"\"),VLOOKUP(J11,_공휴일날짜,3,FALSE),\"\"),\"\")","v":""},null,null,"2025-11-03",{"$f":"IFERROR(IF(AND(N11<>\"\",VLOOKUP(N11,_공휴일날짜,3,FALSE)<>\"\"),VLOOKUP(N11,_공휴일날짜,3,FALSE),\"\"),\"\")","v":""},null,null,"2025-11-04",{"$f":"IFERROR(IF(AND(R11<>\"\",VLOOKUP(R11,_공휴일날짜,3,FALSE)<>\"\"),VLOOKUP(R11,_공휴일날짜,3,FALSE),\"\"),\"\")","v":""},null,null,"2025-11-05",{"$f":"IFERROR(IF(AND(V11<>\"\",VLOOKUP(V11,_공휴일날짜,3,FALSE)<>\"\"),VLOOKUP(V11,_공휴일날짜,3,FALSE),\"\"),\"\")","v":""},null,null,"2025-11-06",{"$f":"IFERROR(IF(AND(Z11<>\"\",VLOOKUP(Z11,_공휴일날짜,3,FALSE)<>\"\"),VLOOKUP(Z11,_공휴일날짜,3,FALSE),\"\"),\"\")","v":""},null,null,"2025-11-07",{"$f":"IFERROR(IF(AND(AD11<>\"\",VLOOKUP(AD11,_공휴일날짜,3,FALSE)<>\"\"),VLOOKUP(AD11,_공휴일날짜,3,FALSE),\"\"),\"\")","v":""},null,null,"2025-11-08",{"$f":"IFERROR(IF(AND(AH11<>\"\",VLOOKUP(AH11,_공휴일날짜,3,FALSE)<>\"\"),VLOOKUP(AH11,_공휴일날짜,3,FALSE),\"\"),\"\")","v":""},null,null,null,null,null,false]
[null,null,null,null,null,null,null,null,null,null,null,null,null,null,null,null,null,null,null,null,null,null,null,null,null,null,null,null,null,null,null,null,null,null,null,null,null,null,null,null,false]
[null,null,null,null,null,null,null,null,null,null,null,null,null,null,null,null,null,null,null,null,null,null,null,null,null,null,null,null,null,null,null,null,null,null,null,null,null,null,null,null,false]
[null,null,null,null,null,null,null,null,null,null,null,null,null,null,null,null,null,null,null,null,null,null,null,null,null,null,null,null,null,null,null,null,null,null,null,null,null,null,null,null,false]
[null,null,null,null,null,null,null,null,null,null,null,null,null,null,null,null,null,null,null,null,null,null,null,null,null,null,null,null,null,null,null,null,null,null,null,null,null,null,null,null,false]
[null,null,null,{"$f":"YEAR(TODAY())","v":2025},{"$f":"MONTH(TODAY())","v":2},{"$f":"DAY(TODAY())","v":24},null,null,null,null,null,null,null,null,null,null,null,null,null,null,null,null,null,null,null,null,null,null,null,null,null,null,null,null,null,null,null,null,null,null,false]
[null,null,null,null,null,null,null,null,null,"2025-11-09",{"$f":"IFERROR(IF(AND(J17<>\"\",VLOOKUP(J17,_공휴일날짜,3,FALSE)<>\"\"),VLOOKUP(J17,_공휴일날짜,3,FALSE),\"\"),\"\")","v":""},null,null,"2025-11-10",{"$f":"IFERROR(IF(AND(N17<>\"\",VLOOKUP(N17,_공휴일날짜,3,FALSE)<>\"\"),VLOOKUP(N17,_공휴일날짜,3,FALSE),\"\"),\"\")","v":""},null,null,"2025-11-11",{"$f":"IFERROR(IF(AND(R17<>\"\",VLOOKUP(R17,_공휴일날짜,3,FALSE)<>\"\"),VLOOKUP(R17,_공휴일날짜,3,FALSE),\"\"),\"\")","v":""},null,null,"2025-11-12",{"$f":"IFERROR(IF(AND(V17<>\"\",VLOOKUP(V17,_공휴일날짜,3,FALSE)<>\"\"),VLOOKUP(V17,_공휴일날짜,3,FALSE),\"\"),\"\")","v":""},null,null,"2025-11-13",{"$f":"IFERROR(IF(AND(Z17<>\"\",VLOOKUP(Z17,_공휴일날짜,3,FALSE)<>\"\"),VLOOKUP(Z17,_공휴일날짜,3,FALSE),\"\"),\"\")","v":""},null,null,"2025-11-14",{"$f":"IFERROR(IF(AND(AD17<>\"\",VLOOKUP(AD17,_공휴일날짜,3,FALSE)<>\"\"),VLOOKUP(AD17,_공휴일날짜,3,FALSE),\"\"),\"\")","v":""},null,null,"2025-11-15",{"$f":"IFERROR(IF(AND(AH17<>\"\",VLOOKUP(AH17,_공휴일날짜,3,FALSE)<>\"\"),VLOOKUP(AH17,_공휴일날짜,3,FALSE),\"\"),\"\")","v":""}]
[]
[]
[null,{"$f":"VLOOKUP($E$20,_월별표기,2)","v":"October"},null,null,10]
[null,"일","월","화","수","목","금","토"]
[null,null,null,null,"2025-10-01","2025-10-02","2025-10-03","2025-10-04"]
[null,"2025-10-05","2025-10-06","2025-10-07","2025-10-08","2025-10-09","2025-10-10","2025-10-11",null,"2025-11-16",{"$f":"IFERROR(IF(AND(J23<>\"\",VLOOKUP(J23,_공휴일날짜,3,FALSE)<>\"\"),VLOOKUP(J23,_공휴일날짜,3,FALSE),\"\"),\"\")","v":""},null,null,"2025-11-17",{"$f":"IFERROR(IF(AND(N23<>\"\",VLOOKUP(N23,_공휴일날짜,3,FALSE)<>\"\"),VLOOKUP(N23,_공휴일날짜,3,FALSE),\"\"),\"\")","v":""},null,null,"2025-11-18",{"$f":"IFERROR(IF(AND(R23<>\"\",VLOOKUP(R23,_공휴일날짜,3,FALSE)<>\"\"),VLOOKUP(R23,_공휴일날짜,3,FALSE),\"\"),\"\")","v":""},null,null,"2025-11-19",{"$f":"IFERROR(IF(AND(V23<>\"\",VLOOKUP(V23,_공휴일날짜,3,FALSE)<>\"\"),VLOOKUP(V23,_공휴일날짜,3,FALSE),\"\"),\"\")","v":""},null,null,"2025-11-20",{"$f":"IFERROR(IF(AND(Z23<>\"\",VLOOKUP(Z23,_공휴일날짜,3,FALSE)<>\"\"),VLOOKUP(Z23,_공휴일날짜,3,FALSE),\"\"),\"\")","v":""},null,null,"2025-11-21",{"$f":"IFERROR(IF(AND(AD23<>\"\",VLOOKUP(AD23,_공휴일날짜,3,FALSE)<>\"\"),VLOOKUP(AD23,_공휴일날짜,3,FALSE),\"\"),\"\")","v":""},null,null,"2025-11-22",{"$f":"IFERROR(IF(AND(AH23<>\"\",VLOOKUP(AH23,_공휴일날짜,3,FALSE)<>\"\"),VLOOKUP(AH23,_공휴일날짜,3,FALSE),\"\"),\"\")","v":""}]
[null,"2025-10-12","2025-10-13","2025-10-14","2025-10-15","2025-10-16","2025-10-17","2025-10-18"]
[null,"2025-10-19","2025-10-20","2025-10-21","2025-10-22","2025-10-23","2025-10-24","2025-10-25"]
[null,"2025-10-26","2025-10-27","2025-10-28","2025-10-29","2025-10-30","2025-10-31"]
[]
[]
[null,null,null,null,null,null,null,null,null,"2025-11-23",{"$f":"IFERROR(IF(AND(J29<>\"\",VLOOKUP(J29,_공휴일날짜,3,FALSE)<>\"\"),VLOOKUP(J29,_공휴일날짜,3,FALSE),\"\"),\"\")","v":""},null,null,"2025-11-24",{"$f":"IFERROR(IF(AND(N29<>\"\",VLOOKUP(N29,_공휴일날짜,3,FALSE)<>\"\"),VLOOKUP(N29,_공휴일날짜,3,FALSE),\"\"),\"\")","v":""},null,null,"2025-11-25",{"$f":"IFERROR(IF(AND(R29<>\"\",VLOOKUP(R29,_공휴일날짜,3,FALSE)<>\"\"),VLOOKUP(R29,_공휴일날짜,3,FALSE),\"\"),\"\")","v":""},null,null,"2025-11-26",{"$f":"IFERROR(IF(AND(V29<>\"\",VLOOKUP(V29,_공휴일날짜,3,FALSE)<>\"\"),VLOOKUP(V29,_공휴일날짜,3,FALSE),\"\"),\"\")","v":""},null,null,"2025-11-27",{"$f":"IFERROR(IF(AND(Z29<>\"\",VLOOKUP(Z29,_공휴일날짜,3,FALSE)<>\"\"),VLOOKUP(Z29,_공휴일날짜,3,FALSE),\"\"),\"\")","v":""},null,null,"2025-11-28",{"$f":"IFERROR(IF(AND(AD29<>\"\",VLOOKUP(AD29,_공휴일날짜,3,FALSE)<>\"\"),VLOOKUP(AD29,_공휴일날짜,3,FALSE),\"\"),\"\")","v":""},null,null,"2025-11-29",{"$f":"IFERROR(IF(AND(AH29<>\"\",VLOOKUP(AH29,_공휴일날짜,3,FALSE)<>\"\"),VLOOKUP(AH29,_공휴일날짜,3,FALSE),\"\"),\"\")","v":""}]
[null,{"$f":"VLOOKUP($E$30,_월별표기,2)","v":"December"},null,null,12]
[null,"일","월","화","수","목","금","토"]
[null,null,"2025-12-01","2025-12-02","2025-12-03","2025-12-04","2025-12-05","2025-12-06"]
[null,"2025-12-07","2025-12-08","2025-12-09","2025-12-10","2025-12-11","2025-12-12","2025-12-13"]
[null,"2025-12-14","2025-12-15","2025-12-16","2025-12-17","2025-12-18","2025-12-19","2025-12-20"]
[null,"2025-12-21","2025-12-22","2025-12-23","2025-12-24","2025-12-25","2025-12-26","2025-12-27",null,"2025-11-30",{"$f":"IFERROR(IF(AND(J35<>\"\",VLOOKUP(J35,_공휴일날짜,3,FALSE)<>\"\"),VLOOKUP(J35,_공휴일날짜,3,FALSE),\"\"),\"\")","v":""},null,null,null,{"$f":"IFERROR(IF(AND(N35<>\"\",VLOOKUP(N35,_공휴일날짜,3,FALSE)<>\"\"),VLOOKUP(N35,_공휴일날짜,3,FALSE),\"\"),\"\")","v":""}]
[null,"2025-12-28","2025-12-29","2025-12-30","2025-12-31"]

{"sheet":"12월","index":11,"n_rows":36,"n_cols":41,"rows_kept":36,"cut":false,"hidden":false,"merged":[[5,41,5,45],[2,33,3,36],[4,9,5,9],[4,10,4,12],[4,13,5,13],[4,14,4,16],[4,17,5,17],[4,18,4,20],[4,21,5,21],[4,22,4,24],[4,25,5,25],[2,9,3,12],[2,13,3,16],[2,17,3,20],[2,21,3,24],[2,25,3,28],[2,29,3,32],[5,10,5,12],[5,14,5,16],[5,18,5,20],[5,22,5,24],[5,26,5,28],[5,30,5,32],[4,26,4,28],[4,29,5,29],[4,30,4,32],[6,33,6,36],[6,41,6,45],[7,9,7,12],[7,13,7,16],[7,17,7,20],[7,21,7,24],[7,25,7,28],[7,29,7,32],[7,33,7,36],[7,41,7,45],[6,9,6,12],[6,13,6,16],[6,17,6,20],[6,21,6,24],[6,25,6,28],[6,29,6,32],[4,33,5,33],[4,34,4,36],[4,41,4,45],[5,34,5,36],[10,9,11,9],[10,10,10,12],[10,13,11,13],[10,14,10,16],[10,17,11,17],[10,18,10,20],[8,33,8,36],[8,41,8,45],[9,9,9,12],[9,13,9,16],[9,17,9,20],[9,21,9,24],[9,25,9,28],[9,29,9,32],[9,33,9,36],[9,41,9,45],[8,9,8,12],[8,13,8,16],[8,17,8,20],[8,21,8,24],[8,25,8,28],[8,29,8,32],[11,41,11,45],[12,9,12,12],[12,13,12,16],[12,17,12,20],[12,21,12,24],[12,25,12,28],[12,29,12,32],[12,33,12,36],[12,41,12,45],[10,33,11,33],[10,34,10,36],[10,41,10,45],[11,10,11,12],[11,14,11,16],[11,18,11,20],[11,22,11,24],[11,26,11,28],[11,30,11,32],[11,34,11,36],[10,21,11,21],[10,22,10,24],[10,25,11,25],[10,26,10,28],[10,29,11,29],[10,30,10,32],[13,33,13,36],[13,41,13,45],[14,9,14,12],[14,13,14,16],[14,17,14,20],[14,21,14,24],[14,25,14,28],[14,29,14,32],[14,33,14,36],[14,41,14,45],[13,9,13,12],[13,13,13,16],[13,17,13,20],[13,21,13,24],[13,25,13,28],[13,29,13,32],[15,41,15,45],[16,9,17,9],[16,10,16,12],[16,13,17,13],[16,14,16,16],[16,17,17,17],[16,18,16,20],[16,21,17,21],[16,22,16,24],[15,9,15,12],[15,13,15,16],[15,17,15,20],[15,21,15,24],[15,25,15,28],[15,29,15,32],[16,41,16,45],[17,30,17,32],[17,34,17,36],[16,25,17,25],[16,26,16,28],[16,29,17,29],[16,30,16,32],[16,33,17,33],[16,34,16,36],[15,33,15,36],[19,1,19,3],[19,9,19,12],[19,13,19,16],[19,17,19,20],[19,21,19,24],[19,25,19,28],[17,40,17,45],[18,9,18,12],[18,13,18,16],[18,17,18,20],[18,21,18,24],[18,25,18,28],[18,29,18,32],[18,33,18,36],[19,29,19,32],[19,33,19,36],[19,40,19,45],[17,1,17,2],[17,4,17,7],[17,10,17,12],[17,14,17,16],[17,18,17,20],[17,22,17,24],[17,26,17,28],[20,9,20,12],[20,13,20,16],[20,17,20,20],[20,21,20,24],[20,25,20,28],[20,29,20,32],[20,33,20,36],[20,40,20,41],[20,42,20,45],[21,9,21,12],[21,13,21,16],[21,17,21,20],[21,21,21,24],[21,25,21,28],[21,29,21,32],[21,33,21,36],[21,40,21,41],[21,42,21,45],[22,9,23,9],[22,10,22,12],[22,13,23,13],[22,14,22,16],[22,17,23,17],[22,18,22,20],[22,21,23,21],[22,22,22,24],[22,25,23,25],[22,42,22,45],[23,10,23,12],[23,14,23,16],[23,18,23,20],[23,22,23,24],[23,26,23,28],[23,30,23,32],[23,34,23,36],[23,40,23,41],[23,42,23,45],[22,26,22,28],[22,29,23,29],[22,30,22,32],[22,33,23,33],[22,34,22,36],[22,40,22,41],[24,33,24,36],[24,40,24,41],[24,42,24,45],[25,9,25,12],[25,13,25,16],[25,17,25,20],[25,21,25,24],[25,25,25,28],[25,29,25,32],[25,33,25,36],[24,9,24,12],[24,13,24,16],[24,17,24,20],[24,21,24,24],[24,25,24,28],[24,29,24,32],[25,40,25,41],[25,42,25,45],[26,9,26,12],[26,13,26,16],[26,17,26,20],[26,21,26,24],[26,25,26,28],[26,29,26,32],[26,33,26,36],[26,40,26,41],[26,42,26,45],[27,9,27,12],[27,13,27,16],[27,17,27,20],[27,21,27,24],[27,25,27,28],[27,29,27,32],[27,33,27,36],[27,40,27,45],[29,1,29,3],[29,10,29,12],[29,14,29,16],[29,18,29,20],[29,22,29,24],[29,26,29,28],[29,30,29,32],[28,21,29,21],[28,22,28,24],[28,25,29,25],[28,26,28,28],[28,29,29,29],[28,30,28,32],[28,9,29,9],[28,10,28,12],[28,13,29,13],[28,14,28,16],[28,17,29,17],[28,18,28,20],[29,34,29,36],[29,40,29,45],[30,9,30,12],[30,13,30,16],[30,17,30,20],[30,21,30,24],[30,25,30,28],[30,29,30,32],[30,33,30,36],[30,40,30,45],[28,33,29,33],[28,34,28,36],[28,40,28,45],[31,33,31,36],[31,40,31,45],[32,9,32,12],[32,13,32,16],[32,17,32,20],[32,21,32,24],[32,25,32,28],[32,29,32,32],[32,33,32,36],[32,40,32,45],[31,9,31,12],[31,13,31,16],[31,17,31,20],[31,21,31,24],[31,25,31,28],[31,29,31,32],[33,33,33,36],[33,40,33,45],[34,9,35,9],[34,10,34,12],[34,13,35,13],[34,14,34,16],[34,40,34,45],[35,10,35,12],[35,14,35,16],[35,40,35,45],[33,9,33,12],[33,13,33,16],[33,17,33,20],[33,21,33,24],[33,25,33,28],[33,29,33,32],[36,9,36,12],[36,13,36,16],[36,21,36,28],[36,29,36,36],[36,40,36,45],[37,9,37,12],[37,13,37,16],[37,21,37,28],[37,29,37,36],[37,40,37,45],[38,9,38,12],[38,13,38,16],[38,21,38,28],[38,29,38,36],[38,40,38,45],[39,9,39,12],[39,13,39,16],[39,21,39,28],[39,29,39,36]]}
["v1.01"]
[]
[null,null,null,null,null,null,null,null,null,"일 Sunday",null,null,null,"월 Monday",null,null,null,"화 Tuesday",null,null,null,"수 Wednesday",null,null,null,"목 Thursday",null,null,null,"금 Friday",null,null,null,"토 Saturday"]
[]
[null,null,null,null,null,null,null,null,null,null,{"$f":"IFERROR(IF(AND(J5<>\"\",VLOOKUP(J5,_공휴일날짜,3,FALSE)<>\"\"),VLOOKUP(J5,_공휴일날짜,3,FALSE),\"\"),\"\")","v":""},null,null,"2025-12-01",{"$f":"IFERROR(IF(AND(N5<>\"\",VLOOKUP(N5,_공휴일날짜,3,FALSE)<>\"\"),VLOOKUP(N5,_공휴일날짜,3,FALSE),\"\"),\"\")","v":""},null,null,"2025-12-02",{"$f":"IFERROR(IF(AND(R5<>\"\",VLOOKUP(R5,_공휴일날짜,3,FALSE)<>\"\"),VLOOKUP(R5,_공휴일날짜,3,FALSE),\"\"),\"\")","v":""},null,null,"2025-12-03",{"$f":"IFERROR(IF(AND(V5<>\"\",VLOOKUP(V5,_공휴일날짜,3,FALSE)<>\"\"),VLOOKUP(V5,_공휴일날짜,3,FALSE),\"\"),\"\")","v":""},null,null,"2025-12-04",{"$f":"IFERROR(IF(AND(Z5<>\"\",VLOOKUP(Z5,_공휴일날짜,3,FALSE)<>\"\"),VLOOKUP(Z5,_공휴일날짜,3,FALSE),\"\"),\"\")","v":""},null,null,"2025-12-05",{"$f":"IFERROR(IF(AND(AD5<>\"\",VLOOKUP(AD5,_공휴일날짜,3,FALSE)<>\"\"),VLOOKUP(AD5,_공휴일날짜,3,FALSE),\"\"),\"\")","v":""},null,null,"2025-12-06",{"$f":"IFERROR(IF(AND(AH5<>\"\",VLOOKUP(AH5,_공휴일날짜,3,FALSE)<>\"\"),VLOOKUP(AH5,_공휴일날짜,3,FALSE),\"\"),\"\")","v":""},null,null,null,null,null,false]
[null,null,null,{"$f":"'달력 설정'!B6","v":2025},12,{"$f":"VLOOKUP($E$6,_월별표기,2)","v":"December"},null,null,null,null,null,null,null,null,null,null,null,null,null,null,null,null,null,null,null,null,null,null,null,null,null,null,null,null,null,null,null,null,null,null,false]
[null,null,null,null,null,null,null,null,null,null,null,null,null,null,null,null,null,null,null,null,null,null,null,null,null,null,null,null,null,null,null,null,null,null,null,null,null,null,null,null,false]
[null,1,null,null,null,null,null,null,null,null,null,null,null,null,null,null,null,null,null,null,null,null,null,null,null,null,null,null,null,null,null,null,null,null,null,null,null,null,null,null,false]
[null,null,null,null,null,null,null,null,null,null,null,null,null,null,null,null,null,null,null,null,null,null,null,null,null,null,null,null,null,null,null,null,null,null,null,null,null,null,null,null,false]
[null,null,null,null,null,null,null,null,null,null,null,null,null,null,null,null,null,null,null,null,null,null,null,null,null,null,null,null,null,null,null,null,null,null,null,null,null,null,null,null,false]
[null,null,null,null,null,null,null,null,null,"2025-12-07",{"$f":"IFERROR(IF(AND(J11<>\"\",VLOOKUP(J11,_공휴일날짜,3,FALSE)<>\"\"),VLOOKUP(J11,_공휴일날짜,3,FALSE),\"\"),\"\")","v":""},null,null,"2025-12-08",{"$f":"IFERROR(IF(AND(N11<>\"\",VLOOKUP(N11,_공휴일날짜,3,FALSE)<>\"\"),VLOOKUP(N11,_공휴일날짜,3,FALSE),\"\"),\"\")","v":""},null,null,"2025-12-09",{"$f":"IFERROR(IF(AND(R11<>\"\",VLOOKUP(R11,_공휴일날짜,3,FALSE)<>\"\"),VLOOKUP(R11,_공휴일날짜,3,FALSE),\"\"),\"\")","v":""},null,null,"2025-12-10",{"$f":"IFERROR(IF(AND(V11<>\"\",VLOOKUP(V11,_공휴일날짜,3,FALSE)<>\"\"),VLOOKUP(V11,_공휴일날짜,3,FALSE),\"\"),\"\")","v":""},null,null,"2025-12-11",{"$f":"IFERROR(IF(AND(Z11<>\"\",VLOOKUP(Z11,_공휴일날짜,3,FALSE)<>\"\"),VLOOKUP(Z11,_공휴일날짜,3,FALSE),\"\"),\"\")","v":""},null,null,"2025-12-12",{"$f":"IFERROR(IF(AND(AD11<>\"\",VLOOKUP(AD11,_공휴일날짜,3,FALSE)<>\"\"),VLOOKUP(AD11,_공휴일날짜,3,FALSE),\"\"),\"\")","v":""},null,null,"2025-12-13",{"$f":"IFERROR(IF(AND(AH11<>\"\",VLOOKUP(AH11,_공휴일날짜,3,FALSE)<>\"\"),VLOOKUP(AH11,_공휴일날짜,3,FALSE),\"\"),\"\")","v":""},null,null,null,null,null,false]
[null,null,null,null,null,null,null,null,null,null,null,null,null,null,null,null,null,null,null,null,null,null,null,null,null,null,null,null,null,null,null,null,null,null,null,null,null,null,null,null,false]
[null,null,null,null,null,null,null,null,null,null,null,null,null,null,null,null,null,null,null,null,null,null,null,null,null,null,null,null,null,null,null,null,null,null,null,null,null,null,null,null,false]
[null,null,null,null,null,null,null,null,null,null,null,null,null,null,null,null,null,null,null,null,null,null,null,null,null,null,null,null,null,null,null,null,null,null,null,null,null,null,null,null,false]
[null,null,null,null,null,null,null,null,null,null,null,null,null,null,null,null,null,null,null,null,null,null,null,null,null,null,null,null,null,null,null,null,null,null,null,null,null,null,null,null,false]
[null,null,null,{"$f":"YEAR(TODAY())","v":2025},{"$f":"MONTH(TODAY())","v":2},{"$f":"DAY(TODAY())","v":24},null,null,null,null,null,null,null,null,null,null,null,null,null,null,null,null,null,null,null,null,null,null,null,null,null,null,null,null,null,null,null,null,null,null,false]
[null,null,null,null,null,null,null,null,null,"2025-12-14",{"$f":"IFERROR(IF(AND(J17<>\"\",VLOOKUP(J17,_공휴일날짜,3,FALSE)<>\"\"),VLOOKUP(J17,_공휴일날짜,3,FALSE),\"\"),\"\")","v":""},null,null,"2025-12-15",{"$f":"IFERROR(IF(AND(N17<>\"\",VLOOKUP(N17,_공휴일날짜,3,FALSE)<>\"\"),VLOOKUP(N17,_공휴일날짜,3,FALSE),\"\"),\"\")","v":""},null,null,"2025-12-16",{"$f":"IFERROR(IF(AND(R17<>\"\",VLOOKUP(R17,_공휴일날짜,3,FALSE)<>\"\"),VLOOKUP(R17,_공휴일날짜,3,FALSE),\"\"),\"\")","v":""},null,null,"2025-12-17",{"$f":"IFERROR(IF(AND(V17<>\"\",VLOOKUP(V17,_공휴일날짜,3,FALSE)<>\"\"),VLOOKUP(V17,_공휴일날짜,3,FALSE),\"\"),\"\")","v":""},null,null,"2025-12-18",{"$f":"IFERROR(IF(AND(Z17<>\"\",VLOOKUP(Z17,_공휴일날짜,3,FALSE)<>\"\"),VLOOKUP(Z17,_공휴일날짜,3,FALSE),\"\"),\"\")","v":""},null,null,"2025-12-19",{"$f":"IFERROR(IF(AND(AD17<>\"\",VLOOKUP(AD17,_공휴일날짜,3,FALSE)<>\"\"),VLOOKUP(AD17,_공휴일날짜,3,FALSE),\"\"),\"\")","v":""},null,null,"2025-12-20",{"$f":"IFERROR(IF(AND(AH17<>\"\",VLOOKUP(AH17,_공휴일날짜,3,FALSE)<>\"\"),VLOOKUP(AH17,_공휴일날짜,3,FALSE),\"\"),\"\")","v":""}]
[]
[]
[null,{"$f":"VLOOKUP($E$20,_월별표기,2)","v":"November"},null,null,11]
[null,"일","월","화","수","목","금","토"]
[null,null,null,null,null,null,null,"2025-11-01"]
[null,"2025-11-02","2025-11-03","2025-11-04","2025-11-05","2025-11-06","2025-11-07","2025-11-08",null,"2025-12-21",{"$f":"IFERROR(IF(AND(J23<>\"\",VLOOKUP(J23,_공휴일날짜,3,FALSE)<>\"\"),VLOOKUP(J23,_공휴일날짜,3,FALSE),\"\"),\"\")","v":""},null,null,"2025-12-22",{"$f":"IFERROR(IF(AND(N23<>\"\",VLOOKUP(N23,_공휴일날짜,3,FALSE)<>\"\"),VLOOKUP(N23,_공휴일날짜,3,FALSE),\"\"),\"\")","v":""},null,null,"2025-12-23",{"$f":"IFERROR(IF(AND(R23<>\"\",VLOOKUP(R23,_공휴일날짜,3,FALSE)<>\"\"),VLOOKUP(R23,_공휴일날짜,3,FALSE),\"\"),\"\")","v":""},null,null,"2025-12-24",{"$f":"IFERROR(IF(AND(V23<>\"\",VLOOKUP(V23,_공휴일날짜,3,FALSE)<>\"\"),VLOOKUP(V23,_공휴일날짜,3,FALSE),\"\"),\"\")","v":""},null,null,"2025-12-25",{"$f":"IFERROR(IF(AND(Z23<>\"\",VLOOKUP(Z23,_공휴일날짜,3,FALSE)<>\"\"),VLOOKUP(Z23,_공휴일날짜,3,FALSE),\"\"),\"\")","v":"성탄절"},null,null,"2025-12-26",{"$f":"IFERROR(IF(AND(AD23<>\"\",VLOOKUP(AD23,_공휴일날짜,3,FALSE)<>\"\"),VLOOKUP(AD23,_공휴일날짜,3,FALSE),\"\"),\"\")","v":""},null,null,"2025-12-27",{"$f":"IFERROR(IF(AND(AH23<>\"\",VLOOKUP(AH23,_공휴일날짜,3,FALSE)<>\"\"),VLOOKUP(AH23,_공휴일날짜,3,FALSE),\"\"),\"\")","v":""}]
[null,"2025-11-09","2025-11-10","2025-11-11","2025-11-12","2025-11-13","2025-11-14","2025-11-15"]
[null,"2025-11-16","2025-11-17","2025-11-18","2025-11-19","2025-11-20","2025-11-21","2025-11-22"]
[null,"2025-11-23","2025-11-24","2025-11-25","2025-11-26","2025-11-27","2025-11-28","2025-11-29"]
[null,"2025-11-30"]
[]
[null,null,null,null,null,null,null,null,null,"2025-12-28",{"$f":"IFERROR(IF(AND(J29<>\"\",VLOOKUP(J29,_공휴일날짜,3,FALSE)<>\"\"),VLOOKUP(J29,_공휴일날짜,3,FALSE),\"\"),\"\")","v":""},null,null,"2025-12-29",{"$f":"IFERROR(IF(AND(N29<>\"\",VLOOKUP(N29,_공휴일날짜,3,FALSE)<>\"\"),VLOOKUP(N29,_공휴일날짜,3,FALSE),\"\"),\"\")","v":""},null,null,"2025-12-30",{"$f":"IFERROR(IF(AND(R29<>\"\",VLOOKUP(R29,_공휴일날짜,3,FALSE)<>\"\"),VLOOKUP(R29,_공휴일날짜,3,FALSE),\"\"),\"\")","v":""},null,null,"2025-12-31",{"$f":"IFERROR(IF(AND(V29<>\"\",VLOOKUP(V29,_공휴일날짜,3,FALSE)<>\"\"),VLOOKUP(V29,_공휴일날짜,3,FALSE),\"\"),\"\")","v":""},null,null,null,{"$f":"IFERROR(IF(AND(Z29<>\"\",VLOOKUP(Z29,_공휴일날짜,3,FALSE)<>\"\"),VLOOKUP(Z29,_공휴일날짜,3,FALSE),\"\"),\"\")","v":""},null,null,null,{"$f":"IFERROR(IF(AND(AD29<>\"\",VLOOKUP(AD29,_공휴일날짜,3,FALSE)<>\"\"),VLOOKUP(AD29,_공휴일날짜,3,FALSE),\"\"),\"\")","v":""},null,null,null,{"$f":"IFERROR(IF(AND(AH29<>\"\",VLOOKUP(AH29,_공휴일날짜,3,FALSE)<>\"\"),VLOOKUP(AH29,_공휴일날짜,3,FALSE),\"\"),\"\")","v":""}]
[null,{"$f":"VLOOKUP($E$30,_월별표기,2)","v":"January"},null,null,1]
[null,"일","월","화","수","목","금","토"]
[null,null,null,null,null,"2026-01-01","2026-01-02","2026-01-03"]
[null,"2026-01-04","2026-01-05","2026-01-06","2026-01-07","2026-01-08","2026-01-09","2026-01-10"]
[null,"2026-01-11","2026-01-12","2026-01-13","2026-01-14","2026-01-15","2026-01-16","2026-01-17"]
[null,"2026-01-18","2026-01-19","2026-01-20","2026-01-21","2026-01-22","2026-01-23","2026-01-24",null,null,{"$f":"IFERROR(IF(AND(J35<>\"\",VLOOKUP(J35,_공휴일날짜,3,FALSE)<>\"\"),VLOOKUP(J35,_공휴일날짜,3,FALSE),\"\"),\"\")","v":""},null,null,null,{"$f":"IFERROR(IF(AND(N35<>\"\",VLOOKUP(N35,_공휴일날짜,3,FALSE)<>\"\"),VLOOKUP(N35,_공휴일날짜,3,FALSE),\"\"),\"\")","v":""}]
[null,"2026-01-25","2026-01-26","2026-01-27","2026-01-28","2026-01-29","2026-01-30","2026-01-31"]

{"sheet":"달력 설정","index":12,"n_rows":56,"n_cols":20,"rows_kept":56,"cut":false,"hidden":false,"merged":[[5,18,5,25],[23,8,23,9],[23,10,23,11],[23,14,23,16],[24,8,24,9],[24,10,24,11],[24,14,24,16],[21,8,21,9],[21,10,21,11],[21,14,21,16],[22,8,22,9],[22,10,22,11],[22,14,22,16],[20,8,20,9],[20,10,20,11],[20,14,20,16],[17,8,17,9],[17,10,17,11],[17,14,17,16],[18,8,18,9],[18,10,18,11],[18,14,18,16],[19,8,19,9],[19,10,19,11],[28,8,28,9],[28,10,28,11],[28,14,28,16],[25,8,25,9],[25,10,25,11],[25,14,25,16],[26,8,26,9],[26,10,26,11],[26,14,26,16],[27,8,27,9],[27,10,27,11],[27,14,27,16],[19,14,19,16],[16,8,16,9],[16,10,16,11],[16,14,16,16],[13,8,13,9],[13,10,13,11],[13,14,13,16],[14,8,14,9],[14,10,14,11],[14,14,14,16],[11,8,11,9],[11,10,11,11],[11,14,11,16],[12,8,12,9],[12,10,12,11],[12,14,12,16],[15,8,15,9],[15,10,15,11],[15,14,15,16],[10,8,10,9],[10,10,10,11],[10,14,10,16],[8,8,8,9],[8,10,8,11],[8,14,8,16],[9,8,9,9],[9,10,9,11],[9,14,9,16],[6,8,6,9],[6,10,6,11],[6,14,6,16],[9,1,9,2],[4,4,4,6],[4,1,4,2],[5,1,6,2],[5,14,5,16],[5,10,5,11],[5,8,5,9],[7,8,7,9],[7,10,7,11],[7,14,7,16],[31,8,31,9],[31,10,31,11],[31,14,31,16],[32,8,32,9],[32,10,32,11],[32,14,32,16],[29,8,29,9],[29,10,29,11],[29,14,29,16],[30,8,30,9],[30,10,30,11],[30,14,30,16],[35,8,35,9],[35,10,35,11],[35,14,35,16],[36,8,36,9],[36,10,36,11],[36,14,36,16],[33,8,33,9],[33,10,33,11],[33,14,33,16],[34,8,34,9],[34,10,34,11],[34,14,34,16],[18,19,18,20],[9,19,9,20],[10,19,10,20],[11,19,11,20],[12,19,12,20],[13,19,13,20],[14,19,14,20],[15,19,15,20],[16,19,16,20],[17,19,17,20]]}
[]
[]
[]
[]
[]
[null,2025,null,null,"날짜","휴일","내용",null,"시작일",null,"종료일",null,"반복","색상","내용",null,null,null,"https://soul-rests.tistory.com/"]
[null,null,null,null,"2024-12-25","Y","크리스마스"]
[null,null,null,null,"2025-01-01","Y","신정"]
[null,null,null,null,"2025-01-27","Y","대체 휴일"]
[null,null,null,null,"2025-01-28","Y",null,null,null,null,null,null,null,null,null,null,null,null,1,"🏴"]
[null,1,"January",null,"2025-01-29","Y","설날",null,null,null,null,null,null,null,null,null,null,null,2,"🎉"]
[null,2,"February",null,"2025-01-30","Y",null,null,null,null,null,null,null,null,null,null,null,null,3,"✈"]
[null,3,"March",null,"2025-03-01","Y","삼일절",null,null,null,null,null,null,null,null,null,null,null,4,"✨"]
[null,4,"April",null,"2025-03-03","Y","대체 휴일",null,null,null,null,null,null,null,null,null,null,null,5,"💖"]
[null,5,"May",null,"2025-05-05","Y","석가탄신일,어린이날",null,null,null,null,null,null,null,null,null,null,null,6,"💌"]
[null,6,"June",null,"2025-05-06","Y","대체 휴일",null,null,null,null,null,null,null,null,null,null,null,7,"💍"]
[null,7,"July",null,"2025-06-06","Y","현충일",null,null,null,null,null,null,null,null,null,null,null,8,"🎂"]
[null,8,"August",null,"2025-08-15","Y","광복절",null,null,null,null,null,null,null,null,null,null,null,9,"🎁"]
[null,9,"September",null,"2025-10-03","Y","개천절",null,null,null,null,null,null,null,null,null,null,null,10,"🏆"]
[null,10,"October",null,"2025-10-06","Y","추석"]
[null,11,"November",null,"2025-10-07","Y"]
[null,12,"December",null,"2025-10-08","Y","대체 휴일"]
[null,null,null,null,"2025-10-09","Y","한글날"]
[null,"Ver",1.1000000000000001,null,"2025-12-25","Y","성탄절"]
[null,null,null,null,"2026-01-01","Y","신정"]
[null,null,null,null,null,"N"]
[null,null,null,null,null,"N"]
[null,null,null,null,null,"N"]
[null,null,null,null,null,"N"]
[null,null,null,null,null,"N"]
[null,null,null,null,null,"N"]
[null,null,null,null,null,"N"]
[null,null,null,null,null,"N"]
[null,null,null,null,null,"N"]
[null,null,null,null,null,"N"]
[null,null,null,null,null,"N"]
[null,null,null,null,null,"N"]
[null,null,null,null,null,"N"]
[null,null,null,null,null,"N"]
[null,null,null,null,null,"N"]
[null,null,null,null,null,"N"]
[null,null,null,null,null,"N"]
[null,null,null,null,null,"N"]
[null,null,null,null,null,"N"]
[null,null,null,null,null,"N"]
[null,null,null,null,null,"N"]
[null,null,null,null,null,"N"]
[null,null,null,null,null,"N"]
[null,null,null,null,null,"N"]
[null,null,null,null,null,"N"]
[null,null,null,null,null,"N"]
[null,null,null,null,null,"N"]
[null,null,null,null,null,"N"]
[null,null,null,null,null,"N"]
[null,null,null,null,null,"N"]
[null,null,null,null,null,"N"]