{"text_format":"1","workbook":"xlsx","n_sheets":2,"sheets":["Mail","메일리스트"],"not_rendered":{"charts":0,"images":0,"macros":1,"external_links":0,"defined_names":0,"comments":1,"pivot_tables":0},"unopened":[],"bounds":{"document_bytes":16777216,"sheet_cells":100000,"rows_first":2000,"rows_last":500,"rows_between":2000,"halvings":0,"cell_chars":16384,"cell_head_chars":4096},"cells_cut":0,"cells_raw":0,"read":"whole","date_system":"1900"}

{"sheet":"Mail","index":0,"n_rows":27,"n_cols":3,"rows_kept":27,"cut":false,"hidden":false,"merged":[[23,2,25,2],[20,1,25,1],[26,1,28,2],[1,1,4,2],[12,1,13,2],[20,2,22,2]]}
[]
[null,"ThunderBird easy send mail Ver.2"]
[]
[1]
[{"$f":"INDEX(메일리스트!A2:A150,COUNT(메일리스트!A2:A150))","v":13}]
[3,"받는사람주소",{"$f":"_xlfn.XLOOKUP(A6,메일리스트!$A$2:$A$20,메일리스트!$B$2:$B$20)","v":"abcde@example.net"}]
[null,"참조자",{"$f":"_xlfn.XLOOKUP(A6,메일리스트!$A$2:$A$20,메일리스트!$C$2:$C$20)&\"\"","v":""}]
[null,"메일제목",{"$f":"_xlfn.XLOOKUP(A6,메일리스트!$A$2:$A$20,메일리스트!$D$2:$D$20)","v":"테스트3"}]
[null,"메일본문",{"$f":"_xlfn.XLOOKUP(A6,메일리스트!$A$2:$A$20,메일리스트!$E$2:$E$20)","v":"테스트3입니다."}]
[null,"첨부파일1",{"$f":"_xlfn.XLOOKUP(A6,메일리스트!$A$2:$A$20,메일리스트!$F$2:$F$20)","v":"C:\\Users\\홍길동\\Desktop\\test1.txt"}]
[null,"첨부파일2",{"$f":"_xlfn.XLOOKUP(A6,메일리스트!$A$2:$A$20,메일리스트!$G$2:$G$20)","v":"C:\\Users\\홍길동\\Desktop\\test2.txt"}]
[]
[null,"본 VBA 매크로 파일은 ThunderBird 프로그램으로 이메일을 발송하기 위함입니다.\nVER.2 파일은 여러명의 수신자들에게 서로 다른 첨부파일, 메일내용을 보내셔야 될때 사용하시는 VBA 매크로입니다. \n※ 본 프로그램을 사용시 반드시 ThuderBird 프로그램이 설치하시고 메일 계정까지 로그인 완료되어있어야 정상작동되며 보안경고창 뜨면 매크로사용누르세요"]
[]
[null,"기능설명 1 :","메일리스트' 탭에가셔서 받는사람 주소 내용 첨부파일 등을 입력하시시고 본 탭으로 돌아오셔서 수동/자동 둘중 하나 선택하셔 사용하심됩니다. 매월 청구서, 독초서, 급여명세서 등 보내실때 사용하시면 편리하며 마찬가지로 각 내용에 수식을 걸어두셔도 무방합니다."]
[null,"기능설명 2 :","본 파일에 색깔로 탭을 칠해놓은 부분은 수식이 연결된 부분으로 왠만해서는 건들지 마시십시오. 중간에 보내고싶지 않은 주소에는 순번을 제거하시고 다음 숫자를 그 다음 열에 입력하셔도되고 아에 지우셔도 됩니다."]
[null,"기능설명 3 :","첨부파일 경로가 만약 빈칸이라면 본 VBA코드에서는 무의미한 DOCUMENT라는 파일이 자동 생성되어 첨부됩니다."]
[null,"기능설명 4 :","첨부파일이 3개이상으로 더 필요하다면 두가지의 방법이 있습니다. 첫번째로는 첨부파일3의 셀을 만들고 수식을 수정하고, VBA코드에서 attch3를 만들어 추가하는 방법이 있고 두번째 방법으로는 하단에 설명해놓은것처럼 첨부파일 한칸에 경로를 어퍼스트로피와 콤마를 이용해 넣는 방법이있습니다."]
[null,"기능설명 5 :","수동발송: 메일보내기를 클릭하면 완성된 메일이 보여지고 메일이 나중에 발송 함에 들어갑니다.\n자동발송은 별다른 조치없이 자동으로 단축키가 입력이되어 메일이 즉시 발송됩니다. 한건 한건 발송됩니다."]
[null,"기능설명 6 :","본 수동발송 자동발송을 나누어 놓은 이유는 대량메일을 보낼때 한번 더 컨펌이 필요하시면 컨펌을 진행하라는 의미로 수동발송 자동발송을 나누어놓았습니다."]
[null,"공통기능 설명 :","받는사람이 두명이상일때는 다음과 같이 받는사람주소를 작성하시면됩니다. →        =\"'abcd@abc.com,hi@abc.com,hello@abc.com'\"\n첨부파일도 두개이상일때또 마찬가지로 다음과 같이 첨부파일 경로를 작성하시면됩니다. \n→ =\"'C:\\Users\\홍길동\\Desktop\\test.png,C:\\Users\\홍길동\\Desktop\\test.png'\""]
[]
[]
[null,null,"※ 두개이상의 첨부파일, 받는사람 주소 지정하는 원리는 ThunderBird는 두개이상의 파일을  '(어퍼스트로피)를 전체 앞과 뒤에 묶고 경계는 ,(콤마)로 구분 짓는겁니다. 그러나 엑셀에서는 위 원리를 적용하기위해서는 글자그대로를 나타나기위해 =(수식) 시작 기호와 글자 그대로 나타내는 \"(쌍따옴표)를 앞뒤로 추가로 묶어주는겁니다."]
[]
[]
[null,"VER.2 파일은 주로  급여명세서, 매월 고지서, 매월 청구서 등 많은 사용자들에게 각각 다른 메일을 한번에 보낼때 사용하시면 편리합니다.\n같은 패턴으로 매번 생성되는 파일은 파일 경로를 자동 수식 걸어두시면 편리하게 사용하실수있습니다. (건BY건 청구서, 거래명세서, 내역서 등등)\n본 코드를 활용하여 업무의 편리성을 높이시기 바라며 자신의 상황에 맞게 가공해서 사용하시면 됩니다."]

{"sheet":"메일리스트","index":1,"n_rows":14,"n_cols":8,"rows_kept":14,"cut":false,"hidden":false,"merged":[]}
["순번","받는사람 메일주소","참조인 메일주소","메일제목","메일본문","첨부파일1","첨부파일2","메모란"]
[1,"abcde@example.net",null,"테스트1","테스트1입니다.","C:\\Users\\홍길동\\Desktop\\test1.txt","C:\\Users\\홍길동\\Desktop\\test2.txt"]
[2,"abcde@example.net",null,"테스트2","테스트2입니다.","C:\\Users\\홍길동\\Desktop\\test1.txt","C:\\Users\\홍길동\\Desktop\\test2.txt"]
[3,"abcde@example.net",null,"테스트3","테스트3입니다.","C:\\Users\\홍길동\\Desktop\\test1.txt","C:\\Users\\홍길동\\Desktop\\test2.txt"]
[4,"abcde@example.net",null,"테스트4","테스트4입니다.","C:\\Users\\홍길동\\Desktop\\test1.txt","C:\\Users\\홍길동\\Desktop\\test2.txt"]
[5,"abcde@example.net",null,"테스트5","테스트5입니다.","C:\\Users\\홍길동\\Desktop\\test1.txt","C:\\Users\\홍길동\\Desktop\\test2.txt"]
[6,"abcde@example.net",null,"테스트6","테스트6입니다.","C:\\Users\\홍길동\\Desktop\\test1.txt","C:\\Users\\홍길동\\Desktop\\test2.txt"]
[7,"abcde@example.net",null,"테스트7","테스트7입니다.","C:\\Users\\홍길동\\Desktop\\test1.txt","C:\\Users\\홍길동\\Desktop\\test2.txt"]
[8,"abcde@example.net",null,"테스트8","테스트8입니다.","C:\\Users\\홍길동\\Desktop\\test1.txt","C:\\Users\\홍길동\\Desktop\\test2.txt"]
[9,"abcde@example.net",null,"테스트9","테스트9입니다.","C:\\Users\\홍길동\\Desktop\\test1.txt","C:\\Users\\홍길동\\Desktop\\test2.txt"]
[10,"abcde@example.net",null,"테스트10","테스트10입니다.","C:\\Users\\홍길동\\Desktop\\test1.txt","C:\\Users\\홍길동\\Desktop\\test2.txt"]
[11,"abcde@example.net",null,"테스트11","테스트11입니다.","C:\\Users\\홍길동\\Desktop\\test1.txt","C:\\Users\\홍길동\\Desktop\\test2.txt"]
[12,"abcde@example.net",null,"테스트12","테스트12입니다.","C:\\Users\\홍길동\\Desktop\\test1.txt","C:\\Users\\홍길동\\Desktop\\test2.txt"]
[13,"abcde@example.net",null,"테스트13","테스트13입니다.","C:\\Users\\홍길동\\Desktop\\test1.txt","C:\\Users\\홍길동\\Desktop\\test2.txt"]