{"text_format":"1","workbook":"xlsx","n_sheets":9,"sheets":["사용안내","연간","달력","색상","일정","공휴일","디데이","미니달력","이름지정"],"not_rendered":{"charts":0,"images":9,"macros":1,"external_links":0,"defined_names":28,"comments":4,"pivot_tables":0},"unopened":[],"bounds":{"document_bytes":16777216,"sheet_cells":100000,"rows_first":2000,"rows_last":500,"rows_between":2000,"halvings":0,"cell_chars":16384,"cell_head_chars":4096},"cells_cut":0,"cells_raw":0,"read":"whole","date_system":"1900"}

{"sheet":"사용안내","index":0,"n_rows":31,"n_cols":7,"rows_kept":31,"cut":false,"hidden":false,"merged":[[0,1,0,10],[17,1,17,10],[6,1,6,5],[6,6,6,10],[7,1,7,5],[8,1,8,5],[9,1,9,5],[10,1,10,5],[2,1,2,10],[3,1,3,10],[4,1,4,10],[7,6,7,10],[8,6,8,10],[9,6,9,10],[10,6,10,10],[11,6,11,10],[30,6,30,8],[28,1,28,10],[29,1,29,10],[13,1,13,10],[14,1,14,10],[15,1,15,10],[20,1,20,10],[22,1,22,10],[23,1,23,10],[24,1,24,10],[25,1,25,10],[27,1,27,10],[19,1,19,10],[18,1,18,10]]}
[null,"탭다 엑셀 양식 사용 안내"]
[]
[null,"탭다 블로그 내 엑셀 양식은"]
[null,"사용 범위를 준수할 경우 모두 무료입니다. "]
[null,"금지 사항 적발 시 관련법에 의거 제재 및 법적 처벌을 받을 수 있습니다."]
[]
[null,"O",null,null,null,null,"X"]
[null,"개인적 비상업적 용도의 사용",null,null,null,null,"디자인 무단 도용 및 판매 금지"]
[null,"온라인 및 오프라인 이용 가능",null,null,null,null,"재배포(개인적, 비상업적 용도라도) 금지"]
[null,"회사원 개인의 회사 내부 보고, 제출, 공유용",null,null,null,null,"외부 유출, 대외적 게시 금지"]
[null,"비영리 단체에서의 사용",null,null,null,null,"영리 목적의 강의에 사용 금지"]
[null,null,null,null,null,null,"기타 이에 준하는 모든 상업적 유사 행위 금지"]
[]
[null,"탭다의 최신 소식을 가장 빨리 받는 방법!"]
[null,"카카오톡 친구 검색에서 '탭다'를 찾아 친구 추가하기!"]
[null,"탭다 블로그 북마크 또는 즐겨찾기 http://tabda.tistory.com"]
[]
[null,"탭다 엑셀 양식이 마음에 드셨나요?"]
[null,"지금 블로그, SNS에 탭다를 홍보해주세요."]
[null,"#탭다, #무료엑셀양식, #고퀄리티, #개이득"]
[null,"여러분들의 우쭈쭈는 저에게 큰 힘이 됩니다."]
[]
[null,"탭다 엑셀 양식이 유용하셨나요?"]
[null,"앞으로도 고퀄리티 엑셀 양식이 꾸준히"]
[null,"만들어질 수 있도록 탭다를 후원해주세요."]
[null,"여러분들의 피드백에 더 나은 컨텐츠 제작으로 보답하겠습니다."]
[]
[null,"네이버 페이 포인트 선물하기 : mkjang0202(네이버 앱→메뉴→네이버 페이→포인트 선물)"]
[null,"계좌 후원 : 국민은행 240802-04-160014 장*경"]
[null,"문의 : 카카오톡 1:1 오픈채팅에서 '탭다' 검색"]
[null,null,"    오픈채팅 입장 링크 및 QR코드 →",null,null,null,"https://open.kakao.com/o/s3L8L5Tb"]

{"sheet":"연간","index":1,"n_rows":32,"n_cols":32,"rows_kept":32,"cut":false,"hidden":false,"merged":[[1,14,1,18]]}
[]
[null,"S",null,null,null,null,null,null,null,null,null,null,null,null,2024]
[]
[null,null,null,null,1,null,null,null,null,null,null,null,2,null,null,null,null,null,null,null,3,null,null,null,null,null,null,null,4]
[]
[null,{"$f":"IF($B$2=\"S\",\"S\",IF($B$2=\"M\",\"M\"))","v":"S"},{"$f":"IF($B$2=\"S\",\"M\",IF($B$2=\"M\",\"T\"))","v":"M"},{"$f":"IF($B$2=\"S\",\"T\",IF($B$2=\"M\",\"W\"))","v":"T"},{"$f":"IF($B$2=\"S\",\"W\",IF($B$2=\"M\",\"T\"))","v":"W"},{"$f":"IF($B$2=\"S\",\"T\",IF($B$2=\"M\",\"F\"))","v":"T"},{"$f":"IF($B$2=\"S\",\"F\",IF($B$2=\"M\",\"S\"))","v":"F"},"S",null,{"$f":"IF($B$2=\"S\",\"S\",IF($B$2=\"M\",\"M\"))","v":"S"},{"$f":"IF($B$2=\"S\",\"M\",IF($B$2=\"M\",\"T\"))","v":"M"},{"$f":"IF($B$2=\"S\",\"T\",IF($B$2=\"M\",\"W\"))","v":"T"},{"$f":"IF($B$2=\"S\",\"W\",IF($B$2=\"M\",\"T\"))","v":"W"},{"$f":"IF($B$2=\"S\",\"T\",IF($B$2=\"M\",\"F\"))","v":"T"},{"$f":"IF($B$2=\"S\",\"F\",IF($B$2=\"M\",\"S\"))","v":"F"},"S",null,{"$f":"IF($B$2=\"S\",\"S\",IF($B$2=\"M\",\"M\"))","v":"S"},{"$f":"IF($B$2=\"S\",\"M\",IF($B$2=\"M\",\"T\"))","v":"M"},{"$f":"IF($B$2=\"S\",\"T\",IF($B$2=\"M\",\"W\"))","v":"T"},{"$f":"IF($B$2=\"S\",\"W\",IF($B$2=\"M\",\"T\"))","v":"W"},{"$f":"IF($B$2=\"S\",\"T\",IF($B$2=\"M\",\"F\"))","v":"T"},{"$f":"IF($B$2=\"S\",\"F\",IF($B$2=\"M\",\"S\"))","v":"F"},"S",null,{"$f":"IF($B$2=\"S\",\"S\",IF($B$2=\"M\",\"M\"))","v":"S"},{"$f":"IF($B$2=\"S\",\"M\",IF($B$2=\"M\",\"T\"))","v":"M"},{"$f":"IF($B$2=\"S\",\"T\",IF($B$2=\"M\",\"W\"))","v":"T"},{"$f":"IF($B$2=\"S\",\"W\",IF($B$2=\"M\",\"T\"))","v":"W"},{"$f":"IF($B$2=\"S\",\"T\",IF($B$2=\"M\",\"F\"))","v":"T"},{"$f":"IF($B$2=\"S\",\"F\",IF($B$2=\"M\",\"S\"))","v":"F"},"S"]
[null,{"$f":"IF(B2=\"M\",(IF(DAY(DATE($O$2,$E$4,1)-WEEKDAY(DATE($O$2,$E$4,1))+2)=2,DATE($O$2,$E$4,1)-WEEKDAY(DATE($O$2,$E$4,1))-5,DATE($O$2,$E$4,1)-WEEKDAY(DATE($O$2,$E$4,1))+2)),IF(B2=\"S\",DATE($O$2,$E$4,1)-WEEKDAY(DATE($O$2,$E$4,1))+1))","v":"2023-12-31"},{"$f":"B7+1","v":"2024-01-01"},"2024-01-02","2024-01-03","2024-01-04","2024-01-05","2024-01-06",null,{"$f":"IF(B2=\"M\",(IF(DAY(DATE($O$2,$M$4,1)-WEEKDAY(DATE($O$2,$M$4,1))+2)=2,DATE($O$2,$M$4,1)-WEEKDAY(DATE($O$2,$M$4,1))-5,DATE($O$2,$M$4,1)-WEEKDAY(DATE($O$2,$M$4,1))+2)),IF(B2=\"S\",DATE($O$2,$M$4,1)-WEEKDAY(DATE($O$2,$M$4,1))+1))","v":"2024-01-28"},{"$f":"J7+1","v":"2024-01-29"},"2024-01-30","2024-01-31","2024-02-01","2024-02-02","2024-02-03",null,{"$f":"IF(B2=\"M\",(IF(DAY(DATE($O$2,$U$4,1)-WEEKDAY(DATE($O$2,$U$4,1))+2)=2,DATE($O$2,$U$4,1)-WEEKDAY(DATE($O$2,$U$4,1))-5,DATE($O$2,$U$4,1)-WEEKDAY(DATE($O$2,$U$4,1))+2)),IF(B2=\"S\",DATE($O$2,$U$4,1)-WEEKDAY(DATE($O$2,$U$4,1))+1))","v":"2024-02-25"},{"$f":"R7+1","v":"2024-02-26"},"2024-02-27","2024-02-28","2024-02-29","2024-03-01","2024-03-02",null,{"$f":"IF(B2=\"M\",(IF(DAY(DATE($O$2,$AC$4,1)-WEEKDAY(DATE($O$2,$AC$4,1))+2)=2,DATE($O$2,$AC$4,1)-WEEKDAY(DATE($O$2,$AC$4,1))-5,DATE($O$2,$AC$4,1)-WEEKDAY(DATE($O$2,$AC$4,1))+2)),IF(B2=\"S\",DATE($O$2,$AC$4,1)-WEEKDAY(DATE($O$2,$AC$4,1))+1))","v":"2024-03-31"},{"$f":"Z7+1","v":"2024-04-01"},"2024-04-02","2024-04-03","2024-04-04","2024-04-05","2024-04-06"]
[null,{"$f":"B7+7","v":"2024-01-07"},{"$f":"C7+7","v":"2024-01-08"},"2024-01-09","2024-01-10","2024-01-11","2024-01-12","2024-01-13",null,{"$f":"J7+7","v":"2024-02-04"},"2024-02-05","2024-02-06","2024-02-07","2024-02-08","2024-02-09","2024-02-10",null,{"$f":"R7+7","v":"2024-03-03"},"2024-03-04","2024-03-05","2024-03-06","2024-03-07","2024-03-08","2024-03-09",null,{"$f":"Z7+7","v":"2024-04-07"},"2024-04-08","2024-04-09","2024-04-10","2024-04-11","2024-04-12","2024-04-13"]
[null,{"$f":"B8+7","v":"2024-01-14"},"2024-01-15","2024-01-16","2024-01-17","2024-01-18","2024-01-19","2024-01-20",null,"2024-02-11","2024-02-12","2024-02-13","2024-02-14","2024-02-15","2024-02-16","2024-02-17",null,"2024-03-10","2024-03-11","2024-03-12","2024-03-13","2024-03-14","2024-03-15","2024-03-16",null,"2024-04-14","2024-04-15","2024-04-16","2024-04-17","2024-04-18","2024-04-19","2024-04-20"]
[null,{"$f":"B9+7","v":"2024-01-21"},"2024-01-22","2024-01-23","2024-01-24","2024-01-25","2024-01-26","2024-01-27",null,"2024-02-18","2024-02-19","2024-02-20","2024-02-21","2024-02-22","2024-02-23","2024-02-24",null,"2024-03-17","2024-03-18","2024-03-19","2024-03-20","2024-03-21","2024-03-22","2024-03-23",null,"2024-04-21","2024-04-22","2024-04-23","2024-04-24","2024-04-25","2024-04-26","2024-04-27"]
[null,{"$f":"B10+7","v":"2024-01-28"},"2024-01-29","2024-01-30","2024-01-31","2024-02-01","2024-02-02","2024-02-03",null,"2024-02-25","2024-02-26","2024-02-27","2024-02-28","2024-02-29","2024-03-01","2024-03-02",null,"2024-03-24","2024-03-25","2024-03-26","2024-03-27","2024-03-28","2024-03-29","2024-03-30",null,"2024-04-28","2024-04-29","2024-04-30","2024-05-01","2024-05-02","2024-05-03","2024-05-04"]
[null,{"$f":"B11+7","v":"2024-02-04"},"2024-02-05","2024-02-06","2024-02-07","2024-02-08","2024-02-09","2024-02-10",null,"2024-03-03","2024-03-04","2024-03-05","2024-03-06","2024-03-07","2024-03-08","2024-03-09",null,"2024-03-31","2024-04-01","2024-04-02","2024-04-03","2024-04-04","2024-04-05","2024-04-06",null,"2024-05-05","2024-05-06","2024-05-07","2024-05-08","2024-05-09","2024-05-10","2024-05-11"]
[]
[null,null,null,null,5,null,null,null,null,null,null,null,6,null,null,null,null,null,null,null,7,null,null,null,null,null,null,null,8]
[]
[null,{"$f":"IF($B$2=\"S\",\"S\",IF($B$2=\"M\",\"M\"))","v":"S"},{"$f":"IF($B$2=\"S\",\"M\",IF($B$2=\"M\",\"T\"))","v":"M"},{"$f":"IF($B$2=\"S\",\"T\",IF($B$2=\"M\",\"W\"))","v":"T"},{"$f":"IF($B$2=\"S\",\"W\",IF($B$2=\"M\",\"T\"))","v":"W"},{"$f":"IF($B$2=\"S\",\"T\",IF($B$2=\"M\",\"F\"))","v":"T"},{"$f":"IF($B$2=\"S\",\"F\",IF($B$2=\"M\",\"S\"))","v":"F"},"S",null,{"$f":"IF($B$2=\"S\",\"S\",IF($B$2=\"M\",\"M\"))","v":"S"},{"$f":"IF($B$2=\"S\",\"M\",IF($B$2=\"M\",\"T\"))","v":"M"},{"$f":"IF($B$2=\"S\",\"T\",IF($B$2=\"M\",\"W\"))","v":"T"},{"$f":"IF($B$2=\"S\",\"W\",IF($B$2=\"M\",\"T\"))","v":"W"},{"$f":"IF($B$2=\"S\",\"T\",IF($B$2=\"M\",\"F\"))","v":"T"},{"$f":"IF($B$2=\"S\",\"F\",IF($B$2=\"M\",\"S\"))","v":"F"},"S",null,{"$f":"IF($B$2=\"S\",\"S\",IF($B$2=\"M\",\"M\"))","v":"S"},{"$f":"IF($B$2=\"S\",\"M\",IF($B$2=\"M\",\"T\"))","v":"M"},{"$f":"IF($B$2=\"S\",\"T\",IF($B$2=\"M\",\"W\"))","v":"T"},{"$f":"IF($B$2=\"S\",\"W\",IF($B$2=\"M\",\"T\"))","v":"W"},{"$f":"IF($B$2=\"S\",\"T\",IF($B$2=\"M\",\"F\"))","v":"T"},{"$f":"IF($B$2=\"S\",\"F\",IF($B$2=\"M\",\"S\"))","v":"F"},"S",null,{"$f":"IF($B$2=\"S\",\"S\",IF($B$2=\"M\",\"M\"))","v":"S"},{"$f":"IF($B$2=\"S\",\"M\",IF($B$2=\"M\",\"T\"))","v":"M"},{"$f":"IF($B$2=\"S\",\"T\",IF($B$2=\"M\",\"W\"))","v":"T"},{"$f":"IF($B$2=\"S\",\"W\",IF($B$2=\"M\",\"T\"))","v":"W"},{"$f":"IF($B$2=\"S\",\"T\",IF($B$2=\"M\",\"F\"))","v":"T"},{"$f":"IF($B$2=\"S\",\"F\",IF($B$2=\"M\",\"S\"))","v":"F"},"S"]
[null,{"$f":"IF(B2=\"M\",(IF(DAY(DATE($O$2,$E$14,1)-WEEKDAY(DATE($O$2,$E$14,1))+2)=2,DATE($O$2,$E$14,1)-WEEKDAY(DATE($O$2,$E$14,1))-5,DATE($O$2,$E$14,1)-WEEKDAY(DATE($O$2,$E$14,1))+2)),IF(B2=\"S\",DATE($O$2,$E$14,1)-WEEKDAY(DATE($O$2,$E$14,1))+1))","v":"2024-04-28"},{"$f":"B17+1","v":"2024-04-29"},"2024-04-30","2024-05-01","2024-05-02","2024-05-03","2024-05-04",null,{"$f":"IF(B2=\"M\",(IF(DAY(DATE($O$2,$M$14,1)-WEEKDAY(DATE($O$2,$M$14,1))+2)=2,DATE($O$2,$M$14,1)-WEEKDAY(DATE($O$2,$M$14,1))-5,DATE($O$2,$M$14,1)-WEEKDAY(DATE($O$2,$M$14,1))+2)),IF(B2=\"S\",DATE($O$2,$M$14,1)-WEEKDAY(DATE($O$2,$M$14,1))+1))","v":"2024-05-26"},{"$f":"J17+1","v":"2024-05-27"},"2024-05-28","2024-05-29","2024-05-30","2024-05-31","2024-06-01",null,{"$f":"IF(B2=\"M\",(IF(DAY(DATE($O$2,$U$14,1)-WEEKDAY(DATE($O$2,$U$14,1))+2)=2,DATE($O$2,$U$14,1)-WEEKDAY(DATE($O$2,$U$14,1))-5,DATE($O$2,$U$14,1)-WEEKDAY(DATE($O$2,$U$14,1))+2)),IF(B2=\"S\",DATE($O$2,$U$14,1)-WEEKDAY(DATE($O$2,$U$14,1))+1))","v":"2024-06-30"},{"$f":"R17+1","v":"2024-07-01"},"2024-07-02","2024-07-03","2024-07-04","2024-07-05","2024-07-06",null,{"$f":"IF(B2=\"M\",(IF(DAY(DATE($O$2,$AC$14,1)-WEEKDAY(DATE($O$2,$AC$14,1))+2)=2,DATE($O$2,$AC$14,1)-WEEKDAY(DATE($O$2,$AC$14,1))-5,DATE($O$2,$AC$14,1)-WEEKDAY(DATE($O$2,$AC$14,1))+2)),IF(B2=\"S\",DATE($O$2,$AC$14,1)-WEEKDAY(DATE($O$2,$AC$14,1))+1))","v":"2024-07-28"},{"$f":"Z17+1","v":"2024-07-29"},"2024-07-30","2024-07-31","2024-08-01","2024-08-02","2024-08-03"]
[null,{"$f":"B17+7","v":"2024-05-05"},"2024-05-06","2024-05-07","2024-05-08","2024-05-09","2024-05-10","2024-05-11",null,{"$f":"J17+7","v":"2024-06-02"},"2024-06-03","2024-06-04","2024-06-05","2024-06-06","2024-06-07","2024-06-08",null,{"$f":"R17+7","v":"2024-07-07"},"2024-07-08","2024-07-09","2024-07-10","2024-07-11","2024-07-12","2024-07-13",null,{"$f":"Z17+7","v":"2024-08-04"},"2024-08-05","2024-08-06","2024-08-07","2024-08-08","2024-08-09","2024-08-10"]
[null,"2024-05-12","2024-05-13","2024-05-14","2024-05-15","2024-05-16","2024-05-17","2024-05-18",null,"2024-06-09","2024-06-10","2024-06-11","2024-06-12","2024-06-13","2024-06-14","2024-06-15",null,"2024-07-14","2024-07-15","2024-07-16","2024-07-17","2024-07-18","2024-07-19","2024-07-20",null,"2024-08-11","2024-08-12","2024-08-13","2024-08-14","2024-08-15","2024-08-16","2024-08-17"]
[null,"2024-05-19","2024-05-20","2024-05-21","2024-05-22","2024-05-23","2024-05-24","2024-05-25",null,"2024-06-16","2024-06-17","2024-06-18","2024-06-19","2024-06-20","2024-06-21","2024-06-22",null,"2024-07-21","2024-07-22","2024-07-23","2024-07-24","2024-07-25","2024-07-26","2024-07-27",null,"2024-08-18","2024-08-19","2024-08-20","2024-08-21","2024-08-22","2024-08-23","2024-08-24"]
[null,"2024-05-26","2024-05-27","2024-05-28","2024-05-29","2024-05-30","2024-05-31","2024-06-01",null,"2024-06-23","2024-06-24","2024-06-25","2024-06-26","2024-06-27","2024-06-28","2024-06-29",null,"2024-07-28","2024-07-29","2024-07-30","2024-07-31","2024-08-01","2024-08-02","2024-08-03",null,"2024-08-25","2024-08-26","2024-08-27","2024-08-28","2024-08-29","2024-08-30","2024-08-31"]
[null,"2024-06-02","2024-06-03","2024-06-04","2024-06-05","2024-06-06","2024-06-07","2024-06-08",null,"2024-06-30","2024-07-01","2024-07-02","2024-07-03","2024-07-04","2024-07-05","2024-07-06",null,"2024-08-04","2024-08-05","2024-08-06","2024-08-07","2024-08-08","2024-08-09","2024-08-10",null,"2024-09-01","2024-09-02","2024-09-03","2024-09-04","2024-09-05","2024-09-06","2024-09-07"]
[]
[null,null,null,null,9,null,null,null,null,null,null,null,10,null,null,null,null,null,null,null,11,null,null,null,null,null,null,null,12]
[]
[null,{"$f":"IF($B$2=\"S\",\"S\",IF($B$2=\"M\",\"M\"))","v":"S"},{"$f":"IF($B$2=\"S\",\"M\",IF($B$2=\"M\",\"T\"))","v":"M"},{"$f":"IF($B$2=\"S\",\"T\",IF($B$2=\"M\",\"W\"))","v":"T"},{"$f":"IF($B$2=\"S\",\"W\",IF($B$2=\"M\",\"T\"))","v":"W"},{"$f":"IF($B$2=\"S\",\"T\",IF($B$2=\"M\",\"F\"))","v":"T"},{"$f":"IF($B$2=\"S\",\"F\",IF($B$2=\"M\",\"S\"))","v":"F"},"S",null,{"$f":"IF($B$2=\"S\",\"S\",IF($B$2=\"M\",\"M\"))","v":"S"},{"$f":"IF($B$2=\"S\",\"M\",IF($B$2=\"M\",\"T\"))","v":"M"},{"$f":"IF($B$2=\"S\",\"T\",IF($B$2=\"M\",\"W\"))","v":"T"},{"$f":"IF($B$2=\"S\",\"W\",IF($B$2=\"M\",\"T\"))","v":"W"},{"$f":"IF($B$2=\"S\",\"T\",IF($B$2=\"M\",\"F\"))","v":"T"},{"$f":"IF($B$2=\"S\",\"F\",IF($B$2=\"M\",\"S\"))","v":"F"},"S",null,{"$f":"IF($B$2=\"S\",\"S\",IF($B$2=\"M\",\"M\"))","v":"S"},{"$f":"IF($B$2=\"S\",\"M\",IF($B$2=\"M\",\"T\"))","v":"M"},{"$f":"IF($B$2=\"S\",\"T\",IF($B$2=\"M\",\"W\"))","v":"T"},{"$f":"IF($B$2=\"S\",\"W\",IF($B$2=\"M\",\"T\"))","v":"W"},{"$f":"IF($B$2=\"S\",\"T\",IF($B$2=\"M\",\"F\"))","v":"T"},{"$f":"IF($B$2=\"S\",\"F\",IF($B$2=\"M\",\"S\"))","v":"F"},"S",null,{"$f":"IF($B$2=\"S\",\"S\",IF($B$2=\"M\",\"M\"))","v":"S"},{"$f":"IF($B$2=\"S\",\"M\",IF($B$2=\"M\",\"T\"))","v":"M"},{"$f":"IF($B$2=\"S\",\"T\",IF($B$2=\"M\",\"W\"))","v":"T"},{"$f":"IF($B$2=\"S\",\"W\",IF($B$2=\"M\",\"T\"))","v":"W"},{"$f":"IF($B$2=\"S\",\"T\",IF($B$2=\"M\",\"F\"))","v":"T"},{"$f":"IF($B$2=\"S\",\"F\",IF($B$2=\"M\",\"S\"))","v":"F"},"S"]
[null,{"$f":"IF(B2=\"M\",(IF(DAY(DATE($O$2,$E$24,1)-WEEKDAY(DATE($O$2,$E$24,1))+2)=2,DATE($O$2,$E$24,1)-WEEKDAY(DATE($O$2,$E$24,1))-5,DATE($O$2,$E$24,1)-WEEKDAY(DATE($O$2,$E$24,1))+2)),IF(B2=\"S\",DATE($O$2,$E$24,1)-WEEKDAY(DATE($O$2,$E$24,1))+1))","v":"2024-09-01"},{"$f":"B27+1","v":"2024-09-02"},"2024-09-03","2024-09-04","2024-09-05","2024-09-06","2024-09-07",null,{"$f":"IF(B2=\"M\",(IF(DAY(DATE($O$2,$M$24,1)-WEEKDAY(DATE($O$2,$M$24,1))+2)=2,DATE($O$2,$M$24,1)-WEEKDAY(DATE($O$2,$M$24,1))-5,DATE($O$2,$M$24,1)-WEEKDAY(DATE($O$2,$M$24,1))+2)),IF(B2=\"S\",DATE($O$2,$M$24,1)-WEEKDAY(DATE($O$2,$M$24,1))+1))","v":"2024-09-29"},{"$f":"J27+1","v":"2024-09-30"},"2024-10-01","2024-10-02","2024-10-03","2024-10-04","2024-10-05",null,{"$f":"IF(B2=\"M\",(IF(DAY(DATE($O$2,$U$24,1)-WEEKDAY(DATE($O$2,$U$24,1))+2)=2,DATE($O$2,$U$24,1)-WEEKDAY(DATE($O$2,$U$24,1))-5,DATE($O$2,$U$24,1)-WEEKDAY(DATE($O$2,$U$24,1))+2)),IF(B2=\"S\",DATE($O$2,$U$24,1)-WEEKDAY(DATE($O$2,$U$24,1))+1))","v":"2024-10-27"},{"$f":"R27+1","v":"2024-10-28"},"2024-10-29","2024-10-30","2024-10-31","2024-11-01","2024-11-02",null,{"$f":"IF(B2=\"M\",(IF(DAY(DATE($O$2,$AC$24,1)-WEEKDAY(DATE($O$2,$AC$24,1))+2)=2,DATE($O$2,$AC$24,1)-WEEKDAY(DATE($O$2,$AC$24,1))-5,DATE($O$2,$AC$24,1)-WEEKDAY(DATE($O$2,$AC$24,1))+2)),IF(B2=\"S\",DATE($O$2,$AC$24,1)-WEEKDAY(DATE($O$2,$AC$24,1))+1))","v":"2024-12-01"},{"$f":"Z27+1","v":"2024-12-02"},"2024-12-03","2024-12-04","2024-12-05","2024-12-06","2024-12-07"]
[null,{"$f":"B27+7","v":"2024-09-08"},"2024-09-09","2024-09-10","2024-09-11","2024-09-12","2024-09-13","2024-09-14",null,{"$f":"J27+7","v":"2024-10-06"},"2024-10-07","2024-10-08","2024-10-09","2024-10-10","2024-10-11","2024-10-12",null,{"$f":"R27+7","v":"2024-11-03"},"2024-11-04","2024-11-05","2024-11-06","2024-11-07","2024-11-08","2024-11-09",null,{"$f":"Z27+7","v":"2024-12-08"},"2024-12-09","2024-12-10","2024-12-11","2024-12-12","2024-12-13","2024-12-14"]
[null,"2024-09-15","2024-09-16","2024-09-17","2024-09-18","2024-09-19","2024-09-20","2024-09-21",null,"2024-10-13","2024-10-14","2024-10-15","2024-10-16","2024-10-17","2024-10-18","2024-10-19",null,"2024-11-10","2024-11-11","2024-11-12","2024-11-13","2024-11-14","2024-11-15","2024-11-16",null,"2024-12-15","2024-12-16","2024-12-17","2024-12-18","2024-12-19","2024-12-20","2024-12-21"]
[null,"2024-09-22","2024-09-23","2024-09-24","2024-09-25","2024-09-26","2024-09-27","2024-09-28",null,"2024-10-20","2024-10-21","2024-10-22","2024-10-23","2024-10-24","2024-10-25","2024-10-26",null,"2024-11-17","2024-11-18","2024-11-19","2024-11-20","2024-11-21","2024-11-22","2024-11-23",null,"2024-12-22","2024-12-23","2024-12-24","2024-12-25","2024-12-26","2024-12-27","2024-12-28"]
[null,"2024-09-29","2024-09-30","2024-10-01","2024-10-02","2024-10-03","2024-10-04","2024-10-05",null,"2024-10-27","2024-10-28","2024-10-29","2024-10-30","2024-10-31","2024-11-01","2024-11-02",null,"2024-11-24","2024-11-25","2024-11-26","2024-11-27","2024-11-28","2024-11-29","2024-11-30",null,"2024-12-29","2024-12-30","2024-12-31","2025-01-01","2025-01-02","2025-01-03","2025-01-04"]
[null,"2024-10-06","2024-10-07","2024-10-08","2024-10-09","2024-10-10","2024-10-11","2024-10-12",null,"2024-11-03","2024-11-04","2024-11-05","2024-11-06","2024-11-07","2024-11-08","2024-11-09",null,"2024-12-01","2024-12-02","2024-12-03","2024-12-04","2024-12-05","2024-12-06","2024-12-07",null,"2025-01-05","2025-01-06","2025-01-07","2025-01-08","2025-01-09","2025-01-10","2025-01-11"]

{"sheet":"달력","index":2,"n_rows":4948,"n_cols":20,"rows_kept":4948,"cut":false,"hidden":false,"merged":[[52,1,52,2],[51,1,51,2],[50,1,50,2],[49,1,49,2],[52,9,52,10],[51,9,51,10],[50,9,50,10],[49,9,49,10],[49,7,49,8],[50,7,50,8],[51,7,51,8],[52,7,52,8],[52,5,52,6],[51,5,51,6],[50,5,50,6],[49,5,49,6],[49,13,49,14],[49,11,49,12],[50,11,50,12],[51,11,51,12],[52,11,52,12],[49,3,49,4],[50,3,50,4],[51,3,51,4],[52,3,52,4],[14,3,14,4],[14,5,14,6],[14,7,14,8],[14,9,14,10],[14,11,14,12],[14,13,14,14],[12,1,12,2],[12,3,12,4],[2,1,4,2],[12,11,12,12],[12,9,12,10],[12,13,12,14],[12,5,12,6],[12,7,12,8],[2,9,2,14],[3,9,3,14],[4,9,4,14],[3,3,4,3],[14,1,14,2],[7,1,7,8],[8,1,8,8],[9,1,9,8],[10,1,10,8],[15,13,15,14],[16,1,16,2],[16,3,16,4],[16,5,16,6],[16,7,16,8],[16,9,16,10],[16,11,16,12],[16,13,16,14],[15,1,15,2],[15,3,15,4],[15,5,15,6],[15,7,15,8],[15,9,15,10],[15,11,15,12],[17,13,17,14],[18,1,18,2],[18,3,18,4],[18,5,18,6],[18,7,18,8],[18,9,18,10],[18,11,18,12],[18,13,18,14],[17,1,17,2],[17,3,17,4],[17,5,17,6],[17,7,17,8],[17,9,17,10],[17,11,17,12],[23,3,23,4],[23,5,23,6],[23,7,23,8],[23,9,23,10],[23,11,23,12],[21,13,21,14],[22,1,22,2],[22,3,22,4],[22,5,22,6],[22,7,22,8],[22,9,22,10],[22,11,22,12],[22,13,22,14],[21,1,21,2],[21,3,21,4],[21,5,21,6],[21,7,21,8],[21,9,21,10],[21,11,21,12],[28,1,28,2],[28,3,28,4],[28,5,28,6],[28,7,28,8],[28,9,28,10],[28,11,28,12],[28,13,28,14],[25,1,25,2],[25,3,25,4],[25,5,25,6],[25,7,25,8],[25,9,25,10],[25,11,25,12],[29,13,29,14],[30,1,30,2],[30,3,30,4],[30,5,30,6],[30,7,30,8],[30,9,30,10],[30,11,30,12],[30,13,30,14],[29,1,29,2],[29,3,29,4],[29,5,29,6],[29,7,29,8],[29,9,29,10],[29,11,29,12],[31,13,31,14],[32,1,32,2],[32,3,32,4],[32,5,32,6],[32,7,32,8],[32,9,32,10],[32,11,32,12],[32,13,32,14],[31,1,31,2],[31,3,31,4],[31,5,31,6],[31,7,31,8],[31,9,31,10],[31,11,31,12],[37,3,37,4],[37,5,37,6],[37,7,37,8],[37,9,37,10],[37,11,37,12],[35,13,35,14],[36,1,36,2],[36,3,36,4],[36,5,36,6],[36,7,36,8],[36,9,36,10],[36,11,36,12],[36,13,36,14],[35,1,35,2],[35,3,35,4],[35,5,35,6],[35,7,35,8],[35,9,35,10],[35,11,35,12],[42,1,42,2],[42,3,42,4],[42,5,42,6],[42,7,42,8],[42,9,42,10],[42,11,42,12],[42,13,42,14],[39,1,39,2],[39,3,39,4],[39,5,39,6],[39,7,39,8],[39,9,39,10],[39,11,39,12],[43,13,43,14],[44,1,44,2],[44,3,44,4],[44,5,44,6],[44,7,44,8],[44,9,44,10],[44,11,44,12],[44,13,44,14],[43,1,43,2],[43,3,43,4],[43,5,43,6],[43,7,43,8],[43,9,43,10],[43,11,43,12],[45,13,45,14],[46,1,46,2],[46,3,46,4],[46,5,46,6],[46,7,46,8],[46,9,46,10],[46,11,46,12],[46,13,46,14],[45,1,45,2],[45,3,45,4],[45,5,45,6],[45,7,45,8],[45,9,45,10],[45,11,45,12],[19,1,19,2],[19,3,19,4],[19,5,19,6],[19,7,19,8],[19,9,19,10],[19,11,19,12],[19,13,19,14],[26,1,26,2],[26,3,26,4],[26,5,26,6],[26,7,26,8],[26,9,26,10],[26,11,26,12],[26,13,26,14],[25,13,25,14],[23,13,23,14],[24,1,24,2],[24,3,24,4],[24,5,24,6],[24,7,24,8],[24,9,24,10],[24,11,24,12],[24,13,24,14],[23,1,23,2],[33,1,33,2],[33,3,33,4],[33,5,33,6],[33,7,33,8],[33,9,33,10],[33,11,33,12],[33,13,33,14],[40,1,40,2],[40,3,40,4],[40,5,40,6],[40,7,40,8],[40,9,40,10],[40,11,40,12],[40,13,40,14],[39,13,39,14],[37,13,37,14],[38,1,38,2],[38,3,38,4],[38,5,38,6],[38,7,38,8],[38,9,38,10],[38,11,38,12],[38,13,38,14],[37,1,37,2],[47,1,47,2],[47,3,47,4],[47,5,47,6],[47,7,47,8],[47,9,47,10],[47,11,47,12],[47,13,47,14],[54,1,54,2],[54,3,54,4],[54,5,54,6],[54,7,54,8],[54,9,54,10],[54,11,54,12],[54,13,54,14],[53,1,53,2],[53,3,53,4],[53,5,53,6],[53,7,53,8],[53,9,53,10],[53,11,53,12],[53,13,53,14],[52,13,52,14],[51,13,51,14],[50,13,50,14]]}
[]
[]
[null,3,null,{"$f":"연간!$O$2","v":2024}]
[null,null,null,{"$f":"TEXT(DATE(D3,B3,1),\"mmmm\")","v":"March"}]
[]
[]
[null,"MEMO",null,null,null,null,null,null,"MADE BY 엠키(tabda.tistory.com)"]
[]
[]
[]
[]
[]
[null,{"$f":"IF(연간!$B$2=\"S\",\"SUN\",IF(연간!$B$2=\"M\",\"MON\"))","v":"SUN"},null,{"$f":"IF(연간!$B$2=\"S\",\"MON\",IF(연간!$B$2=\"M\",\"TUE\"))","v":"MON"},null,{"$f":"IF(연간!$B$2=\"S\",\"TUE\",IF(연간!$B$2=\"M\",\"WED\"))","v":"TUE"},null,{"$f":"IF(연간!$B$2=\"S\",\"WED\",IF(연간!$B$2=\"M\",\"THU\"))","v":"WED"},null,{"$f":"IF(연간!$B$2=\"S\",\"THU\",IF(연간!$B$2=\"M\",\"FRI\"))","v":"THU"},null,{"$f":"IF(연간!$B$2=\"S\",\"FRI\",IF(연간!$B$2=\"M\",\"SAT\"))","v":"FRI"},null,{"$f":"IF(연간!$B$2=\"S\",\"SAT\",IF(연간!$B$2=\"M\",\"SUN\"))","v":"SAT"}]
[null,{"$f":"IFERROR(INDEX(공휴일이름,MATCH(1,--($D$3=휴일연도)*($B$3=공휴일월)*(DAY(C14)=공휴일일),0)),\"\")&\"  \"&IFERROR(INDEX(기념일이름,MATCH(1,--($D$3=기념일연도)*($B$3=기념일월)*(DAY(C14)=기념일일),0)),\"\")&\" \"","v":"   "},{"$f":"IF(연간!$B$2=\"M\",(IF(DAY(DATE($D$3,$B$3,1)-WEEKDAY(DATE($D$3,$B$3,1))+2)=2,DATE($D$3,$B$3,1)-WEEKDAY(DATE($D$3,$B$3,1))-5,DATE($D$3,$B$3,1)-WEEKDAY(DATE($D$3,$B$3,1))+2)),IF(연간!$B$2=\"S\",DATE($D$3,$B$3,1)-WEEKDAY(DATE($D$3,$B$3,1))+1))","v":"2024-02-25"},{"$f":"IFERROR(INDEX(공휴일이름,MATCH(1,--($D$3=휴일연도)*($B$3=공휴일월)*(DAY(E14)=공휴일일),0)),\"\")&\"  \"&IFERROR(INDEX(기념일이름,MATCH(1,--($D$3=기념일연도)*($B$3=기념일월)*(DAY(E14)=기념일일),0)),\"\")&\" \"","v":"   "},{"$f":"C14+1","v":"2024-02-26"},{"$f":"IFERROR(INDEX(공휴일이름,MATCH(1,--($D$3=휴일연도)*($B$3=공휴일월)*(DAY(G14)=공휴일일),0)),\"\")&\"  \"&IFERROR(INDEX(기념일이름,MATCH(1,--($D$3=기념일연도)*($B$3=기념일월)*(DAY(G14)=기념일일),0)),\"\")&\" \"","v":"   "},{"$f":"C14+2","v":"2024-02-27"},{"$f":"IFERROR(INDEX(공휴일이름,MATCH(1,--($D$3=휴일연도)*($B$3=공휴일월)*(DAY(I14)=공휴일일),0)),\"\")&\"  \"&IFERROR(INDEX(기념일이름,MATCH(1,--($D$3=기념일연도)*($B$3=기념일월)*(DAY(I14)=기념일일),0)),\"\")&\" \"","v":"   "},{"$f":"C14+3","v":"2024-02-28"},{"$f":"IFERROR(INDEX(공휴일이름,MATCH(1,--($D$3=휴일연도)*($B$3=공휴일월)*(DAY(K14)=공휴일일),0)),\"\")&\"  \"&IFERROR(INDEX(기념일이름,MATCH(1,--($D$3=기념일연도)*($B$3=기념일월)*(DAY(K14)=기념일일),0)),\"\")&\" \"","v":"   "},{"$f":"C14+4","v":"2024-02-29"},{"$f":"IFERROR(INDEX(공휴일이름,MATCH(1,--($D$3=휴일연도)*($B$3=공휴일월)*(DAY(M14)=공휴일일),0)),\"\")&\"  \"&IFERROR(INDEX(기념일이름,MATCH(1,--($D$3=기념일연도)*($B$3=기념일월)*(DAY(M14)=기념일일),0)),\"\")&\" \"","v":"삼일절   "},{"$f":"C14+5","v":"2024-03-01"},{"$f":"IFERROR(INDEX(공휴일이름,MATCH(1,--($D$3=휴일연도)*($B$3=공휴일월)*(DAY(O14)=공휴일일),0)),\"\")&\"  \"&IFERROR(INDEX(기념일이름,MATCH(1,--($D$3=기념일연도)*($B$3=기념일월)*(DAY(O14)=기념일일),0)),\"\")&\" \"","v":"   "},{"$f":"C14+6","v":"2024-03-02"},null,"범례"]
[null,{"$f":"IF(MONTH(C14)<>$B$3,\"\",IF(VLOOKUP(C14,일정,3,0)=0,\"\",VLOOKUP(C14,일정,3,0)))","v":""},null,{"$f":"IF(MONTH(E14)<>$B$3,\"\",IF(VLOOKUP(E14,일정,3,0)=0,\"\",VLOOKUP(E14,일정,3,0)))","v":""},null,{"$f":"IF(MONTH(G14)<>$B$3,\"\",IF(VLOOKUP(G14,일정,3,0)=0,\"\",VLOOKUP(G14,일정,3,0)))","v":""},null,{"$f":"IF(MONTH(I14)<>$B$3,\"\",IF(VLOOKUP(I14,일정,3,0)=0,\"\",VLOOKUP(I14,일정,3,0)))","v":""},null,{"$f":"IF(MONTH(K14)<>$B$3,\"\",IF(VLOOKUP(K14,일정,3,0)=0,\"\",VLOOKUP(K14,일정,3,0)))","v":""},null,{"$f":"IF(MONTH(M14)<>$B$3,\"\",IF(VLOOKUP(M14,일정,3,0)=0,\"\",VLOOKUP(M14,일정,3,0)))","v":""},null,{"$f":"IF(MONTH(O14)<>$B$3,\"\",IF(VLOOKUP(O14,일정,3,0)=0,\"\",VLOOKUP(O14,일정,3,0)))","v":""},null,null,"순번","구분","색상","GetColor"]
[null,{"$f":"IF(MONTH(C14)<>$B$3,\"\",IF(VLOOKUP(C14,일정,5,0)=0,\"\",VLOOKUP(C14,일정,5,0)))","v":""},null,{"$f":"IF(MONTH(E14)<>$B$3,\"\",IF(VLOOKUP(E14,일정,5,0)=0,\"\",VLOOKUP(E14,일정,5,0)))","v":""},null,{"$f":"IF(MONTH(G14)<>$B$3,\"\",IF(VLOOKUP(G14,일정,5,0)=0,\"\",VLOOKUP(G14,일정,5,0)))","v":""},null,{"$f":"IF(MONTH(I14)<>$B$3,\"\",IF(VLOOKUP(I14,일정,5,0)=0,\"\",VLOOKUP(I14,일정,5,0)))","v":""},null,{"$f":"IF(MONTH(K14)<>$B$3,\"\",IF(VLOOKUP(K14,일정,5,0)=0,\"\",VLOOKUP(K14,일정,5,0)))","v":""},null,{"$f":"IF(MONTH(M14)<>$B$3,\"\",IF(VLOOKUP(M14,일정,5,0)=0,\"\",VLOOKUP(M14,일정,5,0)))","v":""},null,{"$f":"IF(MONTH(O14)<>$B$3,\"\",IF(VLOOKUP(O14,일정,5,0)=0,\"\",VLOOKUP(O14,일정,5,0)))","v":""},null,null,{"$f":"IF(R16=\"\",\"\",ROW(P24)-15)","v":9},"구분1",null,{"$f":"GetColor(S16,\"RGB\")","v":"244, 140, 140"}]
[null,{"$f":"IF(MONTH(C14)<>$B$3,\"\",IF(VLOOKUP(C14,일정,7,0)=0,\"\",VLOOKUP(C14,일정,7,0)))","v":""},null,{"$f":"IF(MONTH(E14)<>$B$3,\"\",IF(VLOOKUP(E14,일정,7,0)=0,\"\",VLOOKUP(E14,일정,7,0)))","v":""},null,{"$f":"IF(MONTH(G14)<>$B$3,\"\",IF(VLOOKUP(G14,일정,7,0)=0,\"\",VLOOKUP(G14,일정,7,0)))","v":""},null,{"$f":"IF(MONTH(I14)<>$B$3,\"\",IF(VLOOKUP(I14,일정,7,0)=0,\"\",VLOOKUP(I14,일정,7,0)))","v":""},null,{"$f":"IF(MONTH(K14)<>$B$3,\"\",IF(VLOOKUP(K14,일정,7,0)=0,\"\",VLOOKUP(K14,일정,7,0)))","v":""},null,{"$f":"IF(MONTH(M14)<>$B$3,\"\",IF(VLOOKUP(M14,일정,7,0)=0,\"\",VLOOKUP(M14,일정,7,0)))","v":""},null,{"$f":"IF(MONTH(O14)<>$B$3,\"\",IF(VLOOKUP(O14,일정,7,0)=0,\"\",VLOOKUP(O14,일정,7,0)))","v":""},null,null,{"$f":"IF(R17=\"\",\"\",ROW(P25)-15)","v":10},"구분2",null,{"$f":"GetColor(S17,\"RGB\")","v":"255, 192, 00"}]
[null,{"$f":"IF(MONTH(C14)<>$B$3,\"\",IF(VLOOKUP(C14,일정,9,0)=0,\"\",VLOOKUP(C14,일정,9,0)))","v":""},null,{"$f":"IF(MONTH(E14)<>$B$3,\"\",IF(VLOOKUP(E14,일정,9,0)=0,\"\",VLOOKUP(E14,일정,9,0)))","v":""},null,{"$f":"IF(MONTH(G14)<>$B$3,\"\",IF(VLOOKUP(G14,일정,9,0)=0,\"\",VLOOKUP(G14,일정,9,0)))","v":""},null,{"$f":"IF(MONTH(I14)<>$B$3,\"\",IF(VLOOKUP(I14,일정,9,0)=0,\"\",VLOOKUP(I14,일정,9,0)))","v":""},null,{"$f":"IF(MONTH(K14)<>$B$3,\"\",IF(VLOOKUP(K14,일정,9,0)=0,\"\",VLOOKUP(K14,일정,9,0)))","v":""},null,{"$f":"IF(MONTH(M14)<>$B$3,\"\",IF(VLOOKUP(M14,일정,9,0)=0,\"\",VLOOKUP(M14,일정,9,0)))","v":""},null,{"$f":"IF(MONTH(O14)<>$B$3,\"\",IF(VLOOKUP(O14,일정,9,0)=0,\"\",VLOOKUP(O14,일정,9,0)))","v":""},null,null,{"$f":"IF(R18=\"\",\"\",ROW(P26)-15)","v":11},"구분3",null,"255, 230, 153"]
[null,{"$f":"IF(MONTH(C14)<>$B$3,\"\",IF(VLOOKUP(C14,일정,11,0)=0,\"\",VLOOKUP(C14,일정,11,0)))","v":""},null,{"$f":"IF(MONTH(E14)<>$B$3,\"\",IF(VLOOKUP(E14,일정,11,0)=0,\"\",VLOOKUP(E14,일정,11,0)))","v":""},null,{"$f":"IF(MONTH(G14)<>$B$3,\"\",IF(VLOOKUP(G14,일정,11,0)=0,\"\",VLOOKUP(G14,일정,11,0)))","v":""},null,{"$f":"IF(MONTH(I14)<>$B$3,\"\",IF(VLOOKUP(I14,일정,11,0)=0,\"\",VLOOKUP(I14,일정,11,0)))","v":""},null,{"$f":"IF(MONTH(K14)<>$B$3,\"\",IF(VLOOKUP(K14,일정,11,0)=0,\"\",VLOOKUP(K14,일정,11,0)))","v":""},null,{"$f":"IF(MONTH(M14)<>$B$3,\"\",IF(VLOOKUP(M14,일정,11,0)=0,\"\",VLOOKUP(M14,일정,11,0)))","v":""},null,{"$f":"IF(MONTH(O14)<>$B$3,\"\",IF(VLOOKUP(O14,일정,11,0)=0,\"\",VLOOKUP(O14,일정,11,0)))","v":""},null,null,{"$f":"IF(R19=\"\",\"\",ROW(P28)-15)","v":13},"구분4",null,"198, 224, 180"]
[null,{"$f":"IF(MONTH(C14)<>$B$3,\"\",IF(VLOOKUP(C14,일정,13,0)=0,\"\",VLOOKUP(C14,일정,13,0)))","v":""},null,{"$f":"IF(MONTH(E14)<>$B$3,\"\",IF(VLOOKUP(E14,일정,13,0)=0,\"\",VLOOKUP(E14,일정,13,0)))","v":""},null,{"$f":"IF(MONTH(G14)<>$B$3,\"\",IF(VLOOKUP(G14,일정,13,0)=0,\"\",VLOOKUP(G14,일정,13,0)))","v":""},null,{"$f":"IF(MONTH(I14)<>$B$3,\"\",IF(VLOOKUP(I14,일정,13,0)=0,\"\",VLOOKUP(I14,일정,13,0)))","v":""},null,{"$f":"IF(MONTH(K14)<>$B$3,\"\",IF(VLOOKUP(K14,일정,13,0)=0,\"\",VLOOKUP(K14,일정,13,0)))","v":""},null,{"$f":"IF(MONTH(M14)<>$B$3,\"\",IF(VLOOKUP(M14,일정,13,0)=0,\"\",VLOOKUP(M14,일정,13,0)))","v":""},null,{"$f":"IF(MONTH(O14)<>$B$3,\"\",IF(VLOOKUP(O14,일정,13,0)=0,\"\",VLOOKUP(O14,일정,13,0)))","v":""},null,null,14,"구분5",null,{"$f":"GetColor(S20,\"RGB\")","v":"189, 215, 238"}]
[null,{"$f":"IFERROR(INDEX(공휴일이름,MATCH(1,--($D$3=휴일연도)*($B$3=공휴일월)*(DAY(C21)=공휴일일),0)),\"\")&\"  \"&IFERROR(INDEX(기념일이름,MATCH(1,--($D$3=기념일연도)*($B$3=기념일월)*(DAY(C21)=기념일일),0)),\"\")&\" \"","v":"   "},{"$f":"C14+7","v":"2024-03-03"},{"$f":"IFERROR(INDEX(공휴일이름,MATCH(1,--($D$3=휴일연도)*($B$3=공휴일월)*(DAY(E21)=공휴일일),0)),\"\")&\"  \"&IFERROR(INDEX(기념일이름,MATCH(1,--($D$3=기념일연도)*($B$3=기념일월)*(DAY(E21)=기념일일),0)),\"\")&\" \"","v":"   "},{"$f":"C14+8","v":"2024-03-04"},{"$f":"IFERROR(INDEX(공휴일이름,MATCH(1,--($D$3=휴일연도)*($B$3=공휴일월)*(DAY(G21)=공휴일일),0)),\"\")&\"  \"&IFERROR(INDEX(기념일이름,MATCH(1,--($D$3=기념일연도)*($B$3=기념일월)*(DAY(G21)=기념일일),0)),\"\")&\" \"","v":"   "},{"$f":"C14+9","v":"2024-03-05"},{"$f":"IFERROR(INDEX(공휴일이름,MATCH(1,--($D$3=휴일연도)*($B$3=공휴일월)*(DAY(I21)=공휴일일),0)),\"\")&\"  \"&IFERROR(INDEX(기념일이름,MATCH(1,--($D$3=기념일연도)*($B$3=기념일월)*(DAY(I21)=기념일일),0)),\"\")&\" \"","v":"   "},{"$f":"C14+10","v":"2024-03-06"},{"$f":"IFERROR(INDEX(공휴일이름,MATCH(1,--($D$3=휴일연도)*($B$3=공휴일월)*(DAY(K21)=공휴일일),0)),\"\")&\"  \"&IFERROR(INDEX(기념일이름,MATCH(1,--($D$3=기념일연도)*($B$3=기념일월)*(DAY(K21)=기념일일),0)),\"\")&\" \"","v":"   "},{"$f":"C14+11","v":"2024-03-07"},{"$f":"IFERROR(INDEX(공휴일이름,MATCH(1,--($D$3=휴일연도)*($B$3=공휴일월)*(DAY(M21)=공휴일일),0)),\"\")&\"  \"&IFERROR(INDEX(기념일이름,MATCH(1,--($D$3=기념일연도)*($B$3=기념일월)*(DAY(M21)=기념일일),0)),\"\")&\" \"","v":"   "},{"$f":"C14+12","v":"2024-03-08"},{"$f":"IFERROR(INDEX(공휴일이름,MATCH(1,--($D$3=휴일연도)*($B$3=공휴일월)*(DAY(O21)=공휴일일),0)),\"\")&\"  \"&IFERROR(INDEX(기념일이름,MATCH(1,--($D$3=기념일연도)*($B$3=기념일월)*(DAY(O21)=기념일일),0)),\"\")&\" \"","v":"   "},{"$f":"C14+13","v":"2024-03-09"},null,15,"구분6",null,"238, 199, 239"]
[null,{"$f":"IF(MONTH(C21)<>$B$3,\"\",IF(VLOOKUP(C21,일정,3,0)=0,\"\",VLOOKUP(C21,일정,3,0)))","v":""},null,{"$f":"IF(MONTH(E21)<>$B$3,\"\",IF(VLOOKUP(E21,일정,3,0)=0,\"\",VLOOKUP(E21,일정,3,0)))","v":""},null,{"$f":"IF(MONTH(G21)<>$B$3,\"\",IF(VLOOKUP(G21,일정,3,0)=0,\"\",VLOOKUP(G21,일정,3,0)))","v":""},null,{"$f":"IF(MONTH(I21)<>$B$3,\"\",IF(VLOOKUP(I21,일정,3,0)=0,\"\",VLOOKUP(I21,일정,3,0)))","v":""},null,{"$f":"IF(MONTH(K21)<>$B$3,\"\",IF(VLOOKUP(K21,일정,3,0)=0,\"\",VLOOKUP(K21,일정,3,0)))","v":""},null,{"$f":"IF(MONTH(M21)<>$B$3,\"\",IF(VLOOKUP(M21,일정,3,0)=0,\"\",VLOOKUP(M21,일정,3,0)))","v":""},null,{"$f":"IF(MONTH(O21)<>$B$3,\"\",IF(VLOOKUP(O21,일정,3,0)=0,\"\",VLOOKUP(O21,일정,3,0)))","v":""},null,null,16,"구분7",null,"213, 192, 151"]
[null,{"$f":"IF(MONTH(C21)<>$B$3,\"\",IF(VLOOKUP(C21,일정,5,0)=0,\"\",VLOOKUP(C21,일정,5,0)))","v":""},null,{"$f":"IF(MONTH(E21)<>$B$3,\"\",IF(VLOOKUP(E21,일정,5,0)=0,\"\",VLOOKUP(E21,일정,5,0)))","v":""},null,{"$f":"IF(MONTH(G21)<>$B$3,\"\",IF(VLOOKUP(G21,일정,5,0)=0,\"\",VLOOKUP(G21,일정,5,0)))","v":""},null,{"$f":"IF(MONTH(I21)<>$B$3,\"\",IF(VLOOKUP(I21,일정,5,0)=0,\"\",VLOOKUP(I21,일정,5,0)))","v":""},null,{"$f":"IF(MONTH(K21)<>$B$3,\"\",IF(VLOOKUP(K21,일정,5,0)=0,\"\",VLOOKUP(K21,일정,5,0)))","v":""},null,{"$f":"IF(MONTH(M21)<>$B$3,\"\",IF(VLOOKUP(M21,일정,5,0)=0,\"\",VLOOKUP(M21,일정,5,0)))","v":""},null,{"$f":"IF(MONTH(O21)<>$B$3,\"\",IF(VLOOKUP(O21,일정,5,0)=0,\"\",VLOOKUP(O21,일정,5,0)))","v":""},null,null,17,"구분8",null,"171, 171, 171"]
[null,{"$f":"IF(MONTH(C21)<>$B$3,\"\",IF(VLOOKUP(C21,일정,7,0)=0,\"\",VLOOKUP(C21,일정,7,0)))","v":""},null,{"$f":"IF(MONTH(E21)<>$B$3,\"\",IF(VLOOKUP(E21,일정,7,0)=0,\"\",VLOOKUP(E21,일정,7,0)))","v":""},null,{"$f":"IF(MONTH(G21)<>$B$3,\"\",IF(VLOOKUP(G21,일정,7,0)=0,\"\",VLOOKUP(G21,일정,7,0)))","v":""},null,{"$f":"IF(MONTH(I21)<>$B$3,\"\",IF(VLOOKUP(I21,일정,7,0)=0,\"\",VLOOKUP(I21,일정,7,0)))","v":""},null,{"$f":"IF(MONTH(K21)<>$B$3,\"\",IF(VLOOKUP(K21,일정,7,0)=0,\"\",VLOOKUP(K21,일정,7,0)))","v":""},null,{"$f":"IF(MONTH(M21)<>$B$3,\"\",IF(VLOOKUP(M21,일정,7,0)=0,\"\",VLOOKUP(M21,일정,7,0)))","v":""},null,{"$f":"IF(MONTH(O21)<>$B$3,\"\",IF(VLOOKUP(O21,일정,7,0)=0,\"\",VLOOKUP(O21,일정,7,0)))","v":""},null,null,18,"구분9",null,"178, 185, 252"]
[null,{"$f":"IF(MONTH(C21)<>$B$3,\"\",IF(VLOOKUP(C21,일정,9,0)=0,\"\",VLOOKUP(C21,일정,9,0)))","v":""},null,{"$f":"IF(MONTH(E21)<>$B$3,\"\",IF(VLOOKUP(E21,일정,9,0)=0,\"\",VLOOKUP(E21,일정,9,0)))","v":""},null,{"$f":"IF(MONTH(G21)<>$B$3,\"\",IF(VLOOKUP(G21,일정,9,0)=0,\"\",VLOOKUP(G21,일정,9,0)))","v":""},null,{"$f":"IF(MONTH(I21)<>$B$3,\"\",IF(VLOOKUP(I21,일정,9,0)=0,\"\",VLOOKUP(I21,일정,9,0)))","v":""},null,{"$f":"IF(MONTH(K21)<>$B$3,\"\",IF(VLOOKUP(K21,일정,9,0)=0,\"\",VLOOKUP(K21,일정,9,0)))","v":""},null,{"$f":"IF(MONTH(M21)<>$B$3,\"\",IF(VLOOKUP(M21,일정,9,0)=0,\"\",VLOOKUP(M21,일정,9,0)))","v":""},null,{"$f":"IF(MONTH(O21)<>$B$3,\"\",IF(VLOOKUP(O21,일정,9,0)=0,\"\",VLOOKUP(O21,일정,9,0)))","v":""},null,null,{"$f":"IF(R25=\"\",\"\",ROW(P35)-15)","v":20},"구분10",null,"255, 217, 217"]
[null,{"$f":"IF(MONTH(C21)<>$B$3,\"\",IF(VLOOKUP(C21,일정,11,0)=0,\"\",VLOOKUP(C21,일정,11,0)))","v":""},null,{"$f":"IF(MONTH(E21)<>$B$3,\"\",IF(VLOOKUP(E21,일정,11,0)=0,\"\",VLOOKUP(E21,일정,11,0)))","v":""},null,{"$f":"IF(MONTH(G21)<>$B$3,\"\",IF(VLOOKUP(G21,일정,11,0)=0,\"\",VLOOKUP(G21,일정,11,0)))","v":""},null,{"$f":"IF(MONTH(I21)<>$B$3,\"\",IF(VLOOKUP(I21,일정,11,0)=0,\"\",VLOOKUP(I21,일정,11,0)))","v":""},null,{"$f":"IF(MONTH(K21)<>$B$3,\"\",IF(VLOOKUP(K21,일정,11,0)=0,\"\",VLOOKUP(K21,일정,11,0)))","v":""},null,{"$f":"IF(MONTH(M21)<>$B$3,\"\",IF(VLOOKUP(M21,일정,11,0)=0,\"\",VLOOKUP(M21,일정,11,0)))","v":""},null,{"$f":"IF(MONTH(O21)<>$B$3,\"\",IF(VLOOKUP(O21,일정,11,0)=0,\"\",VLOOKUP(O21,일정,11,0)))","v":""},null,null,21,"구분11",null,"190, 89, 78"]
[null,{"$f":"IF(MONTH(C21)<>$B$3,\"\",IF(VLOOKUP(C21,일정,13,0)=0,\"\",VLOOKUP(C21,일정,13,0)))","v":""},null,{"$f":"IF(MONTH(E21)<>$B$3,\"\",IF(VLOOKUP(E21,일정,13,0)=0,\"\",VLOOKUP(E21,일정,13,0)))","v":""},null,{"$f":"IF(MONTH(G21)<>$B$3,\"\",IF(VLOOKUP(G21,일정,13,0)=0,\"\",VLOOKUP(G21,일정,13,0)))","v":""},null,{"$f":"IF(MONTH(I21)<>$B$3,\"\",IF(VLOOKUP(I21,일정,13,0)=0,\"\",VLOOKUP(I21,일정,13,0)))","v":""},null,{"$f":"IF(MONTH(K21)<>$B$3,\"\",IF(VLOOKUP(K21,일정,13,0)=0,\"\",VLOOKUP(K21,일정,13,0)))","v":""},null,{"$f":"IF(MONTH(M21)<>$B$3,\"\",IF(VLOOKUP(M21,일정,13,0)=0,\"\",VLOOKUP(M21,일정,13,0)))","v":""},null,{"$f":"IF(MONTH(O21)<>$B$3,\"\",IF(VLOOKUP(O21,일정,13,0)=0,\"\",VLOOKUP(O21,일정,13,0)))","v":""},null,null,22,"구분12",null,"222, 203, 62"]
[null,{"$f":"IFERROR(INDEX(공휴일이름,MATCH(1,--($D$3=휴일연도)*($B$3=공휴일월)*(DAY(C28)=공휴일일),0)),\"\")&\"  \"&IFERROR(INDEX(기념일이름,MATCH(1,--($D$3=기념일연도)*($B$3=기념일월)*(DAY(C28)=기념일일),0)),\"\")&\" \"","v":"   "},{"$f":"C14+14","v":"2024-03-10"},{"$f":"IFERROR(INDEX(공휴일이름,MATCH(1,--($D$3=휴일연도)*($B$3=공휴일월)*(DAY(E28)=공휴일일),0)),\"\")&\"  \"&IFERROR(INDEX(기념일이름,MATCH(1,--($D$3=기념일연도)*($B$3=기념일월)*(DAY(E28)=기념일일),0)),\"\")&\" \"","v":"   "},{"$f":"C14+15","v":"2024-03-11"},{"$f":"IFERROR(INDEX(공휴일이름,MATCH(1,--($D$3=휴일연도)*($B$3=공휴일월)*(DAY(G28)=공휴일일),0)),\"\")&\"  \"&IFERROR(INDEX(기념일이름,MATCH(1,--($D$3=기념일연도)*($B$3=기념일월)*(DAY(G28)=기념일일),0)),\"\")&\" \"","v":"   "},{"$f":"C14+16","v":"2024-03-12"},{"$f":"IFERROR(INDEX(공휴일이름,MATCH(1,--($D$3=휴일연도)*($B$3=공휴일월)*(DAY(I28)=공휴일일),0)),\"\")&\"  \"&IFERROR(INDEX(기념일이름,MATCH(1,--($D$3=기념일연도)*($B$3=기념일월)*(DAY(I28)=기념일일),0)),\"\")&\" \"","v":"   "},{"$f":"C14+17","v":"2024-03-13"},{"$f":"IFERROR(INDEX(공휴일이름,MATCH(1,--($D$3=휴일연도)*($B$3=공휴일월)*(DAY(K28)=공휴일일),0)),\"\")&\"  \"&IFERROR(INDEX(기념일이름,MATCH(1,--($D$3=기념일연도)*($B$3=기념일월)*(DAY(K28)=기념일일),0)),\"\")&\" \"","v":"   "},{"$f":"C14+18","v":"2024-03-14"},{"$f":"IFERROR(INDEX(공휴일이름,MATCH(1,--($D$3=휴일연도)*($B$3=공휴일월)*(DAY(M28)=공휴일일),0)),\"\")&\"  \"&IFERROR(INDEX(기념일이름,MATCH(1,--($D$3=기념일연도)*($B$3=기념일월)*(DAY(M28)=기념일일),0)),\"\")&\" \"","v":"   "},{"$f":"C14+19","v":"2024-03-15"},{"$f":"IFERROR(INDEX(공휴일이름,MATCH(1,--($D$3=휴일연도)*($B$3=공휴일월)*(DAY(O28)=공휴일일),0)),\"\")&\"  \"&IFERROR(INDEX(기념일이름,MATCH(1,--($D$3=기념일연도)*($B$3=기념일월)*(DAY(O28)=기념일일),0)),\"\")&\" \"","v":"   "},{"$f":"C14+20","v":"2024-03-16"},null,23,"구분13",null,"171, 186, 32"]
[null,{"$f":"IF(MONTH(C28)<>$B$3,\"\",IF(VLOOKUP(C28,일정,3,0)=0,\"\",VLOOKUP(C28,일정,3,0)))","v":""},null,{"$f":"IF(MONTH(E28)<>$B$3,\"\",IF(VLOOKUP(E28,일정,3,0)=0,\"\",VLOOKUP(E28,일정,3,0)))","v":""},null,{"$f":"IF(MONTH(G28)<>$B$3,\"\",IF(VLOOKUP(G28,일정,3,0)=0,\"\",VLOOKUP(G28,일정,3,0)))","v":""},null,{"$f":"IF(MONTH(I28)<>$B$3,\"\",IF(VLOOKUP(I28,일정,3,0)=0,\"\",VLOOKUP(I28,일정,3,0)))","v":""},null,{"$f":"IF(MONTH(K28)<>$B$3,\"\",IF(VLOOKUP(K28,일정,3,0)=0,\"\",VLOOKUP(K28,일정,3,0)))","v":""},null,{"$f":"IF(MONTH(M28)<>$B$3,\"\",IF(VLOOKUP(M28,일정,3,0)=0,\"\",VLOOKUP(M28,일정,3,0)))","v":""},null,{"$f":"IF(MONTH(O28)<>$B$3,\"\",IF(VLOOKUP(O28,일정,3,0)=0,\"\",VLOOKUP(O28,일정,3,0)))","v":""},null,null,24,"구분14",null,"104, 126, 222"]
[null,{"$f":"IF(MONTH(C28)<>$B$3,\"\",IF(VLOOKUP(C28,일정,5,0)=0,\"\",VLOOKUP(C28,일정,5,0)))","v":""},null,{"$f":"IF(MONTH(E28)<>$B$3,\"\",IF(VLOOKUP(E28,일정,5,0)=0,\"\",VLOOKUP(E28,일정,5,0)))","v":""},null,{"$f":"IF(MONTH(G28)<>$B$3,\"\",IF(VLOOKUP(G28,일정,5,0)=0,\"\",VLOOKUP(G28,일정,5,0)))","v":""},null,{"$f":"IF(MONTH(I28)<>$B$3,\"\",IF(VLOOKUP(I28,일정,5,0)=0,\"\",VLOOKUP(I28,일정,5,0)))","v":""},null,{"$f":"IF(MONTH(K28)<>$B$3,\"\",IF(VLOOKUP(K28,일정,5,0)=0,\"\",VLOOKUP(K28,일정,5,0)))","v":""},null,{"$f":"IF(MONTH(M28)<>$B$3,\"\",IF(VLOOKUP(M28,일정,5,0)=0,\"\",VLOOKUP(M28,일정,5,0)))","v":""},null,{"$f":"IF(MONTH(O28)<>$B$3,\"\",IF(VLOOKUP(O28,일정,5,0)=0,\"\",VLOOKUP(O28,일정,5,0)))","v":""},null,null,25,"구분15",null,"139, 84, 212"]
[null,{"$f":"IF(MONTH(C28)<>$B$3,\"\",IF(VLOOKUP(C28,일정,7,0)=0,\"\",VLOOKUP(C28,일정,7,0)))","v":""},null,{"$f":"IF(MONTH(E28)<>$B$3,\"\",IF(VLOOKUP(E28,일정,7,0)=0,\"\",VLOOKUP(E28,일정,7,0)))","v":""},null,{"$f":"IF(MONTH(G28)<>$B$3,\"\",IF(VLOOKUP(G28,일정,7,0)=0,\"\",VLOOKUP(G28,일정,7,0)))","v":""},null,{"$f":"IF(MONTH(I28)<>$B$3,\"\",IF(VLOOKUP(I28,일정,7,0)=0,\"\",VLOOKUP(I28,일정,7,0)))","v":""},null,{"$f":"IF(MONTH(K28)<>$B$3,\"\",IF(VLOOKUP(K28,일정,7,0)=0,\"\",VLOOKUP(K28,일정,7,0)))","v":""},null,{"$f":"IF(MONTH(M28)<>$B$3,\"\",IF(VLOOKUP(M28,일정,7,0)=0,\"\",VLOOKUP(M28,일정,7,0)))","v":""},null,{"$f":"IF(MONTH(O28)<>$B$3,\"\",IF(VLOOKUP(O28,일정,7,0)=0,\"\",VLOOKUP(O28,일정,7,0)))","v":""}]
[null,{"$f":"IF(MONTH(C28)<>$B$3,\"\",IF(VLOOKUP(C28,일정,9,0)=0,\"\",VLOOKUP(C28,일정,9,0)))","v":""},null,{"$f":"IF(MONTH(E28)<>$B$3,\"\",IF(VLOOKUP(E28,일정,9,0)=0,\"\",VLOOKUP(E28,일정,9,0)))","v":""},null,{"$f":"IF(MONTH(G28)<>$B$3,\"\",IF(VLOOKUP(G28,일정,9,0)=0,\"\",VLOOKUP(G28,일정,9,0)))","v":""},null,{"$f":"IF(MONTH(I28)<>$B$3,\"\",IF(VLOOKUP(I28,일정,9,0)=0,\"\",VLOOKUP(I28,일정,9,0)))","v":""},null,{"$f":"IF(MONTH(K28)<>$B$3,\"\",IF(VLOOKUP(K28,일정,9,0)=0,\"\",VLOOKUP(K28,일정,9,0)))","v":""},null,{"$f":"IF(MONTH(M28)<>$B$3,\"\",IF(VLOOKUP(M28,일정,9,0)=0,\"\",VLOOKUP(M28,일정,9,0)))","v":""},null,{"$f":"IF(MONTH(O28)<>$B$3,\"\",IF(VLOOKUP(O28,일정,9,0)=0,\"\",VLOOKUP(O28,일정,9,0)))","v":""}]
[null,{"$f":"IF(MONTH(C28)<>$B$3,\"\",IF(VLOOKUP(C28,일정,11,0)=0,\"\",VLOOKUP(C28,일정,11,0)))","v":""},null,{"$f":"IF(MONTH(E28)<>$B$3,\"\",IF(VLOOKUP(E28,일정,11,0)=0,\"\",VLOOKUP(E28,일정,11,0)))","v":""},null,{"$f":"IF(MONTH(G28)<>$B$3,\"\",IF(VLOOKUP(G28,일정,11,0)=0,\"\",VLOOKUP(G28,일정,11,0)))","v":""},null,{"$f":"IF(MONTH(I28)<>$B$3,\"\",IF(VLOOKUP(I28,일정,11,0)=0,\"\",VLOOKUP(I28,일정,11,0)))","v":""},null,{"$f":"IF(MONTH(K28)<>$B$3,\"\",IF(VLOOKUP(K28,일정,11,0)=0,\"\",VLOOKUP(K28,일정,11,0)))","v":""},null,{"$f":"IF(MONTH(M28)<>$B$3,\"\",IF(VLOOKUP(M28,일정,11,0)=0,\"\",VLOOKUP(M28,일정,11,0)))","v":""},null,{"$f":"IF(MONTH(O28)<>$B$3,\"\",IF(VLOOKUP(O28,일정,11,0)=0,\"\",VLOOKUP(O28,일정,11,0)))","v":""}]
[null,{"$f":"IF(MONTH(C28)<>$B$3,\"\",IF(VLOOKUP(C28,일정,13,0)=0,\"\",VLOOKUP(C28,일정,13,0)))","v":""},null,{"$f":"IF(MONTH(E28)<>$B$3,\"\",IF(VLOOKUP(E28,일정,13,0)=0,\"\",VLOOKUP(E28,일정,13,0)))","v":""},null,{"$f":"IF(MONTH(G28)<>$B$3,\"\",IF(VLOOKUP(G28,일정,13,0)=0,\"\",VLOOKUP(G28,일정,13,0)))","v":""},null,{"$f":"IF(MONTH(I28)<>$B$3,\"\",IF(VLOOKUP(I28,일정,13,0)=0,\"\",VLOOKUP(I28,일정,13,0)))","v":""},null,{"$f":"IF(MONTH(K28)<>$B$3,\"\",IF(VLOOKUP(K28,일정,13,0)=0,\"\",VLOOKUP(K28,일정,13,0)))","v":""},null,{"$f":"IF(MONTH(M28)<>$B$3,\"\",IF(VLOOKUP(M28,일정,13,0)=0,\"\",VLOOKUP(M28,일정,13,0)))","v":""},null,{"$f":"IF(MONTH(O28)<>$B$3,\"\",IF(VLOOKUP(O28,일정,13,0)=0,\"\",VLOOKUP(O28,일정,13,0)))","v":""}]
[null,{"$f":"IFERROR(INDEX(공휴일이름,MATCH(1,--($D$3=휴일연도)*($B$3=공휴일월)*(DAY(C35)=공휴일일),0)),\"\")&\"  \"&IFERROR(INDEX(기념일이름,MATCH(1,--($D$3=기념일연도)*($B$3=기념일월)*(DAY(C35)=기념일일),0)),\"\")&\" \"","v":"   "},{"$f":"C14+21","v":"2024-03-17"},{"$f":"IFERROR(INDEX(공휴일이름,MATCH(1,--($D$3=휴일연도)*($B$3=공휴일월)*(DAY(E35)=공휴일일),0)),\"\")&\"  \"&IFERROR(INDEX(기념일이름,MATCH(1,--($D$3=기념일연도)*($B$3=기념일월)*(DAY(E35)=기념일일),0)),\"\")&\" \"","v":"   "},{"$f":"C14+22","v":"2024-03-18"},{"$f":"IFERROR(INDEX(공휴일이름,MATCH(1,--($D$3=휴일연도)*($B$3=공휴일월)*(DAY(G35)=공휴일일),0)),\"\")&\"  \"&IFERROR(INDEX(기념일이름,MATCH(1,--($D$3=기념일연도)*($B$3=기념일월)*(DAY(G35)=기념일일),0)),\"\")&\" \"","v":"   "},{"$f":"C14+23","v":"2024-03-19"},{"$f":"IFERROR(INDEX(공휴일이름,MATCH(1,--($D$3=휴일연도)*($B$3=공휴일월)*(DAY(I35)=공휴일일),0)),\"\")&\"  \"&IFERROR(INDEX(기념일이름,MATCH(1,--($D$3=기념일연도)*($B$3=기념일월)*(DAY(I35)=기념일일),0)),\"\")&\" \"","v":"   "},{"$f":"C14+24","v":"2024-03-20"},{"$f":"IFERROR(INDEX(공휴일이름,MATCH(1,--($D$3=휴일연도)*($B$3=공휴일월)*(DAY(K35)=공휴일일),0)),\"\")&\"  \"&IFERROR(INDEX(기념일이름,MATCH(1,--($D$3=기념일연도)*($B$3=기념일월)*(DAY(K35)=기념일일),0)),\"\")&\" \"","v":"   "},{"$f":"C14+25","v":"2024-03-21"},{"$f":"IFERROR(INDEX(공휴일이름,MATCH(1,--($D$3=휴일연도)*($B$3=공휴일월)*(DAY(M35)=공휴일일),0)),\"\")&\"  \"&IFERROR(INDEX(기념일이름,MATCH(1,--($D$3=기념일연도)*($B$3=기념일월)*(DAY(M35)=기념일일),0)),\"\")&\" \"","v":"   "},{"$f":"C14+26","v":"2024-03-22"},{"$f":"IFERROR(INDEX(공휴일이름,MATCH(1,--($D$3=휴일연도)*($B$3=공휴일월)*(DAY(O35)=공휴일일),0)),\"\")&\"  \"&IFERROR(INDEX(기념일이름,MATCH(1,--($D$3=기념일연도)*($B$3=기념일월)*(DAY(O35)=기념일일),0)),\"\")&\" \"","v":"   "},{"$f":"C14+27","v":"2024-03-23"}]
[null,{"$f":"IF(MONTH(C35)<>$B$3,\"\",IF(VLOOKUP(C35,일정,3,0)=0,\"\",VLOOKUP(C35,일정,3,0)))","v":""},null,{"$f":"IF(MONTH(E35)<>$B$3,\"\",IF(VLOOKUP(E35,일정,3,0)=0,\"\",VLOOKUP(E35,일정,3,0)))","v":""},null,{"$f":"IF(MONTH(G35)<>$B$3,\"\",IF(VLOOKUP(G35,일정,3,0)=0,\"\",VLOOKUP(G35,일정,3,0)))","v":""},null,{"$f":"IF(MONTH(I35)<>$B$3,\"\",IF(VLOOKUP(I35,일정,3,0)=0,\"\",VLOOKUP(I35,일정,3,0)))","v":""},null,{"$f":"IF(MONTH(K35)<>$B$3,\"\",IF(VLOOKUP(K35,일정,3,0)=0,\"\",VLOOKUP(K35,일정,3,0)))","v":""},null,{"$f":"IF(MONTH(M35)<>$B$3,\"\",IF(VLOOKUP(M35,일정,3,0)=0,\"\",VLOOKUP(M35,일정,3,0)))","v":""},null,{"$f":"IF(MONTH(O35)<>$B$3,\"\",IF(VLOOKUP(O35,일정,3,0)=0,\"\",VLOOKUP(O35,일정,3,0)))","v":""}]
[null,{"$f":"IF(MONTH(C35)<>$B$3,\"\",IF(VLOOKUP(C35,일정,5,0)=0,\"\",VLOOKUP(C35,일정,5,0)))","v":""},null,{"$f":"IF(MONTH(E35)<>$B$3,\"\",IF(VLOOKUP(E35,일정,5,0)=0,\"\",VLOOKUP(E35,일정,5,0)))","v":""},null,{"$f":"IF(MONTH(G35)<>$B$3,\"\",IF(VLOOKUP(G35,일정,5,0)=0,\"\",VLOOKUP(G35,일정,5,0)))","v":""},null,{"$f":"IF(MONTH(I35)<>$B$3,\"\",IF(VLOOKUP(I35,일정,5,0)=0,\"\",VLOOKUP(I35,일정,5,0)))","v":""},null,{"$f":"IF(MONTH(K35)<>$B$3,\"\",IF(VLOOKUP(K35,일정,5,0)=0,\"\",VLOOKUP(K35,일정,5,0)))","v":""},null,{"$f":"IF(MONTH(M35)<>$B$3,\"\",IF(VLOOKUP(M35,일정,5,0)=0,\"\",VLOOKUP(M35,일정,5,0)))","v":""},null,{"$f":"IF(MONTH(O35)<>$B$3,\"\",IF(VLOOKUP(O35,일정,5,0)=0,\"\",VLOOKUP(O35,일정,5,0)))","v":""}]
[null,{"$f":"IF(MONTH(C35)<>$B$3,\"\",IF(VLOOKUP(C35,일정,7,0)=0,\"\",VLOOKUP(C35,일정,7,0)))","v":""},null,{"$f":"IF(MONTH(E35)<>$B$3,\"\",IF(VLOOKUP(E35,일정,7,0)=0,\"\",VLOOKUP(E35,일정,7,0)))","v":""},null,{"$f":"IF(MONTH(G35)<>$B$3,\"\",IF(VLOOKUP(G35,일정,7,0)=0,\"\",VLOOKUP(G35,일정,7,0)))","v":""},null,{"$f":"IF(MONTH(I35)<>$B$3,\"\",IF(VLOOKUP(I35,일정,7,0)=0,\"\",VLOOKUP(I35,일정,7,0)))","v":""},null,{"$f":"IF(MONTH(K35)<>$B$3,\"\",IF(VLOOKUP(K35,일정,7,0)=0,\"\",VLOOKUP(K35,일정,7,0)))","v":""},null,{"$f":"IF(MONTH(M35)<>$B$3,\"\",IF(VLOOKUP(M35,일정,7,0)=0,\"\",VLOOKUP(M35,일정,7,0)))","v":""},null,{"$f":"IF(MONTH(O35)<>$B$3,\"\",IF(VLOOKUP(O35,일정,7,0)=0,\"\",VLOOKUP(O35,일정,7,0)))","v":""}]
[null,{"$f":"IF(MONTH(C35)<>$B$3,\"\",IF(VLOOKUP(C35,일정,9,0)=0,\"\",VLOOKUP(C35,일정,9,0)))","v":""},null,{"$f":"IF(MONTH(E35)<>$B$3,\"\",IF(VLOOKUP(E35,일정,9,0)=0,\"\",VLOOKUP(E35,일정,9,0)))","v":""},null,{"$f":"IF(MONTH(G35)<>$B$3,\"\",IF(VLOOKUP(G35,일정,9,0)=0,\"\",VLOOKUP(G35,일정,9,0)))","v":""},null,{"$f":"IF(MONTH(I35)<>$B$3,\"\",IF(VLOOKUP(I35,일정,9,0)=0,\"\",VLOOKUP(I35,일정,9,0)))","v":""},null,{"$f":"IF(MONTH(K35)<>$B$3,\"\",IF(VLOOKUP(K35,일정,9,0)=0,\"\",VLOOKUP(K35,일정,9,0)))","v":""},null,{"$f":"IF(MONTH(M35)<>$B$3,\"\",IF(VLOOKUP(M35,일정,9,0)=0,\"\",VLOOKUP(M35,일정,9,0)))","v":""},null,{"$f":"IF(MONTH(O35)<>$B$3,\"\",IF(VLOOKUP(O35,일정,9,0)=0,\"\",VLOOKUP(O35,일정,9,0)))","v":""}]
[null,{"$f":"IF(MONTH(C35)<>$B$3,\"\",IF(VLOOKUP(C35,일정,11,0)=0,\"\",VLOOKUP(C35,일정,11,0)))","v":""},null,{"$f":"IF(MONTH(E35)<>$B$3,\"\",IF(VLOOKUP(E35,일정,11,0)=0,\"\",VLOOKUP(E35,일정,11,0)))","v":""},null,{"$f":"IF(MONTH(G35)<>$B$3,\"\",IF(VLOOKUP(G35,일정,11,0)=0,\"\",VLOOKUP(G35,일정,11,0)))","v":""},null,{"$f":"IF(MONTH(I35)<>$B$3,\"\",IF(VLOOKUP(I35,일정,11,0)=0,\"\",VLOOKUP(I35,일정,11,0)))","v":""},null,{"$f":"IF(MONTH(K35)<>$B$3,\"\",IF(VLOOKUP(K35,일정,11,0)=0,\"\",VLOOKUP(K35,일정,11,0)))","v":""},null,{"$f":"IF(MONTH(M35)<>$B$3,\"\",IF(VLOOKUP(M35,일정,11,0)=0,\"\",VLOOKUP(M35,일정,11,0)))","v":""},null,{"$f":"IF(MONTH(O35)<>$B$3,\"\",IF(VLOOKUP(O35,일정,11,0)=0,\"\",VLOOKUP(O35,일정,11,0)))","v":""}]
[null,{"$f":"IF(MONTH(C35)<>$B$3,\"\",IF(VLOOKUP(C35,일정,13,0)=0,\"\",VLOOKUP(C35,일정,13,0)))","v":""},null,{"$f":"IF(MONTH(E35)<>$B$3,\"\",IF(VLOOKUP(E35,일정,13,0)=0,\"\",VLOOKUP(E35,일정,13,0)))","v":""},null,{"$f":"IF(MONTH(G35)<>$B$3,\"\",IF(VLOOKUP(G35,일정,13,0)=0,\"\",VLOOKUP(G35,일정,13,0)))","v":""},null,{"$f":"IF(MONTH(I35)<>$B$3,\"\",IF(VLOOKUP(I35,일정,13,0)=0,\"\",VLOOKUP(I35,일정,13,0)))","v":""},null,{"$f":"IF(MONTH(K35)<>$B$3,\"\",IF(VLOOKUP(K35,일정,13,0)=0,\"\",VLOOKUP(K35,일정,13,0)))","v":""},null,{"$f":"IF(MONTH(M35)<>$B$3,\"\",IF(VLOOKUP(M35,일정,13,0)=0,\"\",VLOOKUP(M35,일정,13,0)))","v":""},null,{"$f":"IF(MONTH(O35)<>$B$3,\"\",IF(VLOOKUP(O35,일정,13,0)=0,\"\",VLOOKUP(O35,일정,13,0)))","v":""}]
[null,{"$f":"IFERROR(INDEX(공휴일이름,MATCH(1,--($D$3=휴일연도)*($B$3=공휴일월)*(DAY(C42)=공휴일일),0)),\"\")&\"  \"&IFERROR(INDEX(기념일이름,MATCH(1,--($D$3=기념일연도)*($B$3=기념일월)*(DAY(C42)=기념일일),0)),\"\")&\" \"","v":"   "},{"$f":"C14+28","v":"2024-03-24"},{"$f":"IFERROR(INDEX(공휴일이름,MATCH(1,--($D$3=휴일연도)*($B$3=공휴일월)*(DAY(E42)=공휴일일),0)),\"\")&\"  \"&IFERROR(INDEX(기념일이름,MATCH(1,--($D$3=기념일연도)*($B$3=기념일월)*(DAY(E42)=기념일일),0)),\"\")&\" \"","v":"   "},{"$f":"C14+29","v":"2024-03-25"},{"$f":"IFERROR(INDEX(공휴일이름,MATCH(1,--($D$3=휴일연도)*($B$3=공휴일월)*(DAY(G42)=공휴일일),0)),\"\")&\"  \"&IFERROR(INDEX(기념일이름,MATCH(1,--($D$3=기념일연도)*($B$3=기념일월)*(DAY(G42)=기념일일),0)),\"\")&\" \"","v":"   "},{"$f":"C14+30","v":"2024-03-26"},{"$f":"IFERROR(INDEX(공휴일이름,MATCH(1,--($D$3=휴일연도)*($B$3=공휴일월)*(DAY(I42)=공휴일일),0)),\"\")&\"  \"&IFERROR(INDEX(기념일이름,MATCH(1,--($D$3=기념일연도)*($B$3=기념일월)*(DAY(I42)=기념일일),0)),\"\")&\" \"","v":"   "},{"$f":"C14+31","v":"2024-03-27"},{"$f":"IFERROR(INDEX(공휴일이름,MATCH(1,--($D$3=휴일연도)*($B$3=공휴일월)*(DAY(K42)=공휴일일),0)),\"\")&\"  \"&IFERROR(INDEX(기념일이름,MATCH(1,--($D$3=기념일연도)*($B$3=기념일월)*(DAY(K42)=기념일일),0)),\"\")&\" \"","v":"   "},{"$f":"C14+32","v":"2024-03-28"},{"$f":"IFERROR(INDEX(공휴일이름,MATCH(1,--($D$3=휴일연도)*($B$3=공휴일월)*(DAY(M42)=공휴일일),0)),\"\")&\"  \"&IFERROR(INDEX(기념일이름,MATCH(1,--($D$3=기념일연도)*($B$3=기념일월)*(DAY(M42)=기념일일),0)),\"\")&\" \"","v":"   "},{"$f":"C14+33","v":"2024-03-29"},{"$f":"IFERROR(INDEX(공휴일이름,MATCH(1,--($D$3=휴일연도)*($B$3=공휴일월)*(DAY(O42)=공휴일일),0)),\"\")&\"  \"&IFERROR(INDEX(기념일이름,MATCH(1,--($D$3=기념일연도)*($B$3=기념일월)*(DAY(O42)=기념일일),0)),\"\")&\" \"","v":"   "},{"$f":"C14+34","v":"2024-03-30"}]
[null,{"$f":"IF(MONTH(C42)<>$B$3,\"\",IF(VLOOKUP(C42,일정,3,0)=0,\"\",VLOOKUP(C42,일정,3,0)))","v":""},null,{"$f":"IF(MONTH(E42)<>$B$3,\"\",IF(VLOOKUP(E42,일정,3,0)=0,\"\",VLOOKUP(E42,일정,3,0)))","v":""},null,{"$f":"IF(MONTH(G42)<>$B$3,\"\",IF(VLOOKUP(G42,일정,3,0)=0,\"\",VLOOKUP(G42,일정,3,0)))","v":""},null,{"$f":"IF(MONTH(I42)<>$B$3,\"\",IF(VLOOKUP(I42,일정,3,0)=0,\"\",VLOOKUP(I42,일정,3,0)))","v":""},null,{"$f":"IF(MONTH(K42)<>$B$3,\"\",IF(VLOOKUP(K42,일정,3,0)=0,\"\",VLOOKUP(K42,일정,3,0)))","v":""},null,{"$f":"IF(MONTH(M42)<>$B$3,\"\",IF(VLOOKUP(M42,일정,3,0)=0,\"\",VLOOKUP(M42,일정,3,0)))","v":""},null,{"$f":"IF(MONTH(O42)<>$B$3,\"\",IF(VLOOKUP(O42,일정,3,0)=0,\"\",VLOOKUP(O42,일정,3,0)))","v":""}]
[null,{"$f":"IF(MONTH(C42)<>$B$3,\"\",IF(VLOOKUP(C42,일정,5,0)=0,\"\",VLOOKUP(C42,일정,5,0)))","v":""},null,{"$f":"IF(MONTH(E42)<>$B$3,\"\",IF(VLOOKUP(E42,일정,5,0)=0,\"\",VLOOKUP(E42,일정,5,0)))","v":""},null,{"$f":"IF(MONTH(G42)<>$B$3,\"\",IF(VLOOKUP(G42,일정,5,0)=0,\"\",VLOOKUP(G42,일정,5,0)))","v":""},null,{"$f":"IF(MONTH(I42)<>$B$3,\"\",IF(VLOOKUP(I42,일정,5,0)=0,\"\",VLOOKUP(I42,일정,5,0)))","v":""},null,{"$f":"IF(MONTH(K42)<>$B$3,\"\",IF(VLOOKUP(K42,일정,5,0)=0,\"\",VLOOKUP(K42,일정,5,0)))","v":""},null,{"$f":"IF(MONTH(M42)<>$B$3,\"\",IF(VLOOKUP(M42,일정,5,0)=0,\"\",VLOOKUP(M42,일정,5,0)))","v":""},null,{"$f":"IF(MONTH(O42)<>$B$3,\"\",IF(VLOOKUP(O42,일정,5,0)=0,\"\",VLOOKUP(O42,일정,5,0)))","v":""}]
[null,{"$f":"IF(MONTH(C42)<>$B$3,\"\",IF(VLOOKUP(C42,일정,7,0)=0,\"\",VLOOKUP(C42,일정,7,0)))","v":""},null,{"$f":"IF(MONTH(E42)<>$B$3,\"\",IF(VLOOKUP(E42,일정,7,0)=0,\"\",VLOOKUP(E42,일정,7,0)))","v":""},null,{"$f":"IF(MONTH(G42)<>$B$3,\"\",IF(VLOOKUP(G42,일정,7,0)=0,\"\",VLOOKUP(G42,일정,7,0)))","v":""},null,{"$f":"IF(MONTH(I42)<>$B$3,\"\",IF(VLOOKUP(I42,일정,7,0)=0,\"\",VLOOKUP(I42,일정,7,0)))","v":""},null,{"$f":"IF(MONTH(K42)<>$B$3,\"\",IF(VLOOKUP(K42,일정,7,0)=0,\"\",VLOOKUP(K42,일정,7,0)))","v":""},null,{"$f":"IF(MONTH(M42)<>$B$3,\"\",IF(VLOOKUP(M42,일정,7,0)=0,\"\",VLOOKUP(M42,일정,7,0)))","v":""},null,{"$f":"IF(MONTH(O42)<>$B$3,\"\",IF(VLOOKUP(O42,일정,7,0)=0,\"\",VLOOKUP(O42,일정,7,0)))","v":""}]
[null,{"$f":"IF(MONTH(C42)<>$B$3,\"\",IF(VLOOKUP(C42,일정,9,0)=0,\"\",VLOOKUP(C42,일정,9,0)))","v":""},null,{"$f":"IF(MONTH(E42)<>$B$3,\"\",IF(VLOOKUP(E42,일정,9,0)=0,\"\",VLOOKUP(E42,일정,9,0)))","v":""},null,{"$f":"IF(MONTH(G42)<>$B$3,\"\",IF(VLOOKUP(G42,일정,9,0)=0,\"\",VLOOKUP(G42,일정,9,0)))","v":""},null,{"$f":"IF(MONTH(I42)<>$B$3,\"\",IF(VLOOKUP(I42,일정,9,0)=0,\"\",VLOOKUP(I42,일정,9,0)))","v":""},null,{"$f":"IF(MONTH(K42)<>$B$3,\"\",IF(VLOOKUP(K42,일정,9,0)=0,\"\",VLOOKUP(K42,일정,9,0)))","v":""},null,{"$f":"IF(MONTH(M42)<>$B$3,\"\",IF(VLOOKUP(M42,일정,9,0)=0,\"\",VLOOKUP(M42,일정,9,0)))","v":""},null,{"$f":"IF(MONTH(O42)<>$B$3,\"\",IF(VLOOKUP(O42,일정,9,0)=0,\"\",VLOOKUP(O42,일정,9,0)))","v":""}]
[null,{"$f":"IF(MONTH(C42)<>$B$3,\"\",IF(VLOOKUP(C42,일정,11,0)=0,\"\",VLOOKUP(C42,일정,11,0)))","v":""},null,{"$f":"IF(MONTH(E42)<>$B$3,\"\",IF(VLOOKUP(E42,일정,11,0)=0,\"\",VLOOKUP(E42,일정,11,0)))","v":""},null,{"$f":"IF(MONTH(G42)<>$B$3,\"\",IF(VLOOKUP(G42,일정,11,0)=0,\"\",VLOOKUP(G42,일정,11,0)))","v":""},null,{"$f":"IF(MONTH(I42)<>$B$3,\"\",IF(VLOOKUP(I42,일정,11,0)=0,\"\",VLOOKUP(I42,일정,11,0)))","v":""},null,{"$f":"IF(MONTH(K42)<>$B$3,\"\",IF(VLOOKUP(K42,일정,11,0)=0,\"\",VLOOKUP(K42,일정,11,0)))","v":""},null,{"$f":"IF(MONTH(M42)<>$B$3,\"\",IF(VLOOKUP(M42,일정,11,0)=0,\"\",VLOOKUP(M42,일정,11,0)))","v":""},null,{"$f":"IF(MONTH(O42)<>$B$3,\"\",IF(VLOOKUP(O42,일정,11,0)=0,\"\",VLOOKUP(O42,일정,11,0)))","v":""}]
[null,{"$f":"IF(MONTH(C42)<>$B$3,\"\",IF(VLOOKUP(C42,일정,13,0)=0,\"\",VLOOKUP(C42,일정,13,0)))","v":""},null,{"$f":"IF(MONTH(E42)<>$B$3,\"\",IF(VLOOKUP(E42,일정,13,0)=0,\"\",VLOOKUP(E42,일정,13,0)))","v":""},null,{"$f":"IF(MONTH(G42)<>$B$3,\"\",IF(VLOOKUP(G42,일정,13,0)=0,\"\",VLOOKUP(G42,일정,13,0)))","v":""},null,{"$f":"IF(MONTH(I42)<>$B$3,\"\",IF(VLOOKUP(I42,일정,13,0)=0,\"\",VLOOKUP(I42,일정,13,0)))","v":""},null,{"$f":"IF(MONTH(K42)<>$B$3,\"\",IF(VLOOKUP(K42,일정,13,0)=0,\"\",VLOOKUP(K42,일정,13,0)))","v":""},null,{"$f":"IF(MONTH(M42)<>$B$3,\"\",IF(VLOOKUP(M42,일정,13,0)=0,\"\",VLOOKUP(M42,일정,13,0)))","v":""},null,{"$f":"IF(MONTH(O42)<>$B$3,\"\",IF(VLOOKUP(O42,일정,13,0)=0,\"\",VLOOKUP(O42,일정,13,0)))","v":""}]
[null,{"$f":"IFERROR(INDEX(공휴일이름,MATCH(1,--($D$3=휴일연도)*($B$3=공휴일월)*(DAY(C49)=공휴일일),0)),\"\")&\"  \"&IFERROR(INDEX(기념일이름,MATCH(1,--($D$3=기념일연도)*($B$3=기념일월)*(DAY(C49)=기념일일),0)),\"\")&\" \"","v":"   "},{"$f":"C14+35","v":"2024-03-31"},{"$f":"IFERROR(INDEX(공휴일이름,MATCH(1,--($D$3=휴일연도)*($B$3=공휴일월)*(DAY(E49)=공휴일일),0)),\"\")&\"  \"&IFERROR(INDEX(기념일이름,MATCH(1,--($D$3=기념일연도)*($B$3=기념일월)*(DAY(E49)=기념일일),0)),\"\")&\" \"","v":"삼일절   "},{"$f":"C14+36","v":"2024-04-01"},{"$f":"IFERROR(INDEX(공휴일이름,MATCH(1,--($D$3=휴일연도)*($B$3=공휴일월)*(DAY(G49)=공휴일일),0)),\"\")&\"  \"&IFERROR(INDEX(기념일이름,MATCH(1,--($D$3=기념일연도)*($B$3=기념일월)*(DAY(G49)=기념일일),0)),\"\")&\" \"","v":"   "},{"$f":"C14+37","v":"2024-04-02"},{"$f":"IFERROR(INDEX(공휴일이름,MATCH(1,--($D$3=휴일연도)*($B$3=공휴일월)*(DAY(I49)=공휴일일),0)),\"\")&\"  \"&IFERROR(INDEX(기념일이름,MATCH(1,--($D$3=기념일연도)*($B$3=기념일월)*(DAY(I49)=기념일일),0)),\"\")&\" \"","v":"   "},{"$f":"C14+38","v":"2024-04-03"},{"$f":"IFERROR(INDEX(공휴일이름,MATCH(1,--($D$3=휴일연도)*($B$3=공휴일월)*(DAY(K49)=공휴일일),0)),\"\")&\"  \"&IFERROR(INDEX(기념일이름,MATCH(1,--($D$3=기념일연도)*($B$3=기념일월)*(DAY(K49)=기념일일),0)),\"\")&\" \"","v":"   "},{"$f":"C14+39","v":"2024-04-04"},{"$f":"IFERROR(INDEX(공휴일이름,MATCH(1,--($D$3=휴일연도)*($B$3=공휴일월)*(DAY(M49)=공휴일일),0)),\"\")&\"  \"&IFERROR(INDEX(기념일이름,MATCH(1,--($D$3=기념일연도)*($B$3=기념일월)*(DAY(M49)=기념일일),0)),\"\")&\" \"","v":"   "},{"$f":"C14+40","v":"2024-04-05"},{"$f":"IFERROR(INDEX(공휴일이름,MATCH(1,--($D$3=휴일연도)*($B$3=공휴일월)*(DAY(O49)=공휴일일),0)),\"\")&\"  \"&IFERROR(INDEX(기념일이름,MATCH(1,--($D$3=기념일연도)*($B$3=기념일월)*(DAY(O49)=기념일일),0)),\"\")&\" \"","v":"   "},{"$f":"C14+41","v":"2024-04-06"}]
[null,{"$f":"IF(MONTH(C49)<>$B$3,\"\",IF(VLOOKUP(C49,일정,3,0)=0,\"\",VLOOKUP(C49,일정,3,0)))","v":""},null,{"$f":"IF(MONTH(E49)<>$B$3,\"\",IF(VLOOKUP(E49,일정,3,0)=0,\"\",VLOOKUP(E49,일정,3,0)))","v":""},null,{"$f":"IF(MONTH(G49)<>$B$3,\"\",IF(VLOOKUP(G49,일정,3,0)=0,\"\",VLOOKUP(G49,일정,3,0)))","v":""},null,{"$f":"IF(MONTH(I49)<>$B$3,\"\",IF(VLOOKUP(I49,일정,3,0)=0,\"\",VLOOKUP(I49,일정,3,0)))","v":""},null,{"$f":"IF(MONTH(K49)<>$B$3,\"\",IF(VLOOKUP(K49,일정,3,0)=0,\"\",VLOOKUP(K49,일정,3,0)))","v":""},null,{"$f":"IF(MONTH(M49)<>$B$3,\"\",IF(VLOOKUP(M49,일정,3,0)=0,\"\",VLOOKUP(M49,일정,3,0)))","v":""},null,{"$f":"IF(MONTH(O49)<>$B$3,\"\",IF(VLOOKUP(O49,일정,3,0)=0,\"\",VLOOKUP(O49,일정,3,0)))","v":""}]
[null,{"$f":"IF(MONTH(C49)<>$B$3,\"\",IF(VLOOKUP(C49,일정,5,0)=0,\"\",VLOOKUP(C49,일정,5,0)))","v":""},null,{"$f":"IF(MONTH(E49)<>$B$3,\"\",IF(VLOOKUP(E49,일정,5,0)=0,\"\",VLOOKUP(E49,일정,5,0)))","v":""},null,{"$f":"IF(MONTH(G49)<>$B$3,\"\",IF(VLOOKUP(G49,일정,5,0)=0,\"\",VLOOKUP(G49,일정,5,0)))","v":""},null,{"$f":"IF(MONTH(I49)<>$B$3,\"\",IF(VLOOKUP(I49,일정,5,0)=0,\"\",VLOOKUP(I49,일정,5,0)))","v":""},null,{"$f":"IF(MONTH(K49)<>$B$3,\"\",IF(VLOOKUP(K49,일정,5,0)=0,\"\",VLOOKUP(K49,일정,5,0)))","v":""},null,{"$f":"IF(MONTH(M49)<>$B$3,\"\",IF(VLOOKUP(M49,일정,5,0)=0,\"\",VLOOKUP(M49,일정,5,0)))","v":""},null,{"$f":"IF(MONTH(O49)<>$B$3,\"\",IF(VLOOKUP(O49,일정,5,0)=0,\"\",VLOOKUP(O49,일정,5,0)))","v":""}]
[null,{"$f":"IF(MONTH(C49)<>$B$3,\"\",IF(VLOOKUP(C49,일정,7,0)=0,\"\",VLOOKUP(C49,일정,7,0)))","v":""},null,{"$f":"IF(MONTH(E49)<>$B$3,\"\",IF(VLOOKUP(E49,일정,7,0)=0,\"\",VLOOKUP(E49,일정,7,0)))","v":""},null,{"$f":"IF(MONTH(G49)<>$B$3,\"\",IF(VLOOKUP(G49,일정,7,0)=0,\"\",VLOOKUP(G49,일정,7,0)))","v":""},null,{"$f":"IF(MONTH(I49)<>$B$3,\"\",IF(VLOOKUP(I49,일정,7,0)=0,\"\",VLOOKUP(I49,일정,7,0)))","v":""},null,{"$f":"IF(MONTH(K49)<>$B$3,\"\",IF(VLOOKUP(K49,일정,7,0)=0,\"\",VLOOKUP(K49,일정,7,0)))","v":""},null,{"$f":"IF(MONTH(M49)<>$B$3,\"\",IF(VLOOKUP(M49,일정,7,0)=0,\"\",VLOOKUP(M49,일정,7,0)))","v":""},null,{"$f":"IF(MONTH(O49)<>$B$3,\"\",IF(VLOOKUP(O49,일정,7,0)=0,\"\",VLOOKUP(O49,일정,7,0)))","v":""}]
[null,{"$f":"IF(MONTH(C49)<>$B$3,\"\",IF(VLOOKUP(C49,일정,9,0)=0,\"\",VLOOKUP(C49,일정,9,0)))","v":""},null,{"$f":"IF(MONTH(E49)<>$B$3,\"\",IF(VLOOKUP(E49,일정,9,0)=0,\"\",VLOOKUP(E49,일정,9,0)))","v":""},null,{"$f":"IF(MONTH(G49)<>$B$3,\"\",IF(VLOOKUP(G49,일정,9,0)=0,\"\",VLOOKUP(G49,일정,9,0)))","v":""},null,{"$f":"IF(MONTH(I49)<>$B$3,\"\",IF(VLOOKUP(I49,일정,9,0)=0,\"\",VLOOKUP(I49,일정,9,0)))","v":""},null,{"$f":"IF(MONTH(K49)<>$B$3,\"\",IF(VLOOKUP(K49,일정,9,0)=0,\"\",VLOOKUP(K49,일정,9,0)))","v":""},null,{"$f":"IF(MONTH(M49)<>$B$3,\"\",IF(VLOOKUP(M49,일정,9,0)=0,\"\",VLOOKUP(M49,일정,9,0)))","v":""},null,{"$f":"IF(MONTH(O49)<>$B$3,\"\",IF(VLOOKUP(O49,일정,9,0)=0,\"\",VLOOKUP(O49,일정,9,0)))","v":""}]
[null,{"$f":"IF(MONTH(C49)<>$B$3,\"\",IF(VLOOKUP(C49,일정,11,0)=0,\"\",VLOOKUP(C49,일정,11,0)))","v":""},null,{"$f":"IF(MONTH(E49)<>$B$3,\"\",IF(VLOOKUP(E49,일정,11,0)=0,\"\",VLOOKUP(E49,일정,11,0)))","v":""},null,{"$f":"IF(MONTH(G49)<>$B$3,\"\",IF(VLOOKUP(G49,일정,11,0)=0,\"\",VLOOKUP(G49,일정,11,0)))","v":""},null,{"$f":"IF(MONTH(I49)<>$B$3,\"\",IF(VLOOKUP(I49,일정,11,0)=0,\"\",VLOOKUP(I49,일정,11,0)))","v":""},null,{"$f":"IF(MONTH(K49)<>$B$3,\"\",IF(VLOOKUP(K49,일정,11,0)=0,\"\",VLOOKUP(K49,일정,11,0)))","v":""},null,{"$f":"IF(MONTH(M49)<>$B$3,\"\",IF(VLOOKUP(M49,일정,11,0)=0,\"\",VLOOKUP(M49,일정,11,0)))","v":""},null,{"$f":"IF(MONTH(O49)<>$B$3,\"\",IF(VLOOKUP(O49,일정,11,0)=0,\"\",VLOOKUP(O49,일정,11,0)))","v":""}]
[null,{"$f":"IF(MONTH(C49)<>$B$3,\"\",IF(VLOOKUP(C49,일정,13,0)=0,\"\",VLOOKUP(C49,일정,13,0)))","v":""},null,{"$f":"IF(MONTH(E49)<>$B$3,\"\",IF(VLOOKUP(E49,일정,13,0)=0,\"\",VLOOKUP(E49,일정,13,0)))","v":""},null,{"$f":"IF(MONTH(G49)<>$B$3,\"\",IF(VLOOKUP(G49,일정,13,0)=0,\"\",VLOOKUP(G49,일정,13,0)))","v":""},null,{"$f":"IF(MONTH(I49)<>$B$3,\"\",IF(VLOOKUP(I49,일정,13,0)=0,\"\",VLOOKUP(I49,일정,13,0)))","v":""},null,{"$f":"IF(MONTH(K49)<>$B$3,\"\",IF(VLOOKUP(K49,일정,13,0)=0,\"\",VLOOKUP(K49,일정,13,0)))","v":""},null,{"$f":"IF(MONTH(M49)<>$B$3,\"\",IF(VLOOKUP(M49,일정,13,0)=0,\"\",VLOOKUP(M49,일정,13,0)))","v":""},null,{"$f":"IF(MONTH(O49)<>$B$3,\"\",IF(VLOOKUP(O49,일정,13,0)=0,\"\",VLOOKUP(O49,일정,13,0)))","v":""}]
[]
[]
[]
[]
[]
[]
[]
[]
[]
[]
[]
[]
[]
[]
[]
[]
[]
[]
[]
[]
[]
[]
[]
[]
[]
[]
[]
[]
[]
[]
[]
[]
[]
[]
[]
[]
[]
[]
[]
[]
[]
[]
[]
[]
[]
[]
[]
[]
[]
[]
[]
[]
[]
[]
[]
[]
[]
[]
[]
[]
[]
[]
[]
[]
[]
[]
[]
[]
[]
[]
[]
[]
[]
[]
[]
[]
[]
[]
[]
[]
[]
[]
[]
[]
[]
[]
[]
[]
[]
[]
[]
[]
[]
[]
[]
[]
[]
[]
[]
[]
[]
[]
[]
[]
[]
[]
[]
[]
[]
[]
[]
[]
[]
[]
[]
[]
[]
[]
[]
[]
[]
[]
[]
[]
[]
[]
[]
[]
[]
[]
[]
[]
[]
[]
[]
[]
[]
[]
[]
[]
[]
[]
[]
[]
[]
[]
[]
[]
[]
[]
[]
[]
[]
[]
[]
[]
[]
[]
[]
[]
[]
[]
[]
[]
[]
[]
[]
[]
[]
[]
[]
[]
[]
[]
[]
[]
[]
[]
[]
[]
[]
[]
[]
[]
[]
[]
[]
[]
[]
[]
[]
[]
[]
[]
[]
[]
[]
[]
[]
[]
[]
[]
[]
[]
[]
[]
[]
[]
[]
[]
[]
[]
[]
[]
[]
[]
[]
[]
[]
[]
[]
[]
[]
[]
[]
[]
[]
[]
[]
[]
[]
[]
[]
[]
[]
[]
[]
[]
[]
[]
[]
[]
[]
[]
[]
[]
[]
[]
[]
[]
[]
[]
[]
[]
[]
[]
[]
[]
[]
[]
[]
[]
[]
[]
[]
[]
[]
[]
[]
[]
[]
[]
[]
[]
[]
[]
[]
[]
[]
[]
[]
[]
[]
[]
[]
[]
[]
[]
[]
[]
[]
[]
[]
[]
[]
[]
[]
[]
[]
[]
[]
[]
[]
[]
[]
[]
[]
[]
[]
[]
[]
[]
[]
[]
[]
[]
[]
[]
[]
[]
[]
[]
[]
[]
[]
[]
[]
[]
[]
[]
[]
[]
[]
[]
[]
[]
[]
[]
[]
[]
[]
[]
[]
[]
[]
[]
[]
[]
[]
[]
[]
[]
[]
[]
[]
[]
[]
[]
[]
[]
[]
[]
[]
[]
[]
[]
[]
[]
[]
[]
[]
[]
[]
[]
[]
[]
[]
[]
[]
[]
[]
[]
[]
[]
[]
[]
[]
[]
[]
[]
[]
[]
[]
[]
[]
[]
[]
[]
[]
[]
[]
[]
[]
[]
[]
[]
[]
[]
[]
[]
[]
[]
[]
[]
[]
[]
[]
[]
[]
[]
[]
[]
[]
[]
[]
[]
[]
[]
[]
[]
[]
[]
[]
[]
[]
[]
[]
[]
[]
[]
[]
[]
[]
[]
[]
[]
[]
[]
[]
[]
[]
[]
[]
[]
[]
[]
[]
[]
[]
[]
[]
[]
[]
[]
[]
[]
[]
[]
[]
[]
[]
[]
[]
[]
[]
[]
[]
[]
[]
[]
[]
[]
[]
[]
[]
[]
[]
[]
[]
[]
[]
[]
[]
[]
[]
[]
[]
[]
[]
[]
[]
[]
[]
[]
[]
[]
[]
[]
[]
[]
[]
[]
[]
[]
[]
[]
[]
[]
[]
[]
[]
[]
[]
[]
[]
[]
[]
[]
[]
[]
[]
[]
[]
[]
[]
[]
[]
[]
[]
[]
[]
[]
[]
[]
[]
[]
[]
[]
[]
[]
[]
[]
[]
[]
[]
[]
[]
[]
[]
[]
[]
[]
[]
[]
[]
[]
[]
[]
[]
[]
[]
[]
[]
[]
[]
[]
[]
[]
[]
[]
[]
[]
[]
[]
[]
[]
[]
[]
[]
[]
[]
[]
[]
[]
[]
[]
[]
[]
[]
[]
[]
[]
[]
[]
[]
[]
[]
[]
[]
[]
[]
[]
[]
[]
[]
[]
[]
[]
[]
[]
[]
[]
[]
[]
[]
[]
[]
[]
[]
[]
[]
[]
[]
[]
[]
[]
[]
[]
[]
[]
[]
[]
[]
[]
[]
[]
[]
[]
[]
[]
[]
[]
[]
[]
[]
[]
[]
[]
[]
[]
[]
[]
[]
[]
[]
[]
[]
[]
[]
[]
[]
[]
[]
[]
[]
[]
[]
[]
[]
[]
[]
[]
[]
[]
[]
[]
[]
[]
[]
[]
[]
[]
[]
[]
[]
[]
[]
[]
[]
[]
[]
[]
[]
[]
[]
[]
[]
[]
[]
[]
[]
[]
[]
[]
[]
[]
[]
[]
[]
[]
[]
[]
[]
[]
[]
[]
[]
[]
[]
[]
[]
[]
[]
[]
[]
[]
[]
[]
[]
[]
[]
[]
[]
[]
[]
[]
[]
[]
[]
[]
[]
[]
[]
[]
[]
[]
[]
[]
[]
[]
[]
[]
[]
[]
[]
[]
[]
[]
[]
[]
[]
[]
[]
[]
[]
[]
[]
[]
[]
[]
[]
[]
[]
[]
[]
[]
[]
[]
[]
[]
[]
[]
[]
[]
[]
[]
[]
[]
[]
[]
[]
[]
[]
[]
[]
[]
[]
[]
[]
[]
[]
[]
[]
[]
[]
[]
[]
[]
[]
[]
[]
[]
[]
[]
[]
[]
[]
[]
[]
[]
[]
[]
[]
[]
[]
[]
[]
[]
[]
[]
[]
[]
[]
[]
[]
[]
[]
[]
[]
[]
[]
[]
[]
[]
[]
[]
[]
[]
[]
[]
[]
[]
[]
[]
[]
[]
[]
[]
[]
[]
[]
[]
[]
[]
[]
[]
[]
[]
[]
[]
[]
[]
[]
[]
[]
[]
[]
[]
[]
[]
[]
[]
[]
[]
[]
[]
[]
[]
[]
[]
[]
[]
[]
[]
[]
[]
[]
[]
[]
[]
[]
[]
[]
[]
[]
[]
[]
[]
[]
[]
[]
[]
[]
[]
[]
[]
[]
[]
[]
[]
[]
[]
[]
[]
[]
[]
[]
[]
[]
[]
[]
[]
[]
[]
[]
[]
[]
[]
[]
[]
[]
[]
[]
[]
[]
[]
[]
[]
[]
[]
[]
[]
[]
[]
[]
[]
[]
[]
[]
[]
[]
[]
[]
[]
[]
[]
[]
[]
[]
[]
[]
[]
[]
[]
[]
[]
[]
[]
[]
[]
[]
[]
[]
[]
[]
[]
[]
[]
[]
[]
[]
[]
[]
[]
[]
[]
[]
[]
[]
[]
[]
[]
[]
[]
[]
[]
[]
[]
[]
[]
[]
[]
[]
[]
[]
[]
[]
[]
[]
[]
[]
[]
[]
[]
[]
[]
[]
[]
[]
[]
[]
[]
[]
[]
[]
[]
[]
[]
[]
[]
[]
[]
[]
[]
[]
[]
[]
[]
[]
[]
[]
[]
[]
[]
[]
[]
[]
[]
[]
[]
[]
[]
[]
[]
[]
[]
[]
[]
[]
[]
[]
[]
[]
[]
[]
[]
[]
[]
[]
[]
[]
[]
[]
[]
[]
[]
[]
[]
[]
[]
[]
[]
[]
[]
[]
[]
[]
[]
[]
[]
[]
[]
[]
[]
[]
[]
[]
[]
[]
[]
[]
[]
[]
[]
[]
[]
[]
[]
[]
[]
[]
[]
[]
[]
[]
[]
[]
[]
[]
[]
[]
[]
[]
[]
[]
[]
[]
[]
[]
[]
[]
[]
[]
[]
[]
[]
[]
[]
[]
[]
[]
[]
[]
[]
[]
[]
[]
[]
[]
[]
[]
[]
[]
[]
[]
[]
[]
[]
[]
[]
[]
[]
[]
[]
[]
[]
[]
[]
[]
[]
[]
[]
[]
[]
[]
[]
[]
[]
[]
[]
[]
[]
[]
[]
[]
[]
[]
[]
[]
[]
[]
[]
[]
[]
[]
[]
[]
[]
[]
[]
[]
[]
[]
[]
[]
[]
[]
[]
[]
[]
[]
[]
[]
[]
[]
[]
[]
[]
[]
[]
[]
[]
[]
[]
[]
[]
[]
[]
[]
[]
[]
[]
[]
[]
[]
[]
[]
[]
[]
[]
[]
[]
[]
[]
[]
[]
[]
[]
[]
[]
[]
[]
[]
[]
[]
[]
[]
[]
[]
[]
[]
[]
[]
[]
[]
[]
[]
[]
[]
[]
[]
[]
[]
[]
[]
[]
[]
[]
[]
[]
[]
[]
[]
[]
[]
[]
[]
[]
[]
[]
[]
[]
[]
[]
[]
[]
[]
[]
[]
[]
[]
[]
[]
[]
[]
[]
[]
[]
[]
[]
[]
[]
[]
[]
[]
[]
[]
[]
[]
[]
[]
[]
[]
[]
[]
[]
[]
[]
[]
[]
[]
[]
[]
[]
[]
[]
[]
[]
[]
[]
[]
[]
[]
[]
[]
[]
[]
[]
[]
[]
[]
[]
[]
[]
[]
[]
[]
[]
[]
[]
[]
[]
[]
[]
[]
[]
[]
[]
[]
[]
[]
[]
[]
[]
[]
[]
[]
[]
[]
[]
[]
[]
[]
[]
[]
[]
[]
[]
[]
[]
[]
[]
[]
[]
[]
[]
[]
[]
[]
[]
[]
[]
[]
[]
[]
[]
[]
[]
[]
[]
[]
[]
[]
[]
[]
[]
[]
[]
[]
[]
[]
[]
[]
[]
[]
[]
[]
[]
[]
[]
[]
[]
[]
[]
[]
[]
[]
[]
[]
[]
[]
[]
[]
[]
[]
[]
[]
[]
[]
[]
[]
[]
[]
[]
[]
[]
[]
[]
[]
[]
[]
[]
[]
[]
[]
[]
[]
[]
[]
[]
[]
[]
[]
[]
[]
[]
[]
[]
[]
[]
[]
[]
[]
[]
[]
[]
[]
[]
[]
[]
[]
[]
[]
[]
[]
[]
[]
[]
[]
[]
[]
[]
[]
[]
[]
[]
[]
[]
[]
[]
[]
[]
[]
[]
[]
[]
[]
[]
[]
[]
[]
[]
[]
[]
[]
[]
[]
[]
[]
[]
[]
[]
[]
[]
[]
[]
[]
[]
[]
[]
[]
[]
[]
[]
[]
[]
[]
[]
[]
[]
[]
[]
[]
[]
[]
[]
[]
[]
[]
[]
[]
[]
[]
[]
[]
[]
[]
[]
[]
[]
[]
[]
[]
[]
[]
[]
[]
[]
[]
[]
[]
[]
[]
[]
[]
[]
[]
[]
[]
[]
[]
[]
[]
[]
[]
[]
[]
[]
[]
[]
[]
[]
[]
[]
[]
[]
[]
[]
[]
[]
[]
[]
[]
[]
[]
[]
[]
[]
[]
[]
[]
[]
[]
[]
[]
[]
[]
[]
[]
[]
[]
[]
[]
[]
[]
[]
[]
[]
[]
[]
[]
[]
[]
[]
[]
[]
[]
[]
[]
[]
[]
[]
[]
[]
[]
[]
[]
[]
[]
[]
[]
[]
[]
[]
[]
[]
[]
[]
[]
[]
[]
[]
[]
[]
[]
[]
[]
[]
[]
[]
[]
[]
[]
[]
[]
[]
[]
[]
[]
[]
[]
[]
[]
[]
[]
[]
[]
[]
[]
[]
[]
[]
[]
[]
[]
[]
[]
[]
[]
[]
[]
[]
[]
[]
[]
[]
[]
[]
[]
[]
[]
[]
[]
[]
[]
[]
[]
[]
[]
[]
[]
[]
[]
[]
[]
[]
[]
[]
[]
[]
[]
[]
[]
[]
[]
[]
[]
[]
[]
[]
[]
[]
[]
[]
[]
[]
[]
[]
[]
[]
[]
[]
[]
[]
[]
[]
[]
[]
[]
[]
[]
[]
[]
[]
[]
[]
[]
[]
[]
[]
[]
[]
[]
[]
[]
[]
[]
[]
[]
[]
[]
[]
[]
[]
[]
[]
[]
[]
[]
[]
[]
[]
[]
[]
[]
[]
[]
[]
[]
[]
[]
[]
[]
[]
[]
[]
[]
[]
[]
[]
[]
[]
[]
[]
[]
[]
[]
[]
[]
[]
[]
[]
[]
[]
[]
[]
[]
[]
[]
[]
[]
[]
[]
[]
[]
[]
[]
[]
[]
[]
[]
[]
[]
[]
[]
[]
[]
[]
[]
[]
[]
[]
[]
[]
[]
[]
[]
[]
[]
[]
[]
[]
[]
[]
[]
[]
[]
[]
[]
[]
[]
[]
[]
[]
[]
[]
[]
[]
[]
[]
[]
[]
[]
[]
[]
[]
[]
[]
[]
[]
[]
[]
[]
[]
[]
[]
[]
[]
[]
[]
[]
[]
[]
[]
[]
[]
[]
[]
[]
[]
[]
[]
[]
[]
[]
[]
[]
[]
[]
[]
[]
[]
[]
[]
[]
[]
[]
[]
[]
[]
[]
[]
[]
[]
[]
[]
[]
[]
[]
[]
[]
[]
[]
[]
[]
[]
[]
[]
[]
[]
[]
[]
[]
[]
[]
[]
[]
[]
[]
[]
[]
[]
[]
[]
[]
[]
[]
[]
[]
[]
[]
[]
[]
[]
[]
[]
[]
[]
[]
[]
[]
[]
[]
[]
[]
[]
[]
[]
[]
[]
[]
[]
[]
[]
[]
[]
[]
[]
[]
[]
[]
[]
[]
[]
[]
[]
[]
[]
[]
[]
[]
[]
[]
[]
[]
[]
[]
[]
[]
[]
[]
[]
[]
[]
[]
[]
[]
[]
[]
[]
[]
[]
[]
[]
[]
[]
[]
[]
[]
[]
[]
[]
[]
[]
[]
[]
[]
[]
[]
[]
[]
[]
[]
[]
[]
[]
[]
[]
[]
[]
[]
[]
[]
[]
[]
[]
[]
[]
[]
[]
[]
[]
[]
[]
[]
[]
[]
[]
[]
[]
[]
[]
[]
[]
[]
[]
[]
[]
[]
[]
[]
[]
[]
[]
[]
[]
[]
[]
[]
[]
[]
[]
[]
[]
[]
[]
[]
[]
[]
[]
[]
[]
[]
[]
[]
[]
[]
[]
[]
[]
[]
[]
[]
[]
[]
[]
[]
[]
[]
[]
[]
[]
[]
[]
[]
[]
[]
[]
[]
[]
[]
[]
[]
[]
[]
[]
[]
[]
[]
[]
[]
[]
[]
[]
[]
[]
[]
[]
[]
[]
[]
[]
[]
[]
[]
[]
[]
[]
[]
[]
[]
[]
[]
[]
[]
[]
[]
[]
[]
[]
[]
[]
[]
[]
[]
[]
[]
[]
[]
[]
[]
[]
[]
[]
[]
[]
[]
[]
[]
[]
[]
[]
[]
[]
[]
[]
[]
[]
[]
[]
[]
[]
[]
[]
[]
[]
[]
[]
[]
[]
[]
[]
[]
[]
[]
[]
[]
[]
[]
[]
[]
[]
[]
[]
[]
[]
[]
[]
[]
[]
[]
[]
[]
[]
[]
[]
[]
[]
[]
[]
[]
[]
[]
[]
[]
[]
[]
[]
[]
[]
[]
[]
[]
[]
[]
[]
[]
[]
[]
[]
[]
[]
[]
[]
[]
[]
[]
[]
[]
[]
[]
[]
[]
[]
[]
[]
[]
[]
[]
[]
[]
[]
[]
[]
[]
[]
[]
[]
[]
[]
[]
[]
[]
[]
[]
[]
[]
[]
[]
[]
[]
[]
[]
[]
[]
[]
[]
[]
[]
[]
[]
[]
[]
[]
[]
[]
[]
[]
[]
[]
[]
[]
[]
[]
[]
[]
[]
[]
[]
[]
[]
[]
[]
[]
[]
[]
[]
[]
[]
[]
[]
[]
[]
[]
[]
[]
[]
[]
[]
[]
[]
[]
[]
[]
[]
[]
[]
[]
[]
[]
[]
[]
[]
[]
[]
[]
[]
[]
[]
[]
[]
[]
[]
[]
[]
[]
[]
[]
[]
[]
[]
[]
[]
[]
[]
[]
[]
[]
[]
[]
[]
[]
[]
[]
[]
[]
[]
[]
[]
[]
[]
[]
[]
[]
[]
[]
[]
[]
[]
[]
[]
[]
[]
[]
[]
[]
[]
[]
[]
[]
[]
[]
[]
[]
[]
[]
[]
[]
[]
[]
[]
[]
[]
[]
[]
[]
[]
[]
[]
[]
[]
[]
[]
[]
[]
[]
[]
[]
[]
[]
[]
[]
[]
[]
[]
[]
[]
[]
[]
[]
[]
[]
[]
[]
[]
[]
[]
[]
[]
[]
[]
[]
[]
[]
[]
[]
[]
[]
[]
[]
[]
[]
[]
[]
[]
[]
[]
[]
[]
[]
[]
[]
[]
[]
[]
[]
[]
[]
[]
[]
[]
[]
[]
[]
[]
[]
[]
[]
[]
[]
[]
[]
[]
[]
[]
[]
[]
[]
[]
[]
[]
[]
[]
[]
[]
[]
[]
[]
[]
[]
[]
[]
[]
[]
[]
[]
[]
[]
[]
[]
[]
[]
[]
[]
[]
[]
[]
[]
[]
[]
[]
[]
[]
[]
[]
[]
[]
[]
[]
[]
[]
[]
[]
[]
[]
[]
[]
[]
[]
[]
[]
[]
[]
[]
[]
[]
[]
[]
[]
[]
[]
[]
[]
[]
[]
[]
[]
[]
[]
[]
[]
[]
[]
[]
[]
[]
[]
[]
[]
[]
[]
[]
[]
[]
[]
[]
[]
[]
[]
[]
[]
[]
[]
[]
[]
[]
[]
[]
[]
[]
[]
[]
[]
[]
[]
[]
[]
[]
[]
[]
[]
[]
[]
[]
[]
[]
[]
[]
[]
[]
[]
[]
[]
[]
[]
[]
[]
[]
[]
[]
[]
[]
[]
[]
[]
[]
[]
[]
[]
[]
[]
[]
[]
[]
[]
[]
[]
[]
[]
[]
[]
[]
[]
[]
[]
[]
[]
[]
[]
[]
[]
[]
[]
[]
[]
[]
[]
[]
[]
[]
[]
[]
[]
[]
[]
[]
[]
[]
[]
[]
[]
[]
[]
[]
[]
[]
[]
[]
[]
[]
[]
[]
[]
[]
[]
[]
[]
[]
[]
[]
[]
[]
[]
[]
[]
[]
[]
[]
[]
[]
[]
[]
[]
[]
[]
[]
[]
[]
[]
[]
[]
[]
[]
[]
[]
[]
[]
[]
[]
[]
[]
[]
[]
[]
[]
[]
[]
[]
[]
[]
[]
[]
[]
[]
[]
[]
[]
[]
[]
[]
[]
[]
[]
[]
[]
[]
[]
[]
[]
[]
[]
[]
[]
[]
[]
[]
[]
[]
[]
[]
[]
[]
[]
[]
[]
[]
[]
[]
[]
[]
[]
[]
[]
[]
[]
[]
[]
[]
[]
[]
[]
[]
[]
[]
[]
[]
[]
[]
[]
[]
[]
[]
[]
[]
[]
[]
[]
[]
[]
[]
[]
[]
[]
[]
[]
[]
[]
[]
[]
[]
[]
[]
[]
[]
[]
[]
[]
[]
[]
[]
[]
[]
[]
[]
[]
[]
[]
[]
[]
[]
[]
[]
[]
[]
[]
[]
[]
[]
[]
[]
[]
[]
[]
[]
[]
[]
[]
[]
[]
[]
[]
[]
[]
[]
[]
[]
[]
[]
[]
[]
[]
[]
[]
[]
[]
[]
[]
[]
[]
[]
[]
[]
[]
[]
[]
[]
[]
[]
[]
[]
[]
[]
[]
[]
[]
[]
[]
[]
[]
[]
[]
[]
[]
[]
[]
[]
[]
[]
[]
[]
[]
[]
[]
[]
[]
[]
[]
[]
[]
[]
[]
[]
[]
[]
[]
[]
[]
[]
[]
[]
[]
[]
[]
[]
[]
[]
[]
[]
[]
[]
[]
[]
[]
[]
[]
[]
[]
[]
[]
[]
[]
[]
[]
[]
[]
[]
[]
[]
[]
[]
[]
[]
[]
[]
[]
[]
[]
[]
[]
[]
[]
[]
[]
[]
[]
[]
[]
[]
[]
[]
[]
[]
[]
[]
[]
[]
[]
[]
[]
[]
[]
[]
[]
[]
[]
[]
[]
[]
[]
[]
[]
[]
[]
[]
[]
[]
[]
[]
[]
[]
[]
[]
[]
[]
[]
[]
[]
[]
[]
[]
[]
[]
[]
[]
[]
[]
[]
[]
[]
[]
[]
[]
[]
[]
[]
[]
[]
[]
[]
[]
[]
[]
[]
[]
[]
[]
[]
[]
[]
[]
[]
[]
[]
[]
[]
[]
[]
[]
[]
[]
[]
[]
[]
[]
[]
[]
[]
[]
[]
[]
[]
[]
[]
[]
[]
[]
[]
[]
[]
[]
[]
[]
[]
[]
[]
[]
[]
[]
[]
[]
[]
[]
[]
[]
[]
[]
[]
[]
[]
[]
[]
[]
[]
[]
[]
[]
[]
[]
[]
[]
[]
[]
[]
[]
[]
[]
[]
[]
[]
[]
[]
[]
[]
[]
[]
[]
[]
[]
[]
[]
[]
[]
[]
[]
[]
[]
[]
[]
[]
[]
[]
[]
[]
[]
[]
[]
[]
[]
[]
[]
[]
[]
[]
[]
[]
[]
[]
[]
[]
[]
[]
[]
[]
[]
[]
[]
[]
[]
[]
[]
[]
[]
[]
[]
[]
[]
[]
[]
[]
[]
[]
[]
[]
[]
[]
[]
[]
[]
[]
[]
[]
[]
[]
[]
[]
[]
[]
[]
[]
[]
[]
[]
[]
[]
[]
[]
[]
[]
[]
[]
[]
[]
[]
[]
[]
[]
[]
[]
[]
[]
[]
[]
[]
[]
[]
[]
[]
[]
[]
[]
[]
[]
[]
[]
[]
[]
[]
[]
[]
[]
[]
[]
[]
[]
[]
[]
[]
[]
[]
[]
[]
[]
[]
[]
[]
[]
[]
[]
[]
[]
[]
[]
[]
[]
[]
[]
[]
[]
[]
[]
[]
[]
[]
[]
[]
[]
[]
[]
[]
[]
[]
[]
[]
[]
[]
[]
[]
[]
[]
[]
[]
[]
[]
[]
[]
[]
[]
[]
[]
[]
[]
[]
[]
[]
[]
[]
[]
[]
[]
[]
[]
[]
[]
[]
[]
[]
[]
[]
[]
[]
[]
[]
[]
[]
[]
[]
[]
[]
[]
[]
[]
[]
[]
[]
[]
[]
[]
[]
[]
[]
[]
[]
[]
[]
[]
[]
[]
[]
[]
[]
[]
[]
[]
[]
[]
[]
[]
[]
[]
[]
[]
[]
[]
[]
[]
[]
[]
[]
[]
[]
[]
[]
[]
[]
[]
[]
[]
[]
[]
[]
[]
[]
[]
[]
[]
[]
[]
[]
[]
[]
[]
[]
[]
[]
[]
[]
[]
[]
[]
[]
[]
[]
[]
[]
[]
[]
[]
[]
[]
[]
[]
[]
[]
[]
[]
[]
[]
[]
[]
[]
[]
[]
[]
[]
[]
[]
[]
[]
[]
[]
[]
[]
[]
[]
[]
[]
[]
[]
[]
[]
[]
[]
[]
[]
[]
[]
[]
[]
[]
[]
[]
[]
[]
[]
[]
[]
[]
[]
[]
[]
[]
[]
[]
[]
[]
[]
[]
[]
[]
[]
[]
[]
[]
[]
[]
[]
[]
[]
[]
[]
[]
[]
[]
[]
[]
[]
[]
[]
[]
[]
[]
[]
[]
[]
[]
[]
[]
[]
[]
[]
[]
[]
[]
[]
[]
[]
[]
[]
[]
[]
[]
[]
[]
[]
[]
[]
[]
[]
[]
[]
[]
[]
[]
[]
[]
[]
[]
[]
[]
[]
[]
[]
[]
[]
[]
[]
[]
[]
[]
[]
[]
[]
[]
[]
[]
[]
[]
[]
[]
[]
[]
[]
[]
[]
[]
[]
[]
[]
[]
[]
[]
[]
[]
[]
[]
[]
[]
[]
[]
[]
[]
[]
[]
[]
[]
[]
[]
[]
[]
[]
[]
[]
[]
[]
[]
[]
[]
[]
[]
[]
[]
[]
[]
[]
[]
[]
[]
[]
[]
[]
[]
[]
[]
[]
[]
[]
[]
[]
[]
[]
[]
[]
[]
[]
[]
[]
[]
[]
[]
[]
[]
[]
[]
[]
[]
[]
[]
[]
[]
[]
[]
[]
[]
[]
[]
[]
[]
[]
[]
[]
[]
[]
[]
[]
[]
[]
[]
[]
[]
[]
[]
[]
[]
[]
[]
[]
[]
[]
[]
[]
[]
[]
[]
[]
[]
[]
[]
[]
[]
[]
[]
[]
[]
[]
[]
[]
[]
[]
[]
[]
[]
[]
[]
[]
[]
[]
[]
[]
[]
[]
[]
[]
[]
[]
[]
[]
[]
[]
[]
[]
[]
[]
[]
[]
[]
[]
[]
[]
[]
[]
[]
[]
[]
[]
[]
[]
[]
[]
[]
[]
[]
[]
[]
[]
[]
[]
[]
[]
[]
[]
[]
[]
[]
[]
[]
[]
[]
[]
[]
[]
[]
[]
[]
[]
[]
[]
[]
[]
[]
[]
[]
[]
[]
[]
[]
[]
[]
[]
[]
[]
[]
[]
[]
[]
[]
[]
[]
[]
[]
[]
[]
[]
[]
[]
[]
[]
[]
[]
[]
[]
[]
[]
[]
[]
[]
[]
[]
[]
[]
[]
[]
[]
[]
[]
[]
[]
[]
[]
[]
[]
[]
[]
[]
[]
[]
[]
[]
[]
[]
[]
[]
[]
[]
[]
[]
[]
[]
[]
[]
[]
[]
[]
[]
[]
[]
[]
[]
[]
[]
[]
[]
[]
[]
[]
[]
[]
[]
[]
[]
[]
[]
[]
[]
[]
[]
[]
[]
[]
[]
[]
[]
[]
[]
[]
[]
[]
[]
[]
[]
[]
[]
[]
[]
[]
[]
[]
[]
[]
[]
[]
[]
[]
[]
[]
[]
[]
[]
[]
[]
[]
[]
[]
[]
[]
[]
[]
[]
[]
[]
[]
[]
[]
[]
[]
[]
[]
[]
[]
[]
[]
[]
[]
[]
[]
[]
[]
[]
[]
[]
[]
[]
[]
[]
[]
[]
[]
[]
[]
[]
[]
[]
[]
[]
[]
[]
[]
[]
[]
[]
[]
[]
[]
[]
[]
[]
[]
[]
[]
[]
[]
[]
[]
[]
[]
[]
[]
[]
[]
[]
[]
[]
[]
[]
[]
[]
[]
[]
[]
[]
[]
[]
[]
[]
[]
[]
[]
[]
[]
[]
[]
[]
[]
[]
[]
[]
[]
[]
[]
[]
[]
[]
[]
[]
[]
[]
[]
[]
[]
[]
[]
[]
[]
[]
[]
[]
[]
[]
[]
[]
[]
[]
[]
[]
[]
[]
[]
[]
[]
[]
[]
[]
[]
[]
[]
[]
[]
[]
[]
[]
[]
[]
[]
[]
[]
[]
[]
[]
[]
[]
[]
[]
[]
[]
[]
[]
[]
[]
[]
[]
[]
[]
[]
[]
[]
[]
[]
[]
[]
[]
[]
[]
[]
[]
[]
[]
[]
[]
[]
[]
[]
[]
[]
[]
[]
[]
[]
[]
[]
[]
[]
[]
[]
[]
[]
[]
[]
[]
[]
[]
[]
[]
[]
[]
[]
[]
[]
[]
[]
[]
[]
[]
[]
[]
[]
[]
[]
[]
[]
[]
[]
[]
[]
[]
[]
[]
[]
[]
[]
[]
[]
[]
[]
[]
[]
[]
[]
[]
[]
[]
[]
[]
[]
[]
[]
[]
[]
[]
[]
[]
[]
[]
[]
[]
[]
[]
[]
[]
[]
[]
[]
[]
[]
[]
[]
[]
[]
[]
[]
[]
[]
[]
[]
[]
[]
[]
[]
[]
[]
[]
[]
[]
[]
[]
[]
[]
[]
[]
[]
[]
[]
[]
[]
[]
[]
[]
[]
[]
[]
[]
[]
[]
[]
[]
[]
[]
[]
[]
[]
[]
[]
[]
[]
[]
[]
[]
[]
[]
[]
[]
[]
[]
[]
[]
[]
[]
[]
[]
[]
[]
[]
[]
[]
[]
[]
[]
[]
[]
[]
[]
[]
[]
[]
[]
[]
[]
[]
[]
[]
[]
[]
[]
[]
[]
[]
[]
[]
[]
[]
[]
[]
[]
[]
[]
[]
[]
[]
[]
[]
[]
[]
[]
[]
[]
[]
[]
[]
[]
[]
[]
[]
[]
[]
[]
[]
[]
[]
[]
[]
[]
[]
[]
[]
[]
[]
[]
[]
[]
[]
[]
[]
[]
[]
[]
[]
[]
[]
[]
[]
[]
[]
[]
[]
[]
[]
[]
[]
[]
[]
[]
[]
[]
[]
[]
[]
[]
[]
[]
[]
[]
[]
[]
[]
[]
[]
[]
[]
[]
[]
[]
[]
[]
[]
[]
[]
[]
[]
[]
[null,null,null,true]
[]
[]
[]
[]
[]
[]
[]
[]
[]
[]
[]
[]
[]
[]
[]
[]
[]
[]
[]
[]
[]
[]
[]
[]
[]
[]
[]
[]
[]
[]
[]
[]
[]
[]
[]
[]
[]
[]
[]
[]
[]
[]
[]
[]
[]
[]
[]
[]
[]
[]
[]
[]
[]
[]
[]
[]
[]
[]
[]
[]
[]
[]
[]
[]
[]
[]
[]
[]
[]
[]
[]
[]
[]
[]
[]
[]
[]
[]
[]
[]
[]
[]
[]
[]
[]
[]
[]
[]
[]
[]
[]
[]
[]
[]
[]
[]
[]
[]
[]
[]
[]
[]
[]
[]
[]
[]
[]
[]
[]
[]
[]
[]
[]
[]
[]
[]
[]
[]
[]
[]
[]
[]
[]
[]
[]
[]
[]
[]
[]
[]
[]
[]
[]
[]
[]
[]
[]
[]
[]
[]
[]
[]
[]
[]
[]
[]
[]
[]
[]
[]
[]
[]
[]
[]
[]
[]
[]
[]
[]
[]
[]
[]
[]
[]
[]
[]
[]
[]
[]
[]
[]
[]
[]
[]
[]
[]
[]
[]
[]
[]
[]
[]
[]
[]
[]
[]
[]
[]
[]
[]
[]
[]
[]
[]
[]
[]
[]
[]
[]
[]
[]
[]
[]
[]
[]
[]
[]
[]
[]
[]
[]
[]
[]
[]
[]
[]
[]
[]
[]
[]
[]
[]
[]
[]
[]
[]
[]
[]
[]
[]
[]
[]
[]
[]
[]
[]
[]
[]
[]
[]
[]
[]
[]
[]
[]
[]
[]
[]
[]
[]
[]
[]
[]
[]
[]
[]
[]
[]
[]
[]
[]
[]
[]
[]
[]
[]
[]
[]
[]
[]
[]
[]
[]
[]
[]
[]
[]
[]
[]
[]
[]
[]
[]
[]
[]
[]
[]
[]
[]
[]
[]
[]
[]
[]
[]
[]
[]
[]
[]
[]
[]
[]
[]
[]
[]
[]
[]
[]
[]
[]
[]
[]
[]
[]
[]
[]
[]
[]
[]
[]
[]
[]
[]
[]
[]
[]
[]
[]
[]
[]
[]
[]
[]
[]
[]
[]
[]
[]
[]
[]
[]
[]
[]
[]
[]
[]
[]
[]
[]
[]
[]
[]
[]
[]
[]
[]
[]
[]
[]
[]
[]
[]
[]
[]
[]
[]
[]
[]
[]
[]
[]
[]
[]
[]
[]
[]
[]
[]
[]
[]
[]
[]
[]
[]
[]
[]
[]
[]
[]
[]
[]
[]
[]
[]
[]
[]
[]
[]
[]
[]
[]
[]
[]
[]
[]
[]
[]
[]
[]
[]
[]
[]
[]
[]
[]
[]
[]
[]
[]
[]
[]
[]
[]
[]
[]
[]
[]
[]
[]
[]
[]
[]
[]
[]
[]
[]
[]
[]
[]
[]
[]
[]
[]
[]
[]
[]
[]
[]
[]
[]
[]
[]
[]
[]
[]
[]
[]
[]
[]
[]
[]
[]
[]
[]
[]
[]
[]
[]
[]
[]
[]
[]
[]
[]
[]
[]
[]
[]
[]
[]
[]
[]
[]
[]
[]
[]
[]
[]
[]
[]
[]
[]
[]
[]
[]
[]
[]
[]
[]
[]
[]
[]
[]
[]
[null,null,null,null,null,null,null,null,null,null,null,null,null,false]

{"sheet":"색상","index":3,"n_rows":42,"n_cols":14,"rows_kept":42,"cut":false,"hidden":true,"merged":[]}
[null,1,null,2,null,3,null,4,null,5,null,6,null,7]
[1,{"$f":"IF(MONTH(달력!C14)<>달력!$B$3,\"\",IF(VLOOKUP(달력!C14,일정!$B$4:$O$2001,4,0)=0,\"\",VLOOKUP(달력!C14,일정!$B$4:$O$2001,4,0)))","v":""},null,{"$f":"IF(MONTH(달력!E14)<>달력!$B$3,\"\",IF(VLOOKUP(달력!E14,일정!$B$4:$O$2001,4,0)=0,\"\",VLOOKUP(달력!E14,일정!$B$4:$O$2001,4,0)))","v":""},null,{"$f":"IF(MONTH(달력!G14)<>달력!$B$3,\"\",IF(VLOOKUP(달력!G14,일정!$B$4:$O$2001,4,0)=0,\"\",VLOOKUP(달력!G14,일정!$B$4:$O$2001,4,0)))","v":""},null,{"$f":"IF(MONTH(달력!I14)<>달력!$B$3,\"\",IF(VLOOKUP(달력!I14,일정!$B$4:$O$2001,4,0)=0,\"\",VLOOKUP(달력!I14,일정!$B$4:$O$2001,4,0)))","v":""},null,{"$f":"IF(MONTH(달력!K14)<>달력!$B$3,\"\",IF(VLOOKUP(달력!K14,일정!$B$4:$O$2001,4,0)=0,\"\",VLOOKUP(달력!K14,일정!$B$4:$O$2001,4,0)))","v":""},null,{"$f":"IF(MONTH(달력!M14)<>달력!$B$3,\"\",IF(VLOOKUP(달력!M14,일정!$B$4:$O$2001,4,0)=0,\"\",VLOOKUP(달력!M14,일정!$B$4:$O$2001,4,0)))","v":""},null,{"$f":"IF(MONTH(달력!O14)<>달력!$B$3,\"\",IF(VLOOKUP(달력!O14,일정!$B$4:$O$2001,4,0)=0,\"\",VLOOKUP(달력!O14,일정!$B$4:$O$2001,4,0)))","v":""}]
[2,{"$f":"IF(MONTH(달력!C14)<>달력!$B$3,\"\",IF(VLOOKUP(달력!C14,일정!$B$4:$O$2001,6,0)=0,\"\",VLOOKUP(달력!C14,일정!$B$4:$O$2001,6,0)))","v":""},null,{"$f":"IF(MONTH(달력!E14)<>달력!$B$3,\"\",IF(VLOOKUP(달력!E14,일정!$B$4:$O$2001,6,0)=0,\"\",VLOOKUP(달력!E14,일정!$B$4:$O$2001,6,0)))","v":""},null,{"$f":"IF(MONTH(달력!G14)<>달력!$B$3,\"\",IF(VLOOKUP(달력!G14,일정!$B$4:$O$2001,6,0)=0,\"\",VLOOKUP(달력!G14,일정!$B$4:$O$2001,6,0)))","v":""},null,{"$f":"IF(MONTH(달력!I14)<>달력!$B$3,\"\",IF(VLOOKUP(달력!I14,일정!$B$4:$O$2001,6,0)=0,\"\",VLOOKUP(달력!I14,일정!$B$4:$O$2001,6,0)))","v":""},null,{"$f":"IF(MONTH(달력!K14)<>달력!$B$3,\"\",IF(VLOOKUP(달력!K14,일정!$B$4:$O$2001,6,0)=0,\"\",VLOOKUP(달력!K14,일정!$B$4:$O$2001,6,0)))","v":""},null,{"$f":"IF(MONTH(달력!M14)<>달력!$B$3,\"\",IF(VLOOKUP(달력!M14,일정!$B$4:$O$2001,6,0)=0,\"\",VLOOKUP(달력!M14,일정!$B$4:$O$2001,6,0)))","v":""},null,{"$f":"IF(MONTH(달력!O14)<>달력!$B$3,\"\",IF(VLOOKUP(달력!O14,일정!$B$4:$O$2001,6,0)=0,\"\",VLOOKUP(달력!O14,일정!$B$4:$O$2001,6,0)))","v":""}]
[3,{"$f":"IF(MONTH(달력!C14)<>달력!$B$3,\"\",IF(VLOOKUP(달력!C14,일정!$B$4:$O$2001,8,0)=0,\"\",VLOOKUP(달력!C14,일정!$B$4:$O$2001,8,0)))","v":""},null,{"$f":"IF(MONTH(달력!E14)<>달력!$B$3,\"\",IF(VLOOKUP(달력!E14,일정!$B$4:$O$2001,8,0)=0,\"\",VLOOKUP(달력!E14,일정!$B$4:$O$2001,8,0)))","v":""},null,{"$f":"IF(MONTH(달력!G14)<>달력!$B$3,\"\",IF(VLOOKUP(달력!G14,일정!$B$4:$O$2001,8,0)=0,\"\",VLOOKUP(달력!G14,일정!$B$4:$O$2001,8,0)))","v":""},null,{"$f":"IF(MONTH(달력!I14)<>달력!$B$3,\"\",IF(VLOOKUP(달력!I14,일정!$B$4:$O$2001,8,0)=0,\"\",VLOOKUP(달력!I14,일정!$B$4:$O$2001,8,0)))","v":""},null,{"$f":"IF(MONTH(달력!K14)<>달력!$B$3,\"\",IF(VLOOKUP(달력!K14,일정!$B$4:$O$2001,8,0)=0,\"\",VLOOKUP(달력!K14,일정!$B$4:$O$2001,8,0)))","v":""},null,{"$f":"IF(MONTH(달력!M14)<>달력!$B$3,\"\",IF(VLOOKUP(달력!M14,일정!$B$4:$O$2001,8,0)=0,\"\",VLOOKUP(달력!M14,일정!$B$4:$O$2001,8,0)))","v":""},null,{"$f":"IF(MONTH(달력!O14)<>달력!$B$3,\"\",IF(VLOOKUP(달력!O14,일정!$B$4:$O$2001,8,0)=0,\"\",VLOOKUP(달력!O14,일정!$B$4:$O$2001,8,0)))","v":""}]
[4,{"$f":"IF(MONTH(달력!C14)<>달력!$B$3,\"\",IF(VLOOKUP(달력!C14,일정!$B$4:$O$2001,10,0)=0,\"\",VLOOKUP(달력!C14,일정!$B$4:$O$2001,10,0)))","v":""},null,{"$f":"IF(MONTH(달력!E14)<>달력!$B$3,\"\",IF(VLOOKUP(달력!E14,일정!$B$4:$O$2001,10,0)=0,\"\",VLOOKUP(달력!E14,일정!$B$4:$O$2001,10,0)))","v":""},null,{"$f":"IF(MONTH(달력!G14)<>달력!$B$3,\"\",IF(VLOOKUP(달력!G14,일정!$B$4:$O$2001,10,0)=0,\"\",VLOOKUP(달력!G14,일정!$B$4:$O$2001,10,0)))","v":""},null,{"$f":"IF(MONTH(달력!I14)<>달력!$B$3,\"\",IF(VLOOKUP(달력!I14,일정!$B$4:$O$2001,10,0)=0,\"\",VLOOKUP(달력!I14,일정!$B$4:$O$2001,10,0)))","v":""},null,{"$f":"IF(MONTH(달력!K14)<>달력!$B$3,\"\",IF(VLOOKUP(달력!K14,일정!$B$4:$O$2001,10,0)=0,\"\",VLOOKUP(달력!K14,일정!$B$4:$O$2001,10,0)))","v":""},null,{"$f":"IF(MONTH(달력!M14)<>달력!$B$3,\"\",IF(VLOOKUP(달력!M14,일정!$B$4:$O$2001,10,0)=0,\"\",VLOOKUP(달력!M14,일정!$B$4:$O$2001,10,0)))","v":""},null,{"$f":"IF(MONTH(달력!O14)<>달력!$B$3,\"\",IF(VLOOKUP(달력!O14,일정!$B$4:$O$2001,10,0)=0,\"\",VLOOKUP(달력!O14,일정!$B$4:$O$2001,10,0)))","v":""}]
[5,{"$f":"IF(MONTH(달력!C14)<>달력!$B$3,\"\",IF(VLOOKUP(달력!C14,일정!$B$4:$O$2001,12,0)=0,\"\",VLOOKUP(달력!C14,일정!$B$4:$O$2001,12,0)))","v":""},null,{"$f":"IF(MONTH(달력!E14)<>달력!$B$3,\"\",IF(VLOOKUP(달력!E14,일정!$B$4:$O$2001,12,0)=0,\"\",VLOOKUP(달력!E14,일정!$B$4:$O$2001,12,0)))","v":""},null,{"$f":"IF(MONTH(달력!G14)<>달력!$B$3,\"\",IF(VLOOKUP(달력!G14,일정!$B$4:$O$2001,12,0)=0,\"\",VLOOKUP(달력!G14,일정!$B$4:$O$2001,12,0)))","v":""},null,{"$f":"IF(MONTH(달력!I14)<>달력!$B$3,\"\",IF(VLOOKUP(달력!I14,일정!$B$4:$O$2001,12,0)=0,\"\",VLOOKUP(달력!I14,일정!$B$4:$O$2001,12,0)))","v":""},null,{"$f":"IF(MONTH(달력!K14)<>달력!$B$3,\"\",IF(VLOOKUP(달력!K14,일정!$B$4:$O$2001,12,0)=0,\"\",VLOOKUP(달력!K14,일정!$B$4:$O$2001,12,0)))","v":""},null,{"$f":"IF(MONTH(달력!M14)<>달력!$B$3,\"\",IF(VLOOKUP(달력!M14,일정!$B$4:$O$2001,12,0)=0,\"\",VLOOKUP(달력!M14,일정!$B$4:$O$2001,12,0)))","v":""},null,{"$f":"IF(MONTH(달력!O14)<>달력!$B$3,\"\",IF(VLOOKUP(달력!O14,일정!$B$4:$O$2001,12,0)=0,\"\",VLOOKUP(달력!O14,일정!$B$4:$O$2001,12,0)))","v":""}]
[6,{"$f":"IF(MONTH(달력!C14)<>달력!$B$3,\"\",IF(VLOOKUP(달력!C14,일정!$B$4:$O$2001,14,0)=0,\"\",VLOOKUP(달력!C14,일정!$B$4:$O$2001,14,0)))","v":""},null,{"$f":"IF(MONTH(달력!E14)<>달력!$B$3,\"\",IF(VLOOKUP(달력!E14,일정!$B$4:$O$2001,14,0)=0,\"\",VLOOKUP(달력!E14,일정!$B$4:$O$2001,14,0)))","v":""},null,{"$f":"IF(MONTH(달력!G14)<>달력!$B$3,\"\",IF(VLOOKUP(달력!G14,일정!$B$4:$O$2001,14,0)=0,\"\",VLOOKUP(달력!G14,일정!$B$4:$O$2001,14,0)))","v":""},null,{"$f":"IF(MONTH(달력!I14)<>달력!$B$3,\"\",IF(VLOOKUP(달력!I14,일정!$B$4:$O$2001,14,0)=0,\"\",VLOOKUP(달력!I14,일정!$B$4:$O$2001,14,0)))","v":""},null,{"$f":"IF(MONTH(달력!K14)<>달력!$B$3,\"\",IF(VLOOKUP(달력!K14,일정!$B$4:$O$2001,14,0)=0,\"\",VLOOKUP(달력!K14,일정!$B$4:$O$2001,14,0)))","v":""},null,{"$f":"IF(MONTH(달력!M14)<>달력!$B$3,\"\",IF(VLOOKUP(달력!M14,일정!$B$4:$O$2001,14,0)=0,\"\",VLOOKUP(달력!M14,일정!$B$4:$O$2001,14,0)))","v":""},null,{"$f":"IF(MONTH(달력!O14)<>달력!$B$3,\"\",IF(VLOOKUP(달력!O14,일정!$B$4:$O$2001,14,0)=0,\"\",VLOOKUP(달력!O14,일정!$B$4:$O$2001,14,0)))","v":""}]
[]
[1,{"$f":"IF(MONTH(달력!C21)<>달력!$B$3,\"\",IF(VLOOKUP(달력!C21,일정!$B$4:$O$2001,4,0)=0,\"\",VLOOKUP(달력!C21,일정!$B$4:$O$2001,4,0)))","v":""},null,{"$f":"IF(MONTH(달력!E21)<>달력!$B$3,\"\",IF(VLOOKUP(달력!E21,일정!$B$4:$O$2001,4,0)=0,\"\",VLOOKUP(달력!E21,일정!$B$4:$O$2001,4,0)))","v":""},null,{"$f":"IF(MONTH(달력!G21)<>달력!$B$3,\"\",IF(VLOOKUP(달력!G21,일정!$B$4:$O$2001,4,0)=0,\"\",VLOOKUP(달력!G21,일정!$B$4:$O$2001,4,0)))","v":""},null,{"$f":"IF(MONTH(달력!I21)<>달력!$B$3,\"\",IF(VLOOKUP(달력!I21,일정!$B$4:$O$2001,4,0)=0,\"\",VLOOKUP(달력!I21,일정!$B$4:$O$2001,4,0)))","v":""},null,{"$f":"IF(MONTH(달력!K21)<>달력!$B$3,\"\",IF(VLOOKUP(달력!K21,일정!$B$4:$O$2001,4,0)=0,\"\",VLOOKUP(달력!K21,일정!$B$4:$O$2001,4,0)))","v":""},null,{"$f":"IF(MONTH(달력!M21)<>달력!$B$3,\"\",IF(VLOOKUP(달력!M21,일정!$B$4:$O$2001,4,0)=0,\"\",VLOOKUP(달력!M21,일정!$B$4:$O$2001,4,0)))","v":""},null,{"$f":"IF(MONTH(달력!O21)<>달력!$B$3,\"\",IF(VLOOKUP(달력!O21,일정!$B$4:$O$2001,4,0)=0,\"\",VLOOKUP(달력!O21,일정!$B$4:$O$2001,4,0)))","v":""}]
[2,{"$f":"IF(MONTH(달력!C21)<>달력!$B$3,\"\",IF(VLOOKUP(달력!C21,일정!$B$4:$O$2001,6,0)=0,\"\",VLOOKUP(달력!C21,일정!$B$4:$O$2001,6,0)))","v":""},null,{"$f":"IF(MONTH(달력!E21)<>달력!$B$3,\"\",IF(VLOOKUP(달력!E21,일정!$B$4:$O$2001,6,0)=0,\"\",VLOOKUP(달력!E21,일정!$B$4:$O$2001,6,0)))","v":""},null,{"$f":"IF(MONTH(달력!G21)<>달력!$B$3,\"\",IF(VLOOKUP(달력!G21,일정!$B$4:$O$2001,6,0)=0,\"\",VLOOKUP(달력!G21,일정!$B$4:$O$2001,6,0)))","v":""},null,{"$f":"IF(MONTH(달력!I21)<>달력!$B$3,\"\",IF(VLOOKUP(달력!I21,일정!$B$4:$O$2001,6,0)=0,\"\",VLOOKUP(달력!I21,일정!$B$4:$O$2001,6,0)))","v":""},null,{"$f":"IF(MONTH(달력!K21)<>달력!$B$3,\"\",IF(VLOOKUP(달력!K21,일정!$B$4:$O$2001,6,0)=0,\"\",VLOOKUP(달력!K21,일정!$B$4:$O$2001,6,0)))","v":""},null,{"$f":"IF(MONTH(달력!M21)<>달력!$B$3,\"\",IF(VLOOKUP(달력!M21,일정!$B$4:$O$2001,6,0)=0,\"\",VLOOKUP(달력!M21,일정!$B$4:$O$2001,6,0)))","v":""},null,{"$f":"IF(MONTH(달력!O21)<>달력!$B$3,\"\",IF(VLOOKUP(달력!O21,일정!$B$4:$O$2001,6,0)=0,\"\",VLOOKUP(달력!O21,일정!$B$4:$O$2001,6,0)))","v":""}]
[3,{"$f":"IF(MONTH(달력!C21)<>달력!$B$3,\"\",IF(VLOOKUP(달력!C21,일정!$B$4:$O$2001,8,0)=0,\"\",VLOOKUP(달력!C21,일정!$B$4:$O$2001,8,0)))","v":""},null,{"$f":"IF(MONTH(달력!E21)<>달력!$B$3,\"\",IF(VLOOKUP(달력!E21,일정!$B$4:$O$2001,8,0)=0,\"\",VLOOKUP(달력!E21,일정!$B$4:$O$2001,8,0)))","v":""},null,{"$f":"IF(MONTH(달력!G21)<>달력!$B$3,\"\",IF(VLOOKUP(달력!G21,일정!$B$4:$O$2001,8,0)=0,\"\",VLOOKUP(달력!G21,일정!$B$4:$O$2001,8,0)))","v":""},null,{"$f":"IF(MONTH(달력!I21)<>달력!$B$3,\"\",IF(VLOOKUP(달력!I21,일정!$B$4:$O$2001,8,0)=0,\"\",VLOOKUP(달력!I21,일정!$B$4:$O$2001,8,0)))","v":""},null,{"$f":"IF(MONTH(달력!K21)<>달력!$B$3,\"\",IF(VLOOKUP(달력!K21,일정!$B$4:$O$2001,8,0)=0,\"\",VLOOKUP(달력!K21,일정!$B$4:$O$2001,8,0)))","v":""},null,{"$f":"IF(MONTH(달력!M21)<>달력!$B$3,\"\",IF(VLOOKUP(달력!M21,일정!$B$4:$O$2001,8,0)=0,\"\",VLOOKUP(달력!M21,일정!$B$4:$O$2001,8,0)))","v":""},null,{"$f":"IF(MONTH(달력!O21)<>달력!$B$3,\"\",IF(VLOOKUP(달력!O21,일정!$B$4:$O$2001,8,0)=0,\"\",VLOOKUP(달력!O21,일정!$B$4:$O$2001,8,0)))","v":""}]
[4,{"$f":"IF(MONTH(달력!C21)<>달력!$B$3,\"\",IF(VLOOKUP(달력!C21,일정!$B$4:$O$2001,10,0)=0,\"\",VLOOKUP(달력!C21,일정!$B$4:$O$2001,10,0)))","v":""},null,{"$f":"IF(MONTH(달력!E21)<>달력!$B$3,\"\",IF(VLOOKUP(달력!E21,일정!$B$4:$O$2001,10,0)=0,\"\",VLOOKUP(달력!E21,일정!$B$4:$O$2001,10,0)))","v":""},null,{"$f":"IF(MONTH(달력!G21)<>달력!$B$3,\"\",IF(VLOOKUP(달력!G21,일정!$B$4:$O$2001,10,0)=0,\"\",VLOOKUP(달력!G21,일정!$B$4:$O$2001,10,0)))","v":""},null,{"$f":"IF(MONTH(달력!I21)<>달력!$B$3,\"\",IF(VLOOKUP(달력!I21,일정!$B$4:$O$2001,10,0)=0,\"\",VLOOKUP(달력!I21,일정!$B$4:$O$2001,10,0)))","v":""},null,{"$f":"IF(MONTH(달력!K21)<>달력!$B$3,\"\",IF(VLOOKUP(달력!K21,일정!$B$4:$O$2001,10,0)=0,\"\",VLOOKUP(달력!K21,일정!$B$4:$O$2001,10,0)))","v":""},null,{"$f":"IF(MONTH(달력!M21)<>달력!$B$3,\"\",IF(VLOOKUP(달력!M21,일정!$B$4:$O$2001,10,0)=0,\"\",VLOOKUP(달력!M21,일정!$B$4:$O$2001,10,0)))","v":""},null,{"$f":"IF(MONTH(달력!O21)<>달력!$B$3,\"\",IF(VLOOKUP(달력!O21,일정!$B$4:$O$2001,10,0)=0,\"\",VLOOKUP(달력!O21,일정!$B$4:$O$2001,10,0)))","v":""}]
[5,{"$f":"IF(MONTH(달력!C21)<>달력!$B$3,\"\",IF(VLOOKUP(달력!C21,일정!$B$4:$O$2001,12,0)=0,\"\",VLOOKUP(달력!C21,일정!$B$4:$O$2001,12,0)))","v":""},null,{"$f":"IF(MONTH(달력!E21)<>달력!$B$3,\"\",IF(VLOOKUP(달력!E21,일정!$B$4:$O$2001,12,0)=0,\"\",VLOOKUP(달력!E21,일정!$B$4:$O$2001,12,0)))","v":""},null,{"$f":"IF(MONTH(달력!G21)<>달력!$B$3,\"\",IF(VLOOKUP(달력!G21,일정!$B$4:$O$2001,12,0)=0,\"\",VLOOKUP(달력!G21,일정!$B$4:$O$2001,12,0)))","v":""},null,{"$f":"IF(MONTH(달력!I21)<>달력!$B$3,\"\",IF(VLOOKUP(달력!I21,일정!$B$4:$O$2001,12,0)=0,\"\",VLOOKUP(달력!I21,일정!$B$4:$O$2001,12,0)))","v":""},null,{"$f":"IF(MONTH(달력!K21)<>달력!$B$3,\"\",IF(VLOOKUP(달력!K21,일정!$B$4:$O$2001,12,0)=0,\"\",VLOOKUP(달력!K21,일정!$B$4:$O$2001,12,0)))","v":""},null,{"$f":"IF(MONTH(달력!M21)<>달력!$B$3,\"\",IF(VLOOKUP(달력!M21,일정!$B$4:$O$2001,12,0)=0,\"\",VLOOKUP(달력!M21,일정!$B$4:$O$2001,12,0)))","v":""},null,{"$f":"IF(MONTH(달력!O21)<>달력!$B$3,\"\",IF(VLOOKUP(달력!O21,일정!$B$4:$O$2001,12,0)=0,\"\",VLOOKUP(달력!O21,일정!$B$4:$O$2001,12,0)))","v":""}]
[6,{"$f":"IF(MONTH(달력!C21)<>달력!$B$3,\"\",IF(VLOOKUP(달력!C21,일정!$B$4:$O$2001,14,0)=0,\"\",VLOOKUP(달력!C21,일정!$B$4:$O$2001,14,0)))","v":""},null,{"$f":"IF(MONTH(달력!E21)<>달력!$B$3,\"\",IF(VLOOKUP(달력!E21,일정!$B$4:$O$2001,14,0)=0,\"\",VLOOKUP(달력!E21,일정!$B$4:$O$2001,14,0)))","v":""},null,{"$f":"IF(MONTH(달력!G21)<>달력!$B$3,\"\",IF(VLOOKUP(달력!G21,일정!$B$4:$O$2001,14,0)=0,\"\",VLOOKUP(달력!G21,일정!$B$4:$O$2001,14,0)))","v":""},null,{"$f":"IF(MONTH(달력!I21)<>달력!$B$3,\"\",IF(VLOOKUP(달력!I21,일정!$B$4:$O$2001,14,0)=0,\"\",VLOOKUP(달력!I21,일정!$B$4:$O$2001,14,0)))","v":""},null,{"$f":"IF(MONTH(달력!K21)<>달력!$B$3,\"\",IF(VLOOKUP(달력!K21,일정!$B$4:$O$2001,14,0)=0,\"\",VLOOKUP(달력!K21,일정!$B$4:$O$2001,14,0)))","v":""},null,{"$f":"IF(MONTH(달력!M21)<>달력!$B$3,\"\",IF(VLOOKUP(달력!M21,일정!$B$4:$O$2001,14,0)=0,\"\",VLOOKUP(달력!M21,일정!$B$4:$O$2001,14,0)))","v":""},null,{"$f":"IF(MONTH(달력!O21)<>달력!$B$3,\"\",IF(VLOOKUP(달력!O21,일정!$B$4:$O$2001,14,0)=0,\"\",VLOOKUP(달력!O21,일정!$B$4:$O$2001,14,0)))","v":""}]
[]
[1,{"$f":"IF(MONTH(달력!C28)<>달력!$B$3,\"\",IF(VLOOKUP(달력!C28,일정!$B$4:$O$2001,4,0)=0,\"\",VLOOKUP(달력!C28,일정!$B$4:$O$2001,4,0)))","v":""},null,{"$f":"IF(MONTH(달력!E28)<>달력!$B$3,\"\",IF(VLOOKUP(달력!E28,일정!$B$4:$O$2001,4,0)=0,\"\",VLOOKUP(달력!E28,일정!$B$4:$O$2001,4,0)))","v":""},null,{"$f":"IF(MONTH(달력!G28)<>달력!$B$3,\"\",IF(VLOOKUP(달력!G28,일정!$B$4:$O$2001,4,0)=0,\"\",VLOOKUP(달력!G28,일정!$B$4:$O$2001,4,0)))","v":""},null,{"$f":"IF(MONTH(달력!I28)<>달력!$B$3,\"\",IF(VLOOKUP(달력!I28,일정!$B$4:$O$2001,4,0)=0,\"\",VLOOKUP(달력!I28,일정!$B$4:$O$2001,4,0)))","v":""},null,{"$f":"IF(MONTH(달력!K28)<>달력!$B$3,\"\",IF(VLOOKUP(달력!K28,일정!$B$4:$O$2001,4,0)=0,\"\",VLOOKUP(달력!K28,일정!$B$4:$O$2001,4,0)))","v":""},null,{"$f":"IF(MONTH(달력!M28)<>달력!$B$3,\"\",IF(VLOOKUP(달력!M28,일정!$B$4:$O$2001,4,0)=0,\"\",VLOOKUP(달력!M28,일정!$B$4:$O$2001,4,0)))","v":""},null,{"$f":"IF(MONTH(달력!O28)<>달력!$B$3,\"\",IF(VLOOKUP(달력!O28,일정!$B$4:$O$2001,4,0)=0,\"\",VLOOKUP(달력!O28,일정!$B$4:$O$2001,4,0)))","v":""}]
[2,{"$f":"IF(MONTH(달력!C28)<>달력!$B$3,\"\",IF(VLOOKUP(달력!C28,일정!$B$4:$O$2001,6,0)=0,\"\",VLOOKUP(달력!C28,일정!$B$4:$O$2001,6,0)))","v":""},null,{"$f":"IF(MONTH(달력!E28)<>달력!$B$3,\"\",IF(VLOOKUP(달력!E28,일정!$B$4:$O$2001,6,0)=0,\"\",VLOOKUP(달력!E28,일정!$B$4:$O$2001,6,0)))","v":""},null,{"$f":"IF(MONTH(달력!G28)<>달력!$B$3,\"\",IF(VLOOKUP(달력!G28,일정!$B$4:$O$2001,6,0)=0,\"\",VLOOKUP(달력!G28,일정!$B$4:$O$2001,6,0)))","v":""},null,{"$f":"IF(MONTH(달력!I28)<>달력!$B$3,\"\",IF(VLOOKUP(달력!I28,일정!$B$4:$O$2001,6,0)=0,\"\",VLOOKUP(달력!I28,일정!$B$4:$O$2001,6,0)))","v":""},null,{"$f":"IF(MONTH(달력!K28)<>달력!$B$3,\"\",IF(VLOOKUP(달력!K28,일정!$B$4:$O$2001,6,0)=0,\"\",VLOOKUP(달력!K28,일정!$B$4:$O$2001,6,0)))","v":""},null,{"$f":"IF(MONTH(달력!M28)<>달력!$B$3,\"\",IF(VLOOKUP(달력!M28,일정!$B$4:$O$2001,6,0)=0,\"\",VLOOKUP(달력!M28,일정!$B$4:$O$2001,6,0)))","v":""},null,{"$f":"IF(MONTH(달력!O28)<>달력!$B$3,\"\",IF(VLOOKUP(달력!O28,일정!$B$4:$O$2001,6,0)=0,\"\",VLOOKUP(달력!O28,일정!$B$4:$O$2001,6,0)))","v":""}]
[3,{"$f":"IF(MONTH(달력!C28)<>달력!$B$3,\"\",IF(VLOOKUP(달력!C28,일정!$B$4:$O$2001,8,0)=0,\"\",VLOOKUP(달력!C28,일정!$B$4:$O$2001,8,0)))","v":""},null,{"$f":"IF(MONTH(달력!E28)<>달력!$B$3,\"\",IF(VLOOKUP(달력!E28,일정!$B$4:$O$2001,8,0)=0,\"\",VLOOKUP(달력!E28,일정!$B$4:$O$2001,8,0)))","v":""},null,{"$f":"IF(MONTH(달력!G28)<>달력!$B$3,\"\",IF(VLOOKUP(달력!G28,일정!$B$4:$O$2001,8,0)=0,\"\",VLOOKUP(달력!G28,일정!$B$4:$O$2001,8,0)))","v":""},null,{"$f":"IF(MONTH(달력!I28)<>달력!$B$3,\"\",IF(VLOOKUP(달력!I28,일정!$B$4:$O$2001,8,0)=0,\"\",VLOOKUP(달력!I28,일정!$B$4:$O$2001,8,0)))","v":""},null,{"$f":"IF(MONTH(달력!K28)<>달력!$B$3,\"\",IF(VLOOKUP(달력!K28,일정!$B$4:$O$2001,8,0)=0,\"\",VLOOKUP(달력!K28,일정!$B$4:$O$2001,8,0)))","v":""},null,{"$f":"IF(MONTH(달력!M28)<>달력!$B$3,\"\",IF(VLOOKUP(달력!M28,일정!$B$4:$O$2001,8,0)=0,\"\",VLOOKUP(달력!M28,일정!$B$4:$O$2001,8,0)))","v":""},null,{"$f":"IF(MONTH(달력!O28)<>달력!$B$3,\"\",IF(VLOOKUP(달력!O28,일정!$B$4:$O$2001,8,0)=0,\"\",VLOOKUP(달력!O28,일정!$B$4:$O$2001,8,0)))","v":""}]
[4,{"$f":"IF(MONTH(달력!C28)<>달력!$B$3,\"\",IF(VLOOKUP(달력!C28,일정!$B$4:$O$2001,10,0)=0,\"\",VLOOKUP(달력!C28,일정!$B$4:$O$2001,10,0)))","v":""},null,{"$f":"IF(MONTH(달력!E28)<>달력!$B$3,\"\",IF(VLOOKUP(달력!E28,일정!$B$4:$O$2001,10,0)=0,\"\",VLOOKUP(달력!E28,일정!$B$4:$O$2001,10,0)))","v":""},null,{"$f":"IF(MONTH(달력!G28)<>달력!$B$3,\"\",IF(VLOOKUP(달력!G28,일정!$B$4:$O$2001,10,0)=0,\"\",VLOOKUP(달력!G28,일정!$B$4:$O$2001,10,0)))","v":""},null,{"$f":"IF(MONTH(달력!I28)<>달력!$B$3,\"\",IF(VLOOKUP(달력!I28,일정!$B$4:$O$2001,10,0)=0,\"\",VLOOKUP(달력!I28,일정!$B$4:$O$2001,10,0)))","v":""},null,{"$f":"IF(MONTH(달력!K28)<>달력!$B$3,\"\",IF(VLOOKUP(달력!K28,일정!$B$4:$O$2001,10,0)=0,\"\",VLOOKUP(달력!K28,일정!$B$4:$O$2001,10,0)))","v":""},null,{"$f":"IF(MONTH(달력!M28)<>달력!$B$3,\"\",IF(VLOOKUP(달력!M28,일정!$B$4:$O$2001,10,0)=0,\"\",VLOOKUP(달력!M28,일정!$B$4:$O$2001,10,0)))","v":""},null,{"$f":"IF(MONTH(달력!O28)<>달력!$B$3,\"\",IF(VLOOKUP(달력!O28,일정!$B$4:$O$2001,10,0)=0,\"\",VLOOKUP(달력!O28,일정!$B$4:$O$2001,10,0)))","v":""}]
[5,{"$f":"IF(MONTH(달력!C28)<>달력!$B$3,\"\",IF(VLOOKUP(달력!C28,일정!$B$4:$O$2001,12,0)=0,\"\",VLOOKUP(달력!C28,일정!$B$4:$O$2001,12,0)))","v":""},null,{"$f":"IF(MONTH(달력!E28)<>달력!$B$3,\"\",IF(VLOOKUP(달력!E28,일정!$B$4:$O$2001,12,0)=0,\"\",VLOOKUP(달력!E28,일정!$B$4:$O$2001,12,0)))","v":""},null,{"$f":"IF(MONTH(달력!G28)<>달력!$B$3,\"\",IF(VLOOKUP(달력!G28,일정!$B$4:$O$2001,12,0)=0,\"\",VLOOKUP(달력!G28,일정!$B$4:$O$2001,12,0)))","v":""},null,{"$f":"IF(MONTH(달력!I28)<>달력!$B$3,\"\",IF(VLOOKUP(달력!I28,일정!$B$4:$O$2001,12,0)=0,\"\",VLOOKUP(달력!I28,일정!$B$4:$O$2001,12,0)))","v":""},null,{"$f":"IF(MONTH(달력!K28)<>달력!$B$3,\"\",IF(VLOOKUP(달력!K28,일정!$B$4:$O$2001,12,0)=0,\"\",VLOOKUP(달력!K28,일정!$B$4:$O$2001,12,0)))","v":""},null,{"$f":"IF(MONTH(달력!M28)<>달력!$B$3,\"\",IF(VLOOKUP(달력!M28,일정!$B$4:$O$2001,12,0)=0,\"\",VLOOKUP(달력!M28,일정!$B$4:$O$2001,12,0)))","v":""},null,{"$f":"IF(MONTH(달력!O28)<>달력!$B$3,\"\",IF(VLOOKUP(달력!O28,일정!$B$4:$O$2001,12,0)=0,\"\",VLOOKUP(달력!O28,일정!$B$4:$O$2001,12,0)))","v":""}]
[6,{"$f":"IF(MONTH(달력!C28)<>달력!$B$3,\"\",IF(VLOOKUP(달력!C28,일정!$B$4:$O$2001,14,0)=0,\"\",VLOOKUP(달력!C28,일정!$B$4:$O$2001,14,0)))","v":""},null,{"$f":"IF(MONTH(달력!E28)<>달력!$B$3,\"\",IF(VLOOKUP(달력!E28,일정!$B$4:$O$2001,14,0)=0,\"\",VLOOKUP(달력!E28,일정!$B$4:$O$2001,14,0)))","v":""},null,{"$f":"IF(MONTH(달력!G28)<>달력!$B$3,\"\",IF(VLOOKUP(달력!G28,일정!$B$4:$O$2001,14,0)=0,\"\",VLOOKUP(달력!G28,일정!$B$4:$O$2001,14,0)))","v":""},null,{"$f":"IF(MONTH(달력!I28)<>달력!$B$3,\"\",IF(VLOOKUP(달력!I28,일정!$B$4:$O$2001,14,0)=0,\"\",VLOOKUP(달력!I28,일정!$B$4:$O$2001,14,0)))","v":""},null,{"$f":"IF(MONTH(달력!K28)<>달력!$B$3,\"\",IF(VLOOKUP(달력!K28,일정!$B$4:$O$2001,14,0)=0,\"\",VLOOKUP(달력!K28,일정!$B$4:$O$2001,14,0)))","v":""},null,{"$f":"IF(MONTH(달력!M28)<>달력!$B$3,\"\",IF(VLOOKUP(달력!M28,일정!$B$4:$O$2001,14,0)=0,\"\",VLOOKUP(달력!M28,일정!$B$4:$O$2001,14,0)))","v":""},null,{"$f":"IF(MONTH(달력!O28)<>달력!$B$3,\"\",IF(VLOOKUP(달력!O28,일정!$B$4:$O$2001,14,0)=0,\"\",VLOOKUP(달력!O28,일정!$B$4:$O$2001,14,0)))","v":""}]
[]
[1,{"$f":"IF(MONTH(달력!C35)<>달력!$B$3,\"\",IF(VLOOKUP(달력!C35,일정!$B$4:$O$2001,4,0)=0,\"\",VLOOKUP(달력!C35,일정!$B$4:$O$2001,4,0)))","v":""},null,{"$f":"IF(MONTH(달력!E35)<>달력!$B$3,\"\",IF(VLOOKUP(달력!E35,일정!$B$4:$O$2001,4,0)=0,\"\",VLOOKUP(달력!E35,일정!$B$4:$O$2001,4,0)))","v":""},null,{"$f":"IF(MONTH(달력!G35)<>달력!$B$3,\"\",IF(VLOOKUP(달력!G35,일정!$B$4:$O$2001,4,0)=0,\"\",VLOOKUP(달력!G35,일정!$B$4:$O$2001,4,0)))","v":""},null,{"$f":"IF(MONTH(달력!I35)<>달력!$B$3,\"\",IF(VLOOKUP(달력!I35,일정!$B$4:$O$2001,4,0)=0,\"\",VLOOKUP(달력!I35,일정!$B$4:$O$2001,4,0)))","v":""},null,{"$f":"IF(MONTH(달력!K35)<>달력!$B$3,\"\",IF(VLOOKUP(달력!K35,일정!$B$4:$O$2001,4,0)=0,\"\",VLOOKUP(달력!K35,일정!$B$4:$O$2001,4,0)))","v":""},null,{"$f":"IF(MONTH(달력!M35)<>달력!$B$3,\"\",IF(VLOOKUP(달력!M35,일정!$B$4:$O$2001,4,0)=0,\"\",VLOOKUP(달력!M35,일정!$B$4:$O$2001,4,0)))","v":""},null,{"$f":"IF(MONTH(달력!O35)<>달력!$B$3,\"\",IF(VLOOKUP(달력!O35,일정!$B$4:$O$2001,4,0)=0,\"\",VLOOKUP(달력!O35,일정!$B$4:$O$2001,4,0)))","v":""}]
[2,{"$f":"IF(MONTH(달력!C35)<>달력!$B$3,\"\",IF(VLOOKUP(달력!C35,일정!$B$4:$O$2001,6,0)=0,\"\",VLOOKUP(달력!C35,일정!$B$4:$O$2001,6,0)))","v":""},null,{"$f":"IF(MONTH(달력!E35)<>달력!$B$3,\"\",IF(VLOOKUP(달력!E35,일정!$B$4:$O$2001,6,0)=0,\"\",VLOOKUP(달력!E35,일정!$B$4:$O$2001,6,0)))","v":""},null,{"$f":"IF(MONTH(달력!G35)<>달력!$B$3,\"\",IF(VLOOKUP(달력!G35,일정!$B$4:$O$2001,6,0)=0,\"\",VLOOKUP(달력!G35,일정!$B$4:$O$2001,6,0)))","v":""},null,{"$f":"IF(MONTH(달력!I35)<>달력!$B$3,\"\",IF(VLOOKUP(달력!I35,일정!$B$4:$O$2001,6,0)=0,\"\",VLOOKUP(달력!I35,일정!$B$4:$O$2001,6,0)))","v":""},null,{"$f":"IF(MONTH(달력!K35)<>달력!$B$3,\"\",IF(VLOOKUP(달력!K35,일정!$B$4:$O$2001,6,0)=0,\"\",VLOOKUP(달력!K35,일정!$B$4:$O$2001,6,0)))","v":""},null,{"$f":"IF(MONTH(달력!M35)<>달력!$B$3,\"\",IF(VLOOKUP(달력!M35,일정!$B$4:$O$2001,6,0)=0,\"\",VLOOKUP(달력!M35,일정!$B$4:$O$2001,6,0)))","v":""},null,{"$f":"IF(MONTH(달력!O35)<>달력!$B$3,\"\",IF(VLOOKUP(달력!O35,일정!$B$4:$O$2001,6,0)=0,\"\",VLOOKUP(달력!O35,일정!$B$4:$O$2001,6,0)))","v":""}]
[3,{"$f":"IF(MONTH(달력!C35)<>달력!$B$3,\"\",IF(VLOOKUP(달력!C35,일정!$B$4:$O$2001,8,0)=0,\"\",VLOOKUP(달력!C35,일정!$B$4:$O$2001,8,0)))","v":""},null,{"$f":"IF(MONTH(달력!E35)<>달력!$B$3,\"\",IF(VLOOKUP(달력!E35,일정!$B$4:$O$2001,8,0)=0,\"\",VLOOKUP(달력!E35,일정!$B$4:$O$2001,8,0)))","v":""},null,{"$f":"IF(MONTH(달력!G35)<>달력!$B$3,\"\",IF(VLOOKUP(달력!G35,일정!$B$4:$O$2001,8,0)=0,\"\",VLOOKUP(달력!G35,일정!$B$4:$O$2001,8,0)))","v":""},null,{"$f":"IF(MONTH(달력!I35)<>달력!$B$3,\"\",IF(VLOOKUP(달력!I35,일정!$B$4:$O$2001,8,0)=0,\"\",VLOOKUP(달력!I35,일정!$B$4:$O$2001,8,0)))","v":""},null,{"$f":"IF(MONTH(달력!K35)<>달력!$B$3,\"\",IF(VLOOKUP(달력!K35,일정!$B$4:$O$2001,8,0)=0,\"\",VLOOKUP(달력!K35,일정!$B$4:$O$2001,8,0)))","v":""},null,{"$f":"IF(MONTH(달력!M35)<>달력!$B$3,\"\",IF(VLOOKUP(달력!M35,일정!$B$4:$O$2001,8,0)=0,\"\",VLOOKUP(달력!M35,일정!$B$4:$O$2001,8,0)))","v":""},null,{"$f":"IF(MONTH(달력!O35)<>달력!$B$3,\"\",IF(VLOOKUP(달력!O35,일정!$B$4:$O$2001,8,0)=0,\"\",VLOOKUP(달력!O35,일정!$B$4:$O$2001,8,0)))","v":""}]
[4,{"$f":"IF(MONTH(달력!C35)<>달력!$B$3,\"\",IF(VLOOKUP(달력!C35,일정!$B$4:$O$2001,10,0)=0,\"\",VLOOKUP(달력!C35,일정!$B$4:$O$2001,10,0)))","v":""},null,{"$f":"IF(MONTH(달력!E35)<>달력!$B$3,\"\",IF(VLOOKUP(달력!E35,일정!$B$4:$O$2001,10,0)=0,\"\",VLOOKUP(달력!E35,일정!$B$4:$O$2001,10,0)))","v":""},null,{"$f":"IF(MONTH(달력!G35)<>달력!$B$3,\"\",IF(VLOOKUP(달력!G35,일정!$B$4:$O$2001,10,0)=0,\"\",VLOOKUP(달력!G35,일정!$B$4:$O$2001,10,0)))","v":""},null,{"$f":"IF(MONTH(달력!I35)<>달력!$B$3,\"\",IF(VLOOKUP(달력!I35,일정!$B$4:$O$2001,10,0)=0,\"\",VLOOKUP(달력!I35,일정!$B$4:$O$2001,10,0)))","v":""},null,{"$f":"IF(MONTH(달력!K35)<>달력!$B$3,\"\",IF(VLOOKUP(달력!K35,일정!$B$4:$O$2001,10,0)=0,\"\",VLOOKUP(달력!K35,일정!$B$4:$O$2001,10,0)))","v":""},null,{"$f":"IF(MONTH(달력!M35)<>달력!$B$3,\"\",IF(VLOOKUP(달력!M35,일정!$B$4:$O$2001,10,0)=0,\"\",VLOOKUP(달력!M35,일정!$B$4:$O$2001,10,0)))","v":""},null,{"$f":"IF(MONTH(달력!O35)<>달력!$B$3,\"\",IF(VLOOKUP(달력!O35,일정!$B$4:$O$2001,10,0)=0,\"\",VLOOKUP(달력!O35,일정!$B$4:$O$2001,10,0)))","v":""}]
[5,{"$f":"IF(MONTH(달력!C35)<>달력!$B$3,\"\",IF(VLOOKUP(달력!C35,일정!$B$4:$O$2001,12,0)=0,\"\",VLOOKUP(달력!C35,일정!$B$4:$O$2001,12,0)))","v":""},null,{"$f":"IF(MONTH(달력!E35)<>달력!$B$3,\"\",IF(VLOOKUP(달력!E35,일정!$B$4:$O$2001,12,0)=0,\"\",VLOOKUP(달력!E35,일정!$B$4:$O$2001,12,0)))","v":""},null,{"$f":"IF(MONTH(달력!G35)<>달력!$B$3,\"\",IF(VLOOKUP(달력!G35,일정!$B$4:$O$2001,12,0)=0,\"\",VLOOKUP(달력!G35,일정!$B$4:$O$2001,12,0)))","v":""},null,{"$f":"IF(MONTH(달력!I35)<>달력!$B$3,\"\",IF(VLOOKUP(달력!I35,일정!$B$4:$O$2001,12,0)=0,\"\",VLOOKUP(달력!I35,일정!$B$4:$O$2001,12,0)))","v":""},null,{"$f":"IF(MONTH(달력!K35)<>달력!$B$3,\"\",IF(VLOOKUP(달력!K35,일정!$B$4:$O$2001,12,0)=0,\"\",VLOOKUP(달력!K35,일정!$B$4:$O$2001,12,0)))","v":""},null,{"$f":"IF(MONTH(달력!M35)<>달력!$B$3,\"\",IF(VLOOKUP(달력!M35,일정!$B$4:$O$2001,12,0)=0,\"\",VLOOKUP(달력!M35,일정!$B$4:$O$2001,12,0)))","v":""},null,{"$f":"IF(MONTH(달력!O35)<>달력!$B$3,\"\",IF(VLOOKUP(달력!O35,일정!$B$4:$O$2001,12,0)=0,\"\",VLOOKUP(달력!O35,일정!$B$4:$O$2001,12,0)))","v":""}]
[6,{"$f":"IF(MONTH(달력!C35)<>달력!$B$3,\"\",IF(VLOOKUP(달력!C35,일정!$B$4:$O$2001,14,0)=0,\"\",VLOOKUP(달력!C35,일정!$B$4:$O$2001,14,0)))","v":""},null,{"$f":"IF(MONTH(달력!E35)<>달력!$B$3,\"\",IF(VLOOKUP(달력!E35,일정!$B$4:$O$2001,14,0)=0,\"\",VLOOKUP(달력!E35,일정!$B$4:$O$2001,14,0)))","v":""},null,{"$f":"IF(MONTH(달력!G35)<>달력!$B$3,\"\",IF(VLOOKUP(달력!G35,일정!$B$4:$O$2001,14,0)=0,\"\",VLOOKUP(달력!G35,일정!$B$4:$O$2001,14,0)))","v":""},null,{"$f":"IF(MONTH(달력!I35)<>달력!$B$3,\"\",IF(VLOOKUP(달력!I35,일정!$B$4:$O$2001,14,0)=0,\"\",VLOOKUP(달력!I35,일정!$B$4:$O$2001,14,0)))","v":""},null,{"$f":"IF(MONTH(달력!K35)<>달력!$B$3,\"\",IF(VLOOKUP(달력!K35,일정!$B$4:$O$2001,14,0)=0,\"\",VLOOKUP(달력!K35,일정!$B$4:$O$2001,14,0)))","v":""},null,{"$f":"IF(MONTH(달력!M35)<>달력!$B$3,\"\",IF(VLOOKUP(달력!M35,일정!$B$4:$O$2001,14,0)=0,\"\",VLOOKUP(달력!M35,일정!$B$4:$O$2001,14,0)))","v":""},null,{"$f":"IF(MONTH(달력!O35)<>달력!$B$3,\"\",IF(VLOOKUP(달력!O35,일정!$B$4:$O$2001,14,0)=0,\"\",VLOOKUP(달력!O35,일정!$B$4:$O$2001,14,0)))","v":""}]
[]
[1,{"$f":"IF(MONTH(달력!C42)<>달력!$B$3,\"\",IF(VLOOKUP(달력!C42,일정!$B$4:$O$2001,4,0)=0,\"\",VLOOKUP(달력!C42,일정!$B$4:$O$2001,4,0)))","v":""},null,{"$f":"IF(MONTH(달력!E42)<>달력!$B$3,\"\",IF(VLOOKUP(달력!E42,일정!$B$4:$O$2001,4,0)=0,\"\",VLOOKUP(달력!E42,일정!$B$4:$O$2001,4,0)))","v":""},null,{"$f":"IF(MONTH(달력!G42)<>달력!$B$3,\"\",IF(VLOOKUP(달력!G42,일정!$B$4:$O$2001,4,0)=0,\"\",VLOOKUP(달력!G42,일정!$B$4:$O$2001,4,0)))","v":""},null,{"$f":"IF(MONTH(달력!I42)<>달력!$B$3,\"\",IF(VLOOKUP(달력!I42,일정!$B$4:$O$2001,4,0)=0,\"\",VLOOKUP(달력!I42,일정!$B$4:$O$2001,4,0)))","v":""},null,{"$f":"IF(MONTH(달력!K42)<>달력!$B$3,\"\",IF(VLOOKUP(달력!K42,일정!$B$4:$O$2001,4,0)=0,\"\",VLOOKUP(달력!K42,일정!$B$4:$O$2001,4,0)))","v":""},null,{"$f":"IF(MONTH(달력!M42)<>달력!$B$3,\"\",IF(VLOOKUP(달력!M42,일정!$B$4:$O$2001,4,0)=0,\"\",VLOOKUP(달력!M42,일정!$B$4:$O$2001,4,0)))","v":""},null,{"$f":"IF(MONTH(달력!O42)<>달력!$B$3,\"\",IF(VLOOKUP(달력!O42,일정!$B$4:$O$2001,4,0)=0,\"\",VLOOKUP(달력!O42,일정!$B$4:$O$2001,4,0)))","v":""}]
[2,{"$f":"IF(MONTH(달력!C42)<>달력!$B$3,\"\",IF(VLOOKUP(달력!C42,일정!$B$4:$O$2001,6,0)=0,\"\",VLOOKUP(달력!C42,일정!$B$4:$O$2001,6,0)))","v":""},null,{"$f":"IF(MONTH(달력!E42)<>달력!$B$3,\"\",IF(VLOOKUP(달력!E42,일정!$B$4:$O$2001,6,0)=0,\"\",VLOOKUP(달력!E42,일정!$B$4:$O$2001,6,0)))","v":""},null,{"$f":"IF(MONTH(달력!G42)<>달력!$B$3,\"\",IF(VLOOKUP(달력!G42,일정!$B$4:$O$2001,6,0)=0,\"\",VLOOKUP(달력!G42,일정!$B$4:$O$2001,6,0)))","v":""},null,{"$f":"IF(MONTH(달력!I42)<>달력!$B$3,\"\",IF(VLOOKUP(달력!I42,일정!$B$4:$O$2001,6,0)=0,\"\",VLOOKUP(달력!I42,일정!$B$4:$O$2001,6,0)))","v":""},null,{"$f":"IF(MONTH(달력!K42)<>달력!$B$3,\"\",IF(VLOOKUP(달력!K42,일정!$B$4:$O$2001,6,0)=0,\"\",VLOOKUP(달력!K42,일정!$B$4:$O$2001,6,0)))","v":""},null,{"$f":"IF(MONTH(달력!M42)<>달력!$B$3,\"\",IF(VLOOKUP(달력!M42,일정!$B$4:$O$2001,6,0)=0,\"\",VLOOKUP(달력!M42,일정!$B$4:$O$2001,6,0)))","v":""},null,{"$f":"IF(MONTH(달력!O42)<>달력!$B$3,\"\",IF(VLOOKUP(달력!O42,일정!$B$4:$O$2001,6,0)=0,\"\",VLOOKUP(달력!O42,일정!$B$4:$O$2001,6,0)))","v":""}]
[3,{"$f":"IF(MONTH(달력!C42)<>달력!$B$3,\"\",IF(VLOOKUP(달력!C42,일정!$B$4:$O$2001,8,0)=0,\"\",VLOOKUP(달력!C42,일정!$B$4:$O$2001,8,0)))","v":""},null,{"$f":"IF(MONTH(달력!E42)<>달력!$B$3,\"\",IF(VLOOKUP(달력!E42,일정!$B$4:$O$2001,8,0)=0,\"\",VLOOKUP(달력!E42,일정!$B$4:$O$2001,8,0)))","v":""},null,{"$f":"IF(MONTH(달력!G42)<>달력!$B$3,\"\",IF(VLOOKUP(달력!G42,일정!$B$4:$O$2001,8,0)=0,\"\",VLOOKUP(달력!G42,일정!$B$4:$O$2001,8,0)))","v":""},null,{"$f":"IF(MONTH(달력!I42)<>달력!$B$3,\"\",IF(VLOOKUP(달력!I42,일정!$B$4:$O$2001,8,0)=0,\"\",VLOOKUP(달력!I42,일정!$B$4:$O$2001,8,0)))","v":""},null,{"$f":"IF(MONTH(달력!K42)<>달력!$B$3,\"\",IF(VLOOKUP(달력!K42,일정!$B$4:$O$2001,8,0)=0,\"\",VLOOKUP(달력!K42,일정!$B$4:$O$2001,8,0)))","v":""},null,{"$f":"IF(MONTH(달력!M42)<>달력!$B$3,\"\",IF(VLOOKUP(달력!M42,일정!$B$4:$O$2001,8,0)=0,\"\",VLOOKUP(달력!M42,일정!$B$4:$O$2001,8,0)))","v":""},null,{"$f":"IF(MONTH(달력!O42)<>달력!$B$3,\"\",IF(VLOOKUP(달력!O42,일정!$B$4:$O$2001,8,0)=0,\"\",VLOOKUP(달력!O42,일정!$B$4:$O$2001,8,0)))","v":""}]
[4,{"$f":"IF(MONTH(달력!C42)<>달력!$B$3,\"\",IF(VLOOKUP(달력!C42,일정!$B$4:$O$2001,10,0)=0,\"\",VLOOKUP(달력!C42,일정!$B$4:$O$2001,10,0)))","v":""},null,{"$f":"IF(MONTH(달력!E42)<>달력!$B$3,\"\",IF(VLOOKUP(달력!E42,일정!$B$4:$O$2001,10,0)=0,\"\",VLOOKUP(달력!E42,일정!$B$4:$O$2001,10,0)))","v":""},null,{"$f":"IF(MONTH(달력!G42)<>달력!$B$3,\"\",IF(VLOOKUP(달력!G42,일정!$B$4:$O$2001,10,0)=0,\"\",VLOOKUP(달력!G42,일정!$B$4:$O$2001,10,0)))","v":""},null,{"$f":"IF(MONTH(달력!I42)<>달력!$B$3,\"\",IF(VLOOKUP(달력!I42,일정!$B$4:$O$2001,10,0)=0,\"\",VLOOKUP(달력!I42,일정!$B$4:$O$2001,10,0)))","v":""},null,{"$f":"IF(MONTH(달력!K42)<>달력!$B$3,\"\",IF(VLOOKUP(달력!K42,일정!$B$4:$O$2001,10,0)=0,\"\",VLOOKUP(달력!K42,일정!$B$4:$O$2001,10,0)))","v":""},null,{"$f":"IF(MONTH(달력!M42)<>달력!$B$3,\"\",IF(VLOOKUP(달력!M42,일정!$B$4:$O$2001,10,0)=0,\"\",VLOOKUP(달력!M42,일정!$B$4:$O$2001,10,0)))","v":""},null,{"$f":"IF(MONTH(달력!O42)<>달력!$B$3,\"\",IF(VLOOKUP(달력!O42,일정!$B$4:$O$2001,10,0)=0,\"\",VLOOKUP(달력!O42,일정!$B$4:$O$2001,10,0)))","v":""}]
[5,{"$f":"IF(MONTH(달력!C42)<>달력!$B$3,\"\",IF(VLOOKUP(달력!C42,일정!$B$4:$O$2001,12,0)=0,\"\",VLOOKUP(달력!C42,일정!$B$4:$O$2001,12,0)))","v":""},null,{"$f":"IF(MONTH(달력!E42)<>달력!$B$3,\"\",IF(VLOOKUP(달력!E42,일정!$B$4:$O$2001,12,0)=0,\"\",VLOOKUP(달력!E42,일정!$B$4:$O$2001,12,0)))","v":""},null,{"$f":"IF(MONTH(달력!G42)<>달력!$B$3,\"\",IF(VLOOKUP(달력!G42,일정!$B$4:$O$2001,12,0)=0,\"\",VLOOKUP(달력!G42,일정!$B$4:$O$2001,12,0)))","v":""},null,{"$f":"IF(MONTH(달력!I42)<>달력!$B$3,\"\",IF(VLOOKUP(달력!I42,일정!$B$4:$O$2001,12,0)=0,\"\",VLOOKUP(달력!I42,일정!$B$4:$O$2001,12,0)))","v":""},null,{"$f":"IF(MONTH(달력!K42)<>달력!$B$3,\"\",IF(VLOOKUP(달력!K42,일정!$B$4:$O$2001,12,0)=0,\"\",VLOOKUP(달력!K42,일정!$B$4:$O$2001,12,0)))","v":""},null,{"$f":"IF(MONTH(달력!M42)<>달력!$B$3,\"\",IF(VLOOKUP(달력!M42,일정!$B$4:$O$2001,12,0)=0,\"\",VLOOKUP(달력!M42,일정!$B$4:$O$2001,12,0)))","v":""},null,{"$f":"IF(MONTH(달력!O42)<>달력!$B$3,\"\",IF(VLOOKUP(달력!O42,일정!$B$4:$O$2001,12,0)=0,\"\",VLOOKUP(달력!O42,일정!$B$4:$O$2001,12,0)))","v":""}]
[6,{"$f":"IF(MONTH(달력!C42)<>달력!$B$3,\"\",IF(VLOOKUP(달력!C42,일정!$B$4:$O$2001,14,0)=0,\"\",VLOOKUP(달력!C42,일정!$B$4:$O$2001,14,0)))","v":""},null,{"$f":"IF(MONTH(달력!E42)<>달력!$B$3,\"\",IF(VLOOKUP(달력!E42,일정!$B$4:$O$2001,14,0)=0,\"\",VLOOKUP(달력!E42,일정!$B$4:$O$2001,14,0)))","v":""},null,{"$f":"IF(MONTH(달력!G42)<>달력!$B$3,\"\",IF(VLOOKUP(달력!G42,일정!$B$4:$O$2001,14,0)=0,\"\",VLOOKUP(달력!G42,일정!$B$4:$O$2001,14,0)))","v":""},null,{"$f":"IF(MONTH(달력!I42)<>달력!$B$3,\"\",IF(VLOOKUP(달력!I42,일정!$B$4:$O$2001,14,0)=0,\"\",VLOOKUP(달력!I42,일정!$B$4:$O$2001,14,0)))","v":""},null,{"$f":"IF(MONTH(달력!K42)<>달력!$B$3,\"\",IF(VLOOKUP(달력!K42,일정!$B$4:$O$2001,14,0)=0,\"\",VLOOKUP(달력!K42,일정!$B$4:$O$2001,14,0)))","v":""},null,{"$f":"IF(MONTH(달력!M42)<>달력!$B$3,\"\",IF(VLOOKUP(달력!M42,일정!$B$4:$O$2001,14,0)=0,\"\",VLOOKUP(달력!M42,일정!$B$4:$O$2001,14,0)))","v":""},null,{"$f":"IF(MONTH(달력!O42)<>달력!$B$3,\"\",IF(VLOOKUP(달력!O42,일정!$B$4:$O$2001,14,0)=0,\"\",VLOOKUP(달력!O42,일정!$B$4:$O$2001,14,0)))","v":""}]
[]
[1,{"$f":"IF(MONTH(달력!C49)<>달력!$B$3,\"\",IF(VLOOKUP(달력!C49,일정!$B$4:$O$2001,4,0)=0,\"\",VLOOKUP(달력!C49,일정!$B$4:$O$2001,4,0)))","v":""},null,{"$f":"IF(MONTH(달력!E49)<>달력!$B$3,\"\",IF(VLOOKUP(달력!E49,일정!$B$4:$O$2001,4,0)=0,\"\",VLOOKUP(달력!E49,일정!$B$4:$O$2001,4,0)))","v":""},null,{"$f":"IF(MONTH(달력!G49)<>달력!$B$3,\"\",IF(VLOOKUP(달력!G49,일정!$B$4:$O$2001,4,0)=0,\"\",VLOOKUP(달력!G49,일정!$B$4:$O$2001,4,0)))","v":""},null,{"$f":"IF(MONTH(달력!I49)<>달력!$B$3,\"\",IF(VLOOKUP(달력!I49,일정!$B$4:$O$2001,4,0)=0,\"\",VLOOKUP(달력!I49,일정!$B$4:$O$2001,4,0)))","v":""},null,{"$f":"IF(MONTH(달력!K49)<>달력!$B$3,\"\",IF(VLOOKUP(달력!K49,일정!$B$4:$O$2001,4,0)=0,\"\",VLOOKUP(달력!K49,일정!$B$4:$O$2001,4,0)))","v":""},null,{"$f":"IF(MONTH(달력!M49)<>달력!$B$3,\"\",IF(VLOOKUP(달력!M49,일정!$B$4:$O$2001,4,0)=0,\"\",VLOOKUP(달력!M49,일정!$B$4:$O$2001,4,0)))","v":""},null,{"$f":"IF(MONTH(달력!O49)<>달력!$B$3,\"\",IF(VLOOKUP(달력!O49,일정!$B$4:$O$2001,4,0)=0,\"\",VLOOKUP(달력!O49,일정!$B$4:$O$2001,4,0)))","v":""}]
[2,{"$f":"IF(MONTH(달력!C49)<>달력!$B$3,\"\",IF(VLOOKUP(달력!C49,일정!$B$4:$O$2001,6,0)=0,\"\",VLOOKUP(달력!C49,일정!$B$4:$O$2001,6,0)))","v":""},null,{"$f":"IF(MONTH(달력!E49)<>달력!$B$3,\"\",IF(VLOOKUP(달력!E49,일정!$B$4:$O$2001,6,0)=0,\"\",VLOOKUP(달력!E49,일정!$B$4:$O$2001,6,0)))","v":""},null,{"$f":"IF(MONTH(달력!G49)<>달력!$B$3,\"\",IF(VLOOKUP(달력!G49,일정!$B$4:$O$2001,6,0)=0,\"\",VLOOKUP(달력!G49,일정!$B$4:$O$2001,6,0)))","v":""},null,{"$f":"IF(MONTH(달력!I49)<>달력!$B$3,\"\",IF(VLOOKUP(달력!I49,일정!$B$4:$O$2001,6,0)=0,\"\",VLOOKUP(달력!I49,일정!$B$4:$O$2001,6,0)))","v":""},null,{"$f":"IF(MONTH(달력!K49)<>달력!$B$3,\"\",IF(VLOOKUP(달력!K49,일정!$B$4:$O$2001,6,0)=0,\"\",VLOOKUP(달력!K49,일정!$B$4:$O$2001,6,0)))","v":""},null,{"$f":"IF(MONTH(달력!M49)<>달력!$B$3,\"\",IF(VLOOKUP(달력!M49,일정!$B$4:$O$2001,6,0)=0,\"\",VLOOKUP(달력!M49,일정!$B$4:$O$2001,6,0)))","v":""},null,{"$f":"IF(MONTH(달력!O49)<>달력!$B$3,\"\",IF(VLOOKUP(달력!O49,일정!$B$4:$O$2001,6,0)=0,\"\",VLOOKUP(달력!O49,일정!$B$4:$O$2001,6,0)))","v":""}]
[3,{"$f":"IF(MONTH(달력!C49)<>달력!$B$3,\"\",IF(VLOOKUP(달력!C49,일정!$B$4:$O$2001,8,0)=0,\"\",VLOOKUP(달력!C49,일정!$B$4:$O$2001,8,0)))","v":""},null,{"$f":"IF(MONTH(달력!E49)<>달력!$B$3,\"\",IF(VLOOKUP(달력!E49,일정!$B$4:$O$2001,8,0)=0,\"\",VLOOKUP(달력!E49,일정!$B$4:$O$2001,8,0)))","v":""},null,{"$f":"IF(MONTH(달력!G49)<>달력!$B$3,\"\",IF(VLOOKUP(달력!G49,일정!$B$4:$O$2001,8,0)=0,\"\",VLOOKUP(달력!G49,일정!$B$4:$O$2001,8,0)))","v":""},null,{"$f":"IF(MONTH(달력!I49)<>달력!$B$3,\"\",IF(VLOOKUP(달력!I49,일정!$B$4:$O$2001,8,0)=0,\"\",VLOOKUP(달력!I49,일정!$B$4:$O$2001,8,0)))","v":""},null,{"$f":"IF(MONTH(달력!K49)<>달력!$B$3,\"\",IF(VLOOKUP(달력!K49,일정!$B$4:$O$2001,8,0)=0,\"\",VLOOKUP(달력!K49,일정!$B$4:$O$2001,8,0)))","v":""},null,{"$f":"IF(MONTH(달력!M49)<>달력!$B$3,\"\",IF(VLOOKUP(달력!M49,일정!$B$4:$O$2001,8,0)=0,\"\",VLOOKUP(달력!M49,일정!$B$4:$O$2001,8,0)))","v":""},null,{"$f":"IF(MONTH(달력!O49)<>달력!$B$3,\"\",IF(VLOOKUP(달력!O49,일정!$B$4:$O$2001,8,0)=0,\"\",VLOOKUP(달력!O49,일정!$B$4:$O$2001,8,0)))","v":""}]
[4,{"$f":"IF(MONTH(달력!C49)<>달력!$B$3,\"\",IF(VLOOKUP(달력!C49,일정!$B$4:$O$2001,10,0)=0,\"\",VLOOKUP(달력!C49,일정!$B$4:$O$2001,10,0)))","v":""},null,{"$f":"IF(MONTH(달력!E49)<>달력!$B$3,\"\",IF(VLOOKUP(달력!E49,일정!$B$4:$O$2001,10,0)=0,\"\",VLOOKUP(달력!E49,일정!$B$4:$O$2001,10,0)))","v":""},null,{"$f":"IF(MONTH(달력!G49)<>달력!$B$3,\"\",IF(VLOOKUP(달력!G49,일정!$B$4:$O$2001,10,0)=0,\"\",VLOOKUP(달력!G49,일정!$B$4:$O$2001,10,0)))","v":""},null,{"$f":"IF(MONTH(달력!I49)<>달력!$B$3,\"\",IF(VLOOKUP(달력!I49,일정!$B$4:$O$2001,10,0)=0,\"\",VLOOKUP(달력!I49,일정!$B$4:$O$2001,10,0)))","v":""},null,{"$f":"IF(MONTH(달력!K49)<>달력!$B$3,\"\",IF(VLOOKUP(달력!K49,일정!$B$4:$O$2001,10,0)=0,\"\",VLOOKUP(달력!K49,일정!$B$4:$O$2001,10,0)))","v":""},null,{"$f":"IF(MONTH(달력!M49)<>달력!$B$3,\"\",IF(VLOOKUP(달력!M49,일정!$B$4:$O$2001,10,0)=0,\"\",VLOOKUP(달력!M49,일정!$B$4:$O$2001,10,0)))","v":""},null,{"$f":"IF(MONTH(달력!O49)<>달력!$B$3,\"\",IF(VLOOKUP(달력!O49,일정!$B$4:$O$2001,10,0)=0,\"\",VLOOKUP(달력!O49,일정!$B$4:$O$2001,10,0)))","v":""}]
[5,{"$f":"IF(MONTH(달력!C49)<>달력!$B$3,\"\",IF(VLOOKUP(달력!C49,일정!$B$4:$O$2001,12,0)=0,\"\",VLOOKUP(달력!C49,일정!$B$4:$O$2001,12,0)))","v":""},null,{"$f":"IF(MONTH(달력!E49)<>달력!$B$3,\"\",IF(VLOOKUP(달력!E49,일정!$B$4:$O$2001,12,0)=0,\"\",VLOOKUP(달력!E49,일정!$B$4:$O$2001,12,0)))","v":""},null,{"$f":"IF(MONTH(달력!G49)<>달력!$B$3,\"\",IF(VLOOKUP(달력!G49,일정!$B$4:$O$2001,12,0)=0,\"\",VLOOKUP(달력!G49,일정!$B$4:$O$2001,12,0)))","v":""},null,{"$f":"IF(MONTH(달력!I49)<>달력!$B$3,\"\",IF(VLOOKUP(달력!I49,일정!$B$4:$O$2001,12,0)=0,\"\",VLOOKUP(달력!I49,일정!$B$4:$O$2001,12,0)))","v":""},null,{"$f":"IF(MONTH(달력!K49)<>달력!$B$3,\"\",IF(VLOOKUP(달력!K49,일정!$B$4:$O$2001,12,0)=0,\"\",VLOOKUP(달력!K49,일정!$B$4:$O$2001,12,0)))","v":""},null,{"$f":"IF(MONTH(달력!M49)<>달력!$B$3,\"\",IF(VLOOKUP(달력!M49,일정!$B$4:$O$2001,12,0)=0,\"\",VLOOKUP(달력!M49,일정!$B$4:$O$2001,12,0)))","v":""},null,{"$f":"IF(MONTH(달력!O49)<>달력!$B$3,\"\",IF(VLOOKUP(달력!O49,일정!$B$4:$O$2001,12,0)=0,\"\",VLOOKUP(달력!O49,일정!$B$4:$O$2001,12,0)))","v":""}]
[6,{"$f":"IF(MONTH(달력!C49)<>달력!$B$3,\"\",IF(VLOOKUP(달력!C49,일정!$B$4:$O$2001,14,0)=0,\"\",VLOOKUP(달력!C49,일정!$B$4:$O$2001,14,0)))","v":""},null,{"$f":"IF(MONTH(달력!E49)<>달력!$B$3,\"\",IF(VLOOKUP(달력!E49,일정!$B$4:$O$2001,14,0)=0,\"\",VLOOKUP(달력!E49,일정!$B$4:$O$2001,14,0)))","v":""},null,{"$f":"IF(MONTH(달력!G49)<>달력!$B$3,\"\",IF(VLOOKUP(달력!G49,일정!$B$4:$O$2001,14,0)=0,\"\",VLOOKUP(달력!G49,일정!$B$4:$O$2001,14,0)))","v":""},null,{"$f":"IF(MONTH(달력!I49)<>달력!$B$3,\"\",IF(VLOOKUP(달력!I49,일정!$B$4:$O$2001,14,0)=0,\"\",VLOOKUP(달력!I49,일정!$B$4:$O$2001,14,0)))","v":""},null,{"$f":"IF(MONTH(달력!K49)<>달력!$B$3,\"\",IF(VLOOKUP(달력!K49,일정!$B$4:$O$2001,14,0)=0,\"\",VLOOKUP(달력!K49,일정!$B$4:$O$2001,14,0)))","v":""},null,{"$f":"IF(MONTH(달력!M49)<>달력!$B$3,\"\",IF(VLOOKUP(달력!M49,일정!$B$4:$O$2001,14,0)=0,\"\",VLOOKUP(달력!M49,일정!$B$4:$O$2001,14,0)))","v":""},null,{"$f":"IF(MONTH(달력!O49)<>달력!$B$3,\"\",IF(VLOOKUP(달력!O49,일정!$B$4:$O$2001,14,0)=0,\"\",VLOOKUP(달력!O49,일정!$B$4:$O$2001,14,0)))","v":""}]

{"sheet":"일정","index":4,"n_rows":1834,"n_cols":15,"rows_kept":1834,"cut":false,"hidden":false,"merged":[]}
[]
[null,"시작연도",2024,{"$f":"C2&\"년\"","v":"2024년"},{"$f":"C2+1&\"년\"","v":"2025년"},{"$f":"C2+2&\"년       \"&C2+3&\"년\"","v":"2026년       2027년"},{"$f":"\"      \"&C2+4&\"년\"","v":"      2028년"}]
[]
[null,"날짜","요일","일정1 내용","일정1 범례","일정2 내용","일정2 범례","일정3 내용","일정3 범례","일정4 내용","일정4 범례","일정5 내용","일정5 범례","일정6 내용","일정6 범례"]
[{"$f":"DATE($C$2,1,1)","v":"2024-01-01"},{"$f":"DATE($C$2,1,1)","v":"2024-01-01"},{"$f":"CHOOSE(WEEKDAY(B5,1),\"일\",\"월\",\"화\",\"수\",\"목\",\"금\",\"토\")","v":"월"}]
[{"$f":"A5+1","v":"2024-01-02"},{"$f":"B5+1","v":"2024-01-02"},{"$f":"CHOOSE(WEEKDAY(B6,1),\"일\",\"월\",\"화\",\"수\",\"목\",\"금\",\"토\")","v":"화"}]
[{"$f":"A6+1","v":"2024-01-03"},{"$f":"B6+1","v":"2024-01-03"},"수"]
["2024-01-04","2024-01-04","목"]
["2024-01-05","2024-01-05","금"]
["2024-01-06","2024-01-06","토"]
["2024-01-07","2024-01-07","일"]
["2024-01-08","2024-01-08","월"]
["2024-01-09","2024-01-09","화"]
["2024-01-10","2024-01-10","수"]
["2024-01-11","2024-01-11","목"]
["2024-01-12","2024-01-12","금"]
["2024-01-13","2024-01-13","토"]
["2024-01-14","2024-01-14","일"]
["2024-01-15","2024-01-15","월"]
["2024-01-16","2024-01-16","화"]
["2024-01-17","2024-01-17","수"]
["2024-01-18","2024-01-18","목"]
["2024-01-19","2024-01-19","금"]
["2024-01-20","2024-01-20","토"]
["2024-01-21","2024-01-21","일"]
["2024-01-22","2024-01-22","월"]
["2024-01-23","2024-01-23","화"]
["2024-01-24","2024-01-24","수"]
["2024-01-25","2024-01-25","목"]
["2024-01-26","2024-01-26","금"]
["2024-01-27","2024-01-27","토"]
["2024-01-28","2024-01-28","일"]
["2024-01-29","2024-01-29","월"]
["2024-01-30","2024-01-30","화"]
["2024-01-31","2024-01-31","수"]
["2024-02-01","2024-02-01","목"]
["2024-02-02","2024-02-02","금"]
["2024-02-03","2024-02-03","토"]
["2024-02-04","2024-02-04","일"]
["2024-02-05","2024-02-05","월"]
["2024-02-06","2024-02-06","화"]
["2024-02-07","2024-02-07","수"]
["2024-02-08","2024-02-08","목"]
["2024-02-09","2024-02-09","금"]
["2024-02-10","2024-02-10","토"]
["2024-02-11","2024-02-11","일"]
["2024-02-12","2024-02-12","월"]
["2024-02-13","2024-02-13","화"]
["2024-02-14","2024-02-14","수"]
["2024-02-15","2024-02-15","목"]
["2024-02-16","2024-02-16","금"]
["2024-02-17","2024-02-17","토"]
["2024-02-18","2024-02-18","일"]
["2024-02-19","2024-02-19","월"]
["2024-02-20","2024-02-20","화"]
["2024-02-21","2024-02-21","수"]
["2024-02-22","2024-02-22","목"]
["2024-02-23","2024-02-23","금"]
["2024-02-24","2024-02-24","토"]
["2024-02-25","2024-02-25","일"]
["2024-02-26","2024-02-26","월"]
["2024-02-27","2024-02-27","화"]
["2024-02-28","2024-02-28","수"]
["2024-02-29","2024-02-29","목"]
["2024-03-01","2024-03-01","금"]
["2024-03-02","2024-03-02","토"]
["2024-03-03","2024-03-03","일"]
["2024-03-04","2024-03-04","월"]
["2024-03-05","2024-03-05","화"]
["2024-03-06","2024-03-06",{"$f":"CHOOSE(WEEKDAY(B70,1),\"일\",\"월\",\"화\",\"수\",\"목\",\"금\",\"토\")","v":"수"}]
[{"$f":"A70+1","v":"2024-03-07"},{"$f":"B70+1","v":"2024-03-07"},"목"]
["2024-03-08","2024-03-08","금"]
["2024-03-09","2024-03-09","토"]
["2024-03-10","2024-03-10","일"]
["2024-03-11","2024-03-11","월"]
["2024-03-12","2024-03-12","화"]
["2024-03-13","2024-03-13","수"]
["2024-03-14","2024-03-14","목"]
["2024-03-15","2024-03-15","금"]
["2024-03-16","2024-03-16","토"]
["2024-03-17","2024-03-17","일"]
["2024-03-18","2024-03-18","월"]
["2024-03-19","2024-03-19","화"]
["2024-03-20","2024-03-20","수"]
["2024-03-21","2024-03-21","목"]
["2024-03-22","2024-03-22","금"]
["2024-03-23","2024-03-23","토"]
["2024-03-24","2024-03-24","일"]
["2024-03-25","2024-03-25","월"]
["2024-03-26","2024-03-26","화"]
["2024-03-27","2024-03-27","수"]
["2024-03-28","2024-03-28","목"]
["2024-03-29","2024-03-29","금"]
["2024-03-30","2024-03-30","토"]
["2024-03-31","2024-03-31","일"]
["2024-04-01","2024-04-01","월"]
["2024-04-02","2024-04-02","화"]
["2024-04-03","2024-04-03","수"]
["2024-04-04","2024-04-04","목"]
["2024-04-05","2024-04-05","금"]
["2024-04-06","2024-04-06","토"]
["2024-04-07","2024-04-07","일"]
["2024-04-08","2024-04-08","월"]
["2024-04-09","2024-04-09","화"]
["2024-04-10","2024-04-10","수"]
["2024-04-11","2024-04-11","목"]
["2024-04-12","2024-04-12","금"]
["2024-04-13","2024-04-13","토"]
["2024-04-14","2024-04-14","일"]
["2024-04-15","2024-04-15","월"]
["2024-04-16","2024-04-16","화"]
["2024-04-17","2024-04-17","수"]
["2024-04-18","2024-04-18","목"]
["2024-04-19","2024-04-19","금"]
["2024-04-20","2024-04-20","토"]
["2024-04-21","2024-04-21","일"]
["2024-04-22","2024-04-22","월"]
["2024-04-23","2024-04-23","화"]
["2024-04-24","2024-04-24","수"]
["2024-04-25","2024-04-25","목"]
["2024-04-26","2024-04-26","금"]
["2024-04-27","2024-04-27","토"]
["2024-04-28","2024-04-28","일"]
["2024-04-29","2024-04-29","월"]
["2024-04-30","2024-04-30","화"]
["2024-05-01","2024-05-01","수"]
["2024-05-02","2024-05-02","목"]
["2024-05-03","2024-05-03","금"]
["2024-05-04","2024-05-04","토"]
["2024-05-05","2024-05-05","일"]
["2024-05-06","2024-05-06","월"]
["2024-05-07","2024-05-07","화"]
["2024-05-08","2024-05-08","수"]
["2024-05-09","2024-05-09",{"$f":"CHOOSE(WEEKDAY(B134,1),\"일\",\"월\",\"화\",\"수\",\"목\",\"금\",\"토\")","v":"목"}]
[{"$f":"A134+1","v":"2024-05-10"},{"$f":"B134+1","v":"2024-05-10"},"금"]
["2024-05-11","2024-05-11","토"]
["2024-05-12","2024-05-12","일"]
["2024-05-13","2024-05-13","월"]
["2024-05-14","2024-05-14","화"]
["2024-05-15","2024-05-15","수"]
["2024-05-16","2024-05-16","목"]
["2024-05-17","2024-05-17","금"]
["2024-05-18","2024-05-18","토"]
["2024-05-19","2024-05-19","일"]
["2024-05-20","2024-05-20","월"]
["2024-05-21","2024-05-21","화"]
["2024-05-22","2024-05-22","수"]
["2024-05-23","2024-05-23","목"]
["2024-05-24","2024-05-24","금"]
["2024-05-25","2024-05-25","토"]
["2024-05-26","2024-05-26","일"]
["2024-05-27","2024-05-27","월"]
["2024-05-28","2024-05-28","화"]
["2024-05-29","2024-05-29","수"]
["2024-05-30","2024-05-30","목"]
["2024-05-31","2024-05-31","금"]
["2024-06-01","2024-06-01","토"]
["2024-06-02","2024-06-02","일"]
["2024-06-03","2024-06-03","월"]
["2024-06-04","2024-06-04","화"]
["2024-06-05","2024-06-05","수"]
["2024-06-06","2024-06-06","목"]
["2024-06-07","2024-06-07","금"]
["2024-06-08","2024-06-08","토"]
["2024-06-09","2024-06-09","일"]
["2024-06-10","2024-06-10","월"]
["2024-06-11","2024-06-11","화"]
["2024-06-12","2024-06-12","수"]
["2024-06-13","2024-06-13","목"]
["2024-06-14","2024-06-14","금"]
["2024-06-15","2024-06-15","토"]
["2024-06-16","2024-06-16","일"]
["2024-06-17","2024-06-17","월"]
["2024-06-18","2024-06-18","화"]
["2024-06-19","2024-06-19","수"]
["2024-06-20","2024-06-20","목"]
["2024-06-21","2024-06-21","금"]
["2024-06-22","2024-06-22","토"]
["2024-06-23","2024-06-23","일"]
["2024-06-24","2024-06-24","월"]
["2024-06-25","2024-06-25","화"]
["2024-06-26","2024-06-26","수"]
["2024-06-27","2024-06-27","목"]
["2024-06-28","2024-06-28","금"]
["2024-06-29","2024-06-29","토"]
["2024-06-30","2024-06-30","일"]
["2024-07-01","2024-07-01","월"]
["2024-07-02","2024-07-02","화"]
["2024-07-03","2024-07-03","수"]
["2024-07-04","2024-07-04","목"]
["2024-07-05","2024-07-05","금"]
["2024-07-06","2024-07-06","토"]
["2024-07-07","2024-07-07","일"]
["2024-07-08","2024-07-08","월"]
["2024-07-09","2024-07-09","화"]
["2024-07-10","2024-07-10","수"]
["2024-07-11","2024-07-11","목"]
["2024-07-12","2024-07-12",{"$f":"CHOOSE(WEEKDAY(B198,1),\"일\",\"월\",\"화\",\"수\",\"목\",\"금\",\"토\")","v":"금"}]
[{"$f":"A198+1","v":"2024-07-13"},{"$f":"B198+1","v":"2024-07-13"},"토"]
["2024-07-14","2024-07-14","일"]
["2024-07-15","2024-07-15","월"]
["2024-07-16","2024-07-16","화"]
["2024-07-17","2024-07-17","수"]
["2024-07-18","2024-07-18","목"]
["2024-07-19","2024-07-19","금"]
["2024-07-20","2024-07-20","토"]
["2024-07-21","2024-07-21","일"]
["2024-07-22","2024-07-22","월"]
["2024-07-23","2024-07-23","화"]
["2024-07-24","2024-07-24","수"]
["2024-07-25","2024-07-25","목"]
["2024-07-26","2024-07-26","금"]
["2024-07-27","2024-07-27","토"]
["2024-07-28","2024-07-28","일"]
["2024-07-29","2024-07-29","월"]
["2024-07-30","2024-07-30","화"]
["2024-07-31","2024-07-31","수"]
["2024-08-01","2024-08-01","목"]
["2024-08-02","2024-08-02","금"]
["2024-08-03","2024-08-03","토"]
["2024-08-04","2024-08-04","일"]
["2024-08-05","2024-08-05","월"]
["2024-08-06","2024-08-06","화"]
["2024-08-07","2024-08-07","수"]
["2024-08-08","2024-08-08","목"]
["2024-08-09","2024-08-09","금"]
["2024-08-10","2024-08-10","토"]
["2024-08-11","2024-08-11","일"]
["2024-08-12","2024-08-12","월"]
["2024-08-13","2024-08-13","화"]
["2024-08-14","2024-08-14","수"]
["2024-08-15","2024-08-15","목"]
["2024-08-16","2024-08-16","금"]
["2024-08-17","2024-08-17","토"]
["2024-08-18","2024-08-18","일"]
["2024-08-19","2024-08-19","월"]
["2024-08-20","2024-08-20","화"]
["2024-08-21","2024-08-21","수"]
["2024-08-22","2024-08-22","목"]
["2024-08-23","2024-08-23","금"]
["2024-08-24","2024-08-24","토"]
["2024-08-25","2024-08-25","일"]
["2024-08-26","2024-08-26","월"]
["2024-08-27","2024-08-27","화"]
["2024-08-28","2024-08-28","수"]
["2024-08-29","2024-08-29","목"]
["2024-08-30","2024-08-30","금"]
["2024-08-31","2024-08-31","토"]
["2024-09-01","2024-09-01","일"]
["2024-09-02","2024-09-02","월"]
["2024-09-03","2024-09-03","화"]
["2024-09-04","2024-09-04","수"]
["2024-09-05","2024-09-05","목"]
["2024-09-06","2024-09-06","금"]
["2024-09-07","2024-09-07","토"]
["2024-09-08","2024-09-08","일"]
["2024-09-09","2024-09-09","월"]
["2024-09-10","2024-09-10","화"]
["2024-09-11","2024-09-11","수"]
["2024-09-12","2024-09-12","목"]
["2024-09-13","2024-09-13","금"]
["2024-09-14","2024-09-14",{"$f":"CHOOSE(WEEKDAY(B262,1),\"일\",\"월\",\"화\",\"수\",\"목\",\"금\",\"토\")","v":"토"}]
[{"$f":"A262+1","v":"2024-09-15"},{"$f":"B262+1","v":"2024-09-15"},"일"]
["2024-09-16","2024-09-16","월"]
["2024-09-17","2024-09-17","화"]
["2024-09-18","2024-09-18","수"]
["2024-09-19","2024-09-19","목"]
["2024-09-20","2024-09-20","금"]
["2024-09-21","2024-09-21","토"]
["2024-09-22","2024-09-22","일"]
["2024-09-23","2024-09-23","월"]
["2024-09-24","2024-09-24","화"]
["2024-09-25","2024-09-25","수"]
["2024-09-26","2024-09-26","목"]
["2024-09-27","2024-09-27","금"]
["2024-09-28","2024-09-28","토"]
["2024-09-29","2024-09-29","일"]
["2024-09-30","2024-09-30","월"]
["2024-10-01","2024-10-01","화"]
["2024-10-02","2024-10-02","수"]
["2024-10-03","2024-10-03","목"]
["2024-10-04","2024-10-04","금"]
["2024-10-05","2024-10-05","토"]
["2024-10-06","2024-10-06","일"]
["2024-10-07","2024-10-07","월"]
["2024-10-08","2024-10-08","화"]
["2024-10-09","2024-10-09","수"]
["2024-10-10","2024-10-10","목"]
["2024-10-11","2024-10-11","금"]
["2024-10-12","2024-10-12","토"]
["2024-10-13","2024-10-13","일"]
["2024-10-14","2024-10-14","월"]
["2024-10-15","2024-10-15","화"]
["2024-10-16","2024-10-16","수"]
["2024-10-17","2024-10-17","목"]
["2024-10-18","2024-10-18","금"]
["2024-10-19","2024-10-19","토"]
["2024-10-20","2024-10-20","일"]
["2024-10-21","2024-10-21","월"]
["2024-10-22","2024-10-22","화"]
["2024-10-23","2024-10-23","수"]
["2024-10-24","2024-10-24","목"]
["2024-10-25","2024-10-25","금"]
["2024-10-26","2024-10-26","토"]
["2024-10-27","2024-10-27","일"]
["2024-10-28","2024-10-28","월"]
["2024-10-29","2024-10-29","화"]
["2024-10-30","2024-10-30","수"]
["2024-10-31","2024-10-31","목"]
["2024-11-01","2024-11-01","금"]
["2024-11-02","2024-11-02","토"]
["2024-11-03","2024-11-03","일"]
["2024-11-04","2024-11-04","월"]
["2024-11-05","2024-11-05","화"]
["2024-11-06","2024-11-06","수"]
["2024-11-07","2024-11-07","목"]
["2024-11-08","2024-11-08","금"]
["2024-11-09","2024-11-09","토"]
["2024-11-10","2024-11-10","일"]
["2024-11-11","2024-11-11","월"]
["2024-11-12","2024-11-12","화"]
["2024-11-13","2024-11-13","수"]
["2024-11-14","2024-11-14","목"]
["2024-11-15","2024-11-15","금"]
["2024-11-16","2024-11-16","토"]
["2024-11-17","2024-11-17",{"$f":"CHOOSE(WEEKDAY(B326,1),\"일\",\"월\",\"화\",\"수\",\"목\",\"금\",\"토\")","v":"일"}]
[{"$f":"A326+1","v":"2024-11-18"},{"$f":"B326+1","v":"2024-11-18"},"월"]
["2024-11-19","2024-11-19","화"]
["2024-11-20","2024-11-20","수"]
["2024-11-21","2024-11-21","목"]
["2024-11-22","2024-11-22","금"]
["2024-11-23","2024-11-23","토"]
["2024-11-24","2024-11-24","일"]
["2024-11-25","2024-11-25","월"]
["2024-11-26","2024-11-26","화"]
["2024-11-27","2024-11-27","수"]
["2024-11-28","2024-11-28","목"]
["2024-11-29","2024-11-29","금"]
["2024-11-30","2024-11-30","토"]
["2024-12-01","2024-12-01","일"]
["2024-12-02","2024-12-02","월"]
["2024-12-03","2024-12-03","화"]
["2024-12-04","2024-12-04","수"]
["2024-12-05","2024-12-05","목"]
["2024-12-06","2024-12-06","금"]
["2024-12-07","2024-12-07","토"]
["2024-12-08","2024-12-08","일"]
["2024-12-09","2024-12-09","월"]
["2024-12-10","2024-12-10","화"]
["2024-12-11","2024-12-11","수"]
["2024-12-12","2024-12-12","목"]
["2024-12-13","2024-12-13","금"]
["2024-12-14","2024-12-14","토"]
["2024-12-15","2024-12-15","일"]
["2024-12-16","2024-12-16","월"]
["2024-12-17","2024-12-17","화"]
["2024-12-18","2024-12-18","수"]
["2024-12-19","2024-12-19","목"]
["2024-12-20","2024-12-20","금"]
["2024-12-21","2024-12-21","토"]
["2024-12-22","2024-12-22","일"]
["2024-12-23","2024-12-23","월"]
["2024-12-24","2024-12-24","화"]
["2024-12-25","2024-12-25","수"]
["2024-12-26","2024-12-26","목"]
["2024-12-27","2024-12-27","금"]
["2024-12-28","2024-12-28","토"]
["2024-12-29","2024-12-29","일"]
["2024-12-30","2024-12-30","월"]
["2024-12-31",{"$f":"IF(YEAR(A369)=YEAR(A370),A369+1,\"\")","v":"2024-12-31"},{"$f":"IF(B370=\"\",\"\",CHOOSE(WEEKDAY(B370,1),\"일\",\"월\",\"화\",\"수\",\"목\",\"금\",\"토\"))","v":"화"}]
[{"$f":"DATE($C$2+1,1,1)","v":"2025-01-01"},{"$f":"DATE($C$2+1,1,1)","v":"2025-01-01"},{"$f":"CHOOSE(WEEKDAY(B371,1),\"일\",\"월\",\"화\",\"수\",\"목\",\"금\",\"토\")","v":"수"}]
["2025-01-02","2025-01-02","목"]
["2025-01-03","2025-01-03","금"]
["2025-01-04","2025-01-04","토"]
["2025-01-05","2025-01-05","일"]
["2025-01-06","2025-01-06","월"]
["2025-01-07","2025-01-07","화"]
["2025-01-08","2025-01-08","수"]
["2025-01-09","2025-01-09","목"]
["2025-01-10","2025-01-10","금"]
["2025-01-11","2025-01-11","토"]
["2025-01-12","2025-01-12","일"]
["2025-01-13","2025-01-13","월"]
["2025-01-14","2025-01-14","화"]
["2025-01-15","2025-01-15","수"]
["2025-01-16","2025-01-16","목"]
["2025-01-17","2025-01-17","금"]
["2025-01-18","2025-01-18","토"]
["2025-01-19","2025-01-19","일"]
["2025-01-20","2025-01-20","월"]
[{"$f":"A390+1","v":"2025-01-21"},{"$f":"B390+1","v":"2025-01-21"},"화"]
["2025-01-22","2025-01-22","수"]
["2025-01-23","2025-01-23","목"]
["2025-01-24","2025-01-24","금"]
["2025-01-25","2025-01-25","토"]
["2025-01-26","2025-01-26","일"]
["2025-01-27","2025-01-27","월"]
["2025-01-28","2025-01-28","화"]
["2025-01-29","2025-01-29","수"]
["2025-01-30","2025-01-30","목"]
["2025-01-31","2025-01-31","금"]
["2025-02-01","2025-02-01","토"]
["2025-02-02","2025-02-02","일"]
["2025-02-03","2025-02-03","월"]
["2025-02-04","2025-02-04","화"]
["2025-02-05","2025-02-05","수"]
["2025-02-06","2025-02-06","목"]
["2025-02-07","2025-02-07","금"]
["2025-02-08","2025-02-08","토"]
["2025-02-09","2025-02-09","일"]
["2025-02-10","2025-02-10","월"]
["2025-02-11","2025-02-11","화"]
["2025-02-12","2025-02-12","수"]
["2025-02-13","2025-02-13","목"]
["2025-02-14","2025-02-14","금"]
["2025-02-15","2025-02-15","토"]
["2025-02-16","2025-02-16","일"]
["2025-02-17","2025-02-17","월"]
["2025-02-18","2025-02-18","화"]
["2025-02-19","2025-02-19","수"]
["2025-02-20","2025-02-20","목"]
["2025-02-21","2025-02-21","금"]
["2025-02-22","2025-02-22","토"]
["2025-02-23","2025-02-23","일"]
["2025-02-24","2025-02-24","월"]
["2025-02-25","2025-02-25","화"]
["2025-02-26","2025-02-26","수"]
["2025-02-27","2025-02-27","목"]
["2025-02-28","2025-02-28","금"]
["2025-03-01","2025-03-01","토"]
["2025-03-02","2025-03-02","일"]
["2025-03-03","2025-03-03","월"]
["2025-03-04","2025-03-04","화"]
["2025-03-05","2025-03-05",{"$f":"CHOOSE(WEEKDAY(B434,1),\"일\",\"월\",\"화\",\"수\",\"목\",\"금\",\"토\")","v":"수"}]
["2025-03-06","2025-03-06","목"]
["2025-03-07","2025-03-07","금"]
["2025-03-08","2025-03-08","토"]
["2025-03-09","2025-03-09","일"]
["2025-03-10","2025-03-10","월"]
["2025-03-11","2025-03-11","화"]
["2025-03-12","2025-03-12","수"]
["2025-03-13","2025-03-13","목"]
["2025-03-14","2025-03-14","금"]
["2025-03-15","2025-03-15","토"]
["2025-03-16","2025-03-16","일"]
["2025-03-17","2025-03-17","월"]
["2025-03-18","2025-03-18","화"]
["2025-03-19","2025-03-19","수"]
["2025-03-20","2025-03-20","목"]
["2025-03-21","2025-03-21","금"]
["2025-03-22","2025-03-22","토"]
["2025-03-23","2025-03-23","일"]
["2025-03-24","2025-03-24","월"]
["2025-03-25","2025-03-25","화"]
[{"$f":"A454+1","v":"2025-03-26"},{"$f":"B454+1","v":"2025-03-26"},"수"]
["2025-03-27","2025-03-27","목"]
["2025-03-28","2025-03-28","금"]
["2025-03-29","2025-03-29","토"]
["2025-03-30","2025-03-30","일"]
["2025-03-31","2025-03-31","월"]
["2025-04-01","2025-04-01","화"]
["2025-04-02","2025-04-02","수"]
["2025-04-03","2025-04-03","목"]
["2025-04-04","2025-04-04","금"]
["2025-04-05","2025-04-05","토"]
["2025-04-06","2025-04-06","일"]
["2025-04-07","2025-04-07","월"]
["2025-04-08","2025-04-08","화"]
["2025-04-09","2025-04-09","수"]
["2025-04-10","2025-04-10","목"]
["2025-04-11","2025-04-11","금"]
["2025-04-12","2025-04-12","토"]
["2025-04-13","2025-04-13","일"]
["2025-04-14","2025-04-14","월"]
["2025-04-15","2025-04-15","화"]
["2025-04-16","2025-04-16","수"]
["2025-04-17","2025-04-17","목"]
["2025-04-18","2025-04-18","금"]
["2025-04-19","2025-04-19","토"]
["2025-04-20","2025-04-20","일"]
["2025-04-21","2025-04-21","월"]
["2025-04-22","2025-04-22","화"]
["2025-04-23","2025-04-23","수"]
["2025-04-24","2025-04-24","목"]
["2025-04-25","2025-04-25","금"]
["2025-04-26","2025-04-26","토"]
["2025-04-27","2025-04-27","일"]
["2025-04-28","2025-04-28","월"]
["2025-04-29","2025-04-29","화"]
["2025-04-30","2025-04-30","수"]
["2025-05-01","2025-05-01","목"]
["2025-05-02","2025-05-02","금"]
["2025-05-03","2025-05-03","토"]
["2025-05-04","2025-05-04","일"]
["2025-05-05","2025-05-05","월"]
["2025-05-06","2025-05-06","화"]
["2025-05-07","2025-05-07","수"]
["2025-05-08","2025-05-08",{"$f":"CHOOSE(WEEKDAY(B498,1),\"일\",\"월\",\"화\",\"수\",\"목\",\"금\",\"토\")","v":"목"}]
["2025-05-09","2025-05-09","금"]
["2025-05-10","2025-05-10","토"]
["2025-05-11","2025-05-11","일"]
["2025-05-12","2025-05-12","월"]
["2025-05-13","2025-05-13","화"]
["2025-05-14","2025-05-14","수"]
["2025-05-15","2025-05-15","목"]
["2025-05-16","2025-05-16","금"]
["2025-05-17","2025-05-17","토"]
["2025-05-18","2025-05-18","일"]
["2025-05-19","2025-05-19","월"]
["2025-05-20","2025-05-20","화"]
["2025-05-21","2025-05-21","수"]
["2025-05-22","2025-05-22","목"]
["2025-05-23","2025-05-23","금"]
["2025-05-24","2025-05-24","토"]
["2025-05-25","2025-05-25","일"]
["2025-05-26","2025-05-26","월"]
["2025-05-27","2025-05-27","화"]
["2025-05-28","2025-05-28","수"]
[{"$f":"A518+1","v":"2025-05-29"},{"$f":"B518+1","v":"2025-05-29"},"목"]
["2025-05-30","2025-05-30","금"]
["2025-05-31","2025-05-31","토"]
["2025-06-01","2025-06-01","일"]
["2025-06-02","2025-06-02","월"]
["2025-06-03","2025-06-03","화"]
["2025-06-04","2025-06-04","수"]
["2025-06-05","2025-06-05","목"]
["2025-06-06","2025-06-06","금"]
["2025-06-07","2025-06-07","토"]
["2025-06-08","2025-06-08","일"]
["2025-06-09","2025-06-09","월"]
["2025-06-10","2025-06-10","화"]
["2025-06-11","2025-06-11","수"]
["2025-06-12","2025-06-12","목"]
["2025-06-13","2025-06-13","금"]
["2025-06-14","2025-06-14","토"]
["2025-06-15","2025-06-15","일"]
["2025-06-16","2025-06-16","월"]
["2025-06-17","2025-06-17","화"]
["2025-06-18","2025-06-18","수"]
["2025-06-19","2025-06-19","목"]
["2025-06-20","2025-06-20","금"]
["2025-06-21","2025-06-21","토"]
["2025-06-22","2025-06-22","일"]
["2025-06-23","2025-06-23","월"]
["2025-06-24","2025-06-24","화"]
["2025-06-25","2025-06-25","수"]
["2025-06-26","2025-06-26","목"]
["2025-06-27","2025-06-27","금"]
["2025-06-28","2025-06-28","토"]
["2025-06-29","2025-06-29","일"]
["2025-06-30","2025-06-30","월"]
["2025-07-01","2025-07-01","화"]
["2025-07-02","2025-07-02","수"]
["2025-07-03","2025-07-03","목"]
["2025-07-04","2025-07-04","금"]
["2025-07-05","2025-07-05","토"]
["2025-07-06","2025-07-06","일"]
["2025-07-07","2025-07-07","월"]
["2025-07-08","2025-07-08","화"]
["2025-07-09","2025-07-09","수"]
["2025-07-10","2025-07-10","목"]
["2025-07-11","2025-07-11",{"$f":"CHOOSE(WEEKDAY(B562,1),\"일\",\"월\",\"화\",\"수\",\"목\",\"금\",\"토\")","v":"금"}]
["2025-07-12","2025-07-12","토"]
["2025-07-13","2025-07-13","일"]
["2025-07-14","2025-07-14","월"]
["2025-07-15","2025-07-15","화"]
["2025-07-16","2025-07-16","수"]
["2025-07-17","2025-07-17","목"]
["2025-07-18","2025-07-18","금"]
["2025-07-19","2025-07-19","토"]
["2025-07-20","2025-07-20","일"]
["2025-07-21","2025-07-21","월"]
["2025-07-22","2025-07-22","화"]
["2025-07-23","2025-07-23","수"]
["2025-07-24","2025-07-24","목"]
["2025-07-25","2025-07-25","금"]
["2025-07-26","2025-07-26","토"]
["2025-07-27","2025-07-27","일"]
["2025-07-28","2025-07-28","월"]
["2025-07-29","2025-07-29","화"]
["2025-07-30","2025-07-30","수"]
["2025-07-31","2025-07-31","목"]
[{"$f":"A582+1","v":"2025-08-01"},{"$f":"B582+1","v":"2025-08-01"},"금"]
["2025-08-02","2025-08-02","토"]
["2025-08-03","2025-08-03","일"]
["2025-08-04","2025-08-04","월"]
["2025-08-05","2025-08-05","화"]
["2025-08-06","2025-08-06","수"]
["2025-08-07","2025-08-07","목"]
["2025-08-08","2025-08-08","금"]
["2025-08-09","2025-08-09","토"]
["2025-08-10","2025-08-10","일"]
["2025-08-11","2025-08-11","월"]
["2025-08-12","2025-08-12","화"]
["2025-08-13","2025-08-13","수"]
["2025-08-14","2025-08-14","목"]
["2025-08-15","2025-08-15","금"]
["2025-08-16","2025-08-16","토"]
["2025-08-17","2025-08-17","일"]
["2025-08-18","2025-08-18","월"]
["2025-08-19","2025-08-19","화"]
["2025-08-20","2025-08-20","수"]
["2025-08-21","2025-08-21","목"]
["2025-08-22","2025-08-22","금"]
["2025-08-23","2025-08-23","토"]
["2025-08-24","2025-08-24","일"]
["2025-08-25","2025-08-25","월"]
["2025-08-26","2025-08-26","화"]
["2025-08-27","2025-08-27","수"]
["2025-08-28","2025-08-28","목"]
["2025-08-29","2025-08-29","금"]
["2025-08-30","2025-08-30","토"]
["2025-08-31","2025-08-31","일"]
["2025-09-01","2025-09-01","월"]
["2025-09-02","2025-09-02","화"]
["2025-09-03","2025-09-03","수"]
["2025-09-04","2025-09-04","목"]
["2025-09-05","2025-09-05","금"]
["2025-09-06","2025-09-06","토"]
["2025-09-07","2025-09-07","일"]
["2025-09-08","2025-09-08","월"]
["2025-09-09","2025-09-09","화"]
["2025-09-10","2025-09-10","수"]
["2025-09-11","2025-09-11","목"]
["2025-09-12","2025-09-12","금"]
["2025-09-13","2025-09-13",{"$f":"CHOOSE(WEEKDAY(B626,1),\"일\",\"월\",\"화\",\"수\",\"목\",\"금\",\"토\")","v":"토"}]
["2025-09-14","2025-09-14","일"]
["2025-09-15","2025-09-15","월"]
["2025-09-16","2025-09-16","화"]
["2025-09-17","2025-09-17","수"]
["2025-09-18","2025-09-18","목"]
["2025-09-19","2025-09-19","금"]
["2025-09-20","2025-09-20","토"]
["2025-09-21","2025-09-21","일"]
["2025-09-22","2025-09-22","월"]
["2025-09-23","2025-09-23","화"]
["2025-09-24","2025-09-24","수"]
["2025-09-25","2025-09-25","목"]
["2025-09-26","2025-09-26","금"]
["2025-09-27","2025-09-27","토"]
["2025-09-28","2025-09-28","일"]
["2025-09-29","2025-09-29","월"]
["2025-09-30","2025-09-30","화"]
["2025-10-01","2025-10-01","수"]
["2025-10-02","2025-10-02","목"]
["2025-10-03","2025-10-03","금"]
[{"$f":"A646+1","v":"2025-10-04"},{"$f":"B646+1","v":"2025-10-04"},"토"]
["2025-10-05","2025-10-05","일"]
["2025-10-06","2025-10-06","월"]
["2025-10-07","2025-10-07","화"]
["2025-10-08","2025-10-08","수"]
["2025-10-09","2025-10-09","목"]
["2025-10-10","2025-10-10","금"]
["2025-10-11","2025-10-11","토"]
["2025-10-12","2025-10-12","일"]
["2025-10-13","2025-10-13","월"]
["2025-10-14","2025-10-14","화"]
["2025-10-15","2025-10-15","수"]
["2025-10-16","2025-10-16","목"]
["2025-10-17","2025-10-17","금"]
["2025-10-18","2025-10-18","토"]
["2025-10-19","2025-10-19","일"]
["2025-10-20","2025-10-20","월"]
["2025-10-21","2025-10-21","화"]
["2025-10-22","2025-10-22","수"]
["2025-10-23","2025-10-23","목"]
["2025-10-24","2025-10-24","금"]
["2025-10-25","2025-10-25","토"]
["2025-10-26","2025-10-26","일"]
["2025-10-27","2025-10-27","월"]
["2025-10-28","2025-10-28","화"]
["2025-10-29","2025-10-29","수"]
["2025-10-30","2025-10-30","목"]
["2025-10-31","2025-10-31","금"]
["2025-11-01","2025-11-01","토"]
["2025-11-02","2025-11-02","일"]
["2025-11-03","2025-11-03","월"]
["2025-11-04","2025-11-04","화"]
["2025-11-05","2025-11-05","수"]
["2025-11-06","2025-11-06","목"]
["2025-11-07","2025-11-07","금"]
["2025-11-08","2025-11-08","토"]
["2025-11-09","2025-11-09","일"]
["2025-11-10","2025-11-10","월"]
["2025-11-11","2025-11-11","화"]
["2025-11-12","2025-11-12","수"]
["2025-11-13","2025-11-13","목"]
["2025-11-14","2025-11-14","금"]
["2025-11-15","2025-11-15","토"]
["2025-11-16","2025-11-16",{"$f":"CHOOSE(WEEKDAY(B690,1),\"일\",\"월\",\"화\",\"수\",\"목\",\"금\",\"토\")","v":"일"}]
["2025-11-17","2025-11-17","월"]
["2025-11-18","2025-11-18","화"]
["2025-11-19","2025-11-19","수"]
["2025-11-20","2025-11-20","목"]
["2025-11-21","2025-11-21","금"]
["2025-11-22","2025-11-22","토"]
["2025-11-23","2025-11-23","일"]
["2025-11-24","2025-11-24","월"]
["2025-11-25","2025-11-25","화"]
["2025-11-26","2025-11-26","수"]
["2025-11-27","2025-11-27","목"]
["2025-11-28","2025-11-28","금"]
["2025-11-29","2025-11-29","토"]
["2025-11-30","2025-11-30","일"]
["2025-12-01","2025-12-01","월"]
["2025-12-02","2025-12-02","화"]
["2025-12-03","2025-12-03","수"]
["2025-12-04","2025-12-04","목"]
["2025-12-05","2025-12-05","금"]
["2025-12-06","2025-12-06","토"]
[{"$f":"A710+1","v":"2025-12-07"},{"$f":"B710+1","v":"2025-12-07"},"일"]
["2025-12-08","2025-12-08","월"]
["2025-12-09","2025-12-09","화"]
["2025-12-10","2025-12-10","수"]
["2025-12-11","2025-12-11","목"]
["2025-12-12","2025-12-12","금"]
["2025-12-13","2025-12-13","토"]
["2025-12-14","2025-12-14","일"]
["2025-12-15","2025-12-15","월"]
["2025-12-16","2025-12-16","화"]
["2025-12-17","2025-12-17","수"]
["2025-12-18","2025-12-18","목"]
["2025-12-19","2025-12-19","금"]
["2025-12-20","2025-12-20","토"]
["2025-12-21","2025-12-21","일"]
["2025-12-22","2025-12-22","월"]
["2025-12-23","2025-12-23","화"]
["2025-12-24","2025-12-24","수"]
["2025-12-25","2025-12-25","목"]
["2025-12-26","2025-12-26","금"]
["2025-12-27","2025-12-27","토"]
["2025-12-28","2025-12-28","일"]
["2025-12-29","2025-12-29","월"]
["2025-12-30","2025-12-30","화"]
["2025-12-31","2025-12-31","수"]
["2026-01-01",{"$f":"IF(YEAR(A735)=YEAR(A736),A735+1,\"\")","v":""},{"$f":"IF(B736=\"\",\"\",CHOOSE(WEEKDAY(B736,1),\"일\",\"월\",\"화\",\"수\",\"목\",\"금\",\"토\"))","v":""}]
[{"$f":"DATE($C$2+2,1,1)","v":"2026-01-01"},{"$f":"DATE($C$2+2,1,1)","v":"2026-01-01"},"목"]
[{"$f":"A737+1","v":"2026-01-02"},"2026-01-02","금"]
[{"$f":"A738+1","v":"2026-01-03"},"2026-01-03","토"]
["2026-01-04","2026-01-04","일"]
["2026-01-05","2026-01-05","월"]
["2026-01-06","2026-01-06","화"]
["2026-01-07","2026-01-07","수"]
["2026-01-08","2026-01-08","목"]
["2026-01-09","2026-01-09","금"]
["2026-01-10","2026-01-10","토"]
["2026-01-11","2026-01-11","일"]
["2026-01-12","2026-01-12","월"]
["2026-01-13","2026-01-13","화"]
["2026-01-14","2026-01-14","수"]
["2026-01-15","2026-01-15","목"]
["2026-01-16","2026-01-16","금"]
["2026-01-17","2026-01-17","토"]
["2026-01-18","2026-01-18","일"]
["2026-01-19","2026-01-19",{"$f":"CHOOSE(WEEKDAY(B755,1),\"일\",\"월\",\"화\",\"수\",\"목\",\"금\",\"토\")","v":"월"}]
["2026-01-20","2026-01-20","화"]
["2026-01-21","2026-01-21","수"]
["2026-01-22","2026-01-22","목"]
["2026-01-23","2026-01-23","금"]
["2026-01-24","2026-01-24","토"]
["2026-01-25","2026-01-25","일"]
["2026-01-26","2026-01-26","월"]
["2026-01-27","2026-01-27","화"]
["2026-01-28","2026-01-28","수"]
["2026-01-29","2026-01-29","목"]
["2026-01-30","2026-01-30","금"]
["2026-01-31","2026-01-31","토"]
["2026-02-01","2026-02-01","일"]
["2026-02-02","2026-02-02","월"]
["2026-02-03","2026-02-03","화"]
["2026-02-04","2026-02-04","수"]
["2026-02-05","2026-02-05","목"]
["2026-02-06","2026-02-06","금"]
["2026-02-07","2026-02-07","토"]
["2026-02-08","2026-02-08","일"]
["2026-02-09",{"$f":"B775+1","v":"2026-02-09"},"월"]
["2026-02-10","2026-02-10","화"]
["2026-02-11","2026-02-11","수"]
["2026-02-12","2026-02-12","목"]
["2026-02-13","2026-02-13","금"]
["2026-02-14","2026-02-14","토"]
["2026-02-15","2026-02-15","일"]
["2026-02-16","2026-02-16","월"]
["2026-02-17","2026-02-17","화"]
["2026-02-18","2026-02-18","수"]
["2026-02-19","2026-02-19","목"]
["2026-02-20","2026-02-20","금"]
["2026-02-21","2026-02-21","토"]
["2026-02-22","2026-02-22","일"]
["2026-02-23","2026-02-23","월"]
["2026-02-24","2026-02-24","화"]
["2026-02-25","2026-02-25","수"]
["2026-02-26","2026-02-26","목"]
["2026-02-27","2026-02-27","금"]
["2026-02-28","2026-02-28","토"]
["2026-03-01","2026-03-01","일"]
["2026-03-02","2026-03-02","월"]
["2026-03-03","2026-03-03","화"]
["2026-03-04","2026-03-04","수"]
["2026-03-05","2026-03-05","목"]
["2026-03-06","2026-03-06","금"]
["2026-03-07","2026-03-07","토"]
[{"$f":"A802+1","v":"2026-03-08"},"2026-03-08","일"]
["2026-03-09","2026-03-09","월"]
["2026-03-10","2026-03-10","화"]
["2026-03-11","2026-03-11","수"]
["2026-03-12","2026-03-12","목"]
["2026-03-13","2026-03-13","금"]
["2026-03-14","2026-03-14","토"]
["2026-03-15","2026-03-15","일"]
["2026-03-16","2026-03-16","월"]
["2026-03-17","2026-03-17","화"]
["2026-03-18","2026-03-18","수"]
["2026-03-19","2026-03-19","목"]
["2026-03-20","2026-03-20","금"]
["2026-03-21","2026-03-21","토"]
["2026-03-22","2026-03-22","일"]
["2026-03-23","2026-03-23","월"]
["2026-03-24","2026-03-24",{"$f":"CHOOSE(WEEKDAY(B819,1),\"일\",\"월\",\"화\",\"수\",\"목\",\"금\",\"토\")","v":"화"}]
["2026-03-25","2026-03-25","수"]
["2026-03-26","2026-03-26","목"]
["2026-03-27","2026-03-27","금"]
["2026-03-28","2026-03-28","토"]
["2026-03-29","2026-03-29","일"]
["2026-03-30","2026-03-30","월"]
["2026-03-31","2026-03-31","화"]
["2026-04-01","2026-04-01","수"]
["2026-04-02","2026-04-02","목"]
["2026-04-03","2026-04-03","금"]
["2026-04-04","2026-04-04","토"]
["2026-04-05","2026-04-05","일"]
["2026-04-06","2026-04-06","월"]
["2026-04-07","2026-04-07","화"]
["2026-04-08","2026-04-08","수"]
["2026-04-09","2026-04-09","목"]
["2026-04-10","2026-04-10","금"]
["2026-04-11","2026-04-11","토"]
["2026-04-12","2026-04-12","일"]
["2026-04-13","2026-04-13","월"]
["2026-04-14",{"$f":"B839+1","v":"2026-04-14"},"화"]
["2026-04-15","2026-04-15","수"]
["2026-04-16","2026-04-16","목"]
["2026-04-17","2026-04-17","금"]
["2026-04-18","2026-04-18","토"]
["2026-04-19","2026-04-19","일"]
["2026-04-20","2026-04-20","월"]
["2026-04-21","2026-04-21","화"]
["2026-04-22","2026-04-22","수"]
["2026-04-23","2026-04-23","목"]
["2026-04-24","2026-04-24","금"]
["2026-04-25","2026-04-25","토"]
["2026-04-26","2026-04-26","일"]
["2026-04-27","2026-04-27","월"]
["2026-04-28","2026-04-28","화"]
["2026-04-29","2026-04-29","수"]
["2026-04-30","2026-04-30","목"]
["2026-05-01","2026-05-01","금"]
["2026-05-02","2026-05-02","토"]
["2026-05-03","2026-05-03","일"]
["2026-05-04","2026-05-04","월"]
["2026-05-05","2026-05-05","화"]
["2026-05-06","2026-05-06","수"]
["2026-05-07","2026-05-07","목"]
["2026-05-08","2026-05-08","금"]
["2026-05-09","2026-05-09","토"]
["2026-05-10","2026-05-10","일"]
[{"$f":"A866+1","v":"2026-05-11"},"2026-05-11","월"]
["2026-05-12","2026-05-12","화"]
["2026-05-13","2026-05-13","수"]
["2026-05-14","2026-05-14","목"]
["2026-05-15","2026-05-15","금"]
["2026-05-16","2026-05-16","토"]
["2026-05-17","2026-05-17","일"]
["2026-05-18","2026-05-18","월"]
["2026-05-19","2026-05-19","화"]
["2026-05-20","2026-05-20","수"]
["2026-05-21","2026-05-21","목"]
["2026-05-22","2026-05-22","금"]
["2026-05-23","2026-05-23","토"]
["2026-05-24","2026-05-24","일"]
["2026-05-25","2026-05-25","월"]
["2026-05-26","2026-05-26","화"]
["2026-05-27","2026-05-27",{"$f":"CHOOSE(WEEKDAY(B883,1),\"일\",\"월\",\"화\",\"수\",\"목\",\"금\",\"토\")","v":"수"}]
["2026-05-28","2026-05-28","목"]
["2026-05-29","2026-05-29","금"]
["2026-05-30","2026-05-30","토"]
["2026-05-31","2026-05-31","일"]
["2026-06-01","2026-06-01","월"]
["2026-06-02","2026-06-02","화"]
["2026-06-03","2026-06-03","수"]
["2026-06-04","2026-06-04","목"]
["2026-06-05","2026-06-05","금"]
["2026-06-06","2026-06-06","토"]
["2026-06-07","2026-06-07","일"]
["2026-06-08","2026-06-08","월"]
["2026-06-09","2026-06-09","화"]
["2026-06-10","2026-06-10","수"]
["2026-06-11","2026-06-11","목"]
["2026-06-12","2026-06-12","금"]
["2026-06-13","2026-06-13","토"]
["2026-06-14","2026-06-14","일"]
["2026-06-15","2026-06-15","월"]
["2026-06-16","2026-06-16","화"]
["2026-06-17",{"$f":"B903+1","v":"2026-06-17"},"수"]
["2026-06-18","2026-06-18","목"]
["2026-06-19","2026-06-19","금"]
["2026-06-20","2026-06-20","토"]
["2026-06-21","2026-06-21","일"]
["2026-06-22","2026-06-22","월"]
["2026-06-23","2026-06-23","화"]
["2026-06-24","2026-06-24","수"]
["2026-06-25","2026-06-25","목"]
["2026-06-26","2026-06-26","금"]
["2026-06-27","2026-06-27","토"]
["2026-06-28","2026-06-28","일"]
["2026-06-29","2026-06-29","월"]
["2026-06-30","2026-06-30","화"]
["2026-07-01","2026-07-01","수"]
["2026-07-02","2026-07-02","목"]
["2026-07-03","2026-07-03","금"]
["2026-07-04","2026-07-04","토"]
["2026-07-05","2026-07-05","일"]
["2026-07-06","2026-07-06","월"]
["2026-07-07","2026-07-07","화"]
["2026-07-08","2026-07-08","수"]
["2026-07-09","2026-07-09","목"]
["2026-07-10","2026-07-10","금"]
["2026-07-11","2026-07-11","토"]
["2026-07-12","2026-07-12","일"]
["2026-07-13","2026-07-13","월"]
[{"$f":"A930+1","v":"2026-07-14"},"2026-07-14","화"]
["2026-07-15","2026-07-15","수"]
["2026-07-16","2026-07-16","목"]
["2026-07-17","2026-07-17","금"]
["2026-07-18","2026-07-18","토"]
["2026-07-19","2026-07-19","일"]
["2026-07-20","2026-07-20","월"]
["2026-07-21","2026-07-21","화"]
["2026-07-22","2026-07-22","수"]
["2026-07-23","2026-07-23","목"]
["2026-07-24","2026-07-24","금"]
["2026-07-25","2026-07-25","토"]
["2026-07-26","2026-07-26","일"]
["2026-07-27","2026-07-27","월"]
["2026-07-28","2026-07-28","화"]
["2026-07-29","2026-07-29","수"]
["2026-07-30","2026-07-30",{"$f":"CHOOSE(WEEKDAY(B947,1),\"일\",\"월\",\"화\",\"수\",\"목\",\"금\",\"토\")","v":"목"}]
["2026-07-31","2026-07-31","금"]
["2026-08-01","2026-08-01","토"]
["2026-08-02","2026-08-02","일"]
["2026-08-03","2026-08-03","월"]
["2026-08-04","2026-08-04","화"]
["2026-08-05","2026-08-05","수"]
["2026-08-06","2026-08-06","목"]
["2026-08-07","2026-08-07","금"]
["2026-08-08","2026-08-08","토"]
["2026-08-09","2026-08-09","일"]
["2026-08-10","2026-08-10","월"]
["2026-08-11","2026-08-11","화"]
["2026-08-12","2026-08-12","수"]
["2026-08-13","2026-08-13","목"]
["2026-08-14","2026-08-14","금"]
["2026-08-15","2026-08-15","토"]
["2026-08-16","2026-08-16","일"]
["2026-08-17","2026-08-17","월"]
["2026-08-18","2026-08-18","화"]
["2026-08-19","2026-08-19","수"]
["2026-08-20",{"$f":"B967+1","v":"2026-08-20"},"목"]
["2026-08-21","2026-08-21","금"]
["2026-08-22","2026-08-22","토"]
["2026-08-23","2026-08-23","일"]
["2026-08-24","2026-08-24","월"]
["2026-08-25","2026-08-25","화"]
["2026-08-26","2026-08-26","수"]
["2026-08-27","2026-08-27","목"]
["2026-08-28","2026-08-28","금"]
["2026-08-29","2026-08-29","토"]
["2026-08-30","2026-08-30","일"]
["2026-08-31","2026-08-31","월"]
["2026-09-01","2026-09-01","화"]
["2026-09-02","2026-09-02","수"]
["2026-09-03","2026-09-03","목"]
["2026-09-04","2026-09-04","금"]
["2026-09-05","2026-09-05","토"]
["2026-09-06","2026-09-06","일"]
["2026-09-07","2026-09-07","월"]
["2026-09-08","2026-09-08","화"]
["2026-09-09","2026-09-09","수"]
["2026-09-10","2026-09-10","목"]
["2026-09-11","2026-09-11","금"]
["2026-09-12","2026-09-12","토"]
["2026-09-13","2026-09-13","일"]
["2026-09-14","2026-09-14","월"]
["2026-09-15","2026-09-15","화"]
[{"$f":"A994+1","v":"2026-09-16"},"2026-09-16","수"]
["2026-09-17","2026-09-17","목"]
["2026-09-18","2026-09-18","금"]
["2026-09-19","2026-09-19","토"]
["2026-09-20","2026-09-20","일"]
["2026-09-21","2026-09-21","월"]
["2026-09-22","2026-09-22","화"]
["2026-09-23","2026-09-23","수"]
["2026-09-24","2026-09-24","목"]
["2026-09-25","2026-09-25","금"]
["2026-09-26","2026-09-26","토"]
["2026-09-27","2026-09-27","일"]
["2026-09-28","2026-09-28","월"]
["2026-09-29","2026-09-29","화"]
["2026-09-30","2026-09-30","수"]
["2026-10-01","2026-10-01","목"]
["2026-10-02","2026-10-02",{"$f":"CHOOSE(WEEKDAY(B1011,1),\"일\",\"월\",\"화\",\"수\",\"목\",\"금\",\"토\")","v":"금"}]
["2026-10-03","2026-10-03","토"]
["2026-10-04","2026-10-04","일"]
["2026-10-05","2026-10-05","월"]
["2026-10-06","2026-10-06","화"]
["2026-10-07","2026-10-07","수"]
["2026-10-08","2026-10-08","목"]
["2026-10-09","2026-10-09","금"]
["2026-10-10","2026-10-10","토"]
["2026-10-11","2026-10-11","일"]
["2026-10-12","2026-10-12","월"]
["2026-10-13","2026-10-13","화"]
["2026-10-14","2026-10-14","수"]
["2026-10-15","2026-10-15","목"]
["2026-10-16","2026-10-16","금"]
["2026-10-17","2026-10-17","토"]
["2026-10-18","2026-10-18","일"]
["2026-10-19","2026-10-19","월"]
["2026-10-20","2026-10-20","화"]
["2026-10-21","2026-10-21","수"]
["2026-10-22","2026-10-22","목"]
["2026-10-23",{"$f":"B1031+1","v":"2026-10-23"},"금"]
["2026-10-24","2026-10-24","토"]
["2026-10-25","2026-10-25","일"]
["2026-10-26","2026-10-26","월"]
["2026-10-27","2026-10-27","화"]
["2026-10-28","2026-10-28","수"]
["2026-10-29","2026-10-29","목"]
["2026-10-30","2026-10-30","금"]
["2026-10-31","2026-10-31","토"]
["2026-11-01","2026-11-01","일"]
["2026-11-02","2026-11-02","월"]
["2026-11-03","2026-11-03","화"]
["2026-11-04","2026-11-04","수"]
["2026-11-05","2026-11-05","목"]
["2026-11-06","2026-11-06","금"]
["2026-11-07","2026-11-07","토"]
["2026-11-08","2026-11-08","일"]
["2026-11-09","2026-11-09","월"]
["2026-11-10","2026-11-10","화"]
["2026-11-11","2026-11-11","수"]
["2026-11-12","2026-11-12","목"]
["2026-11-13","2026-11-13","금"]
["2026-11-14","2026-11-14","토"]
["2026-11-15","2026-11-15","일"]
["2026-11-16","2026-11-16","월"]
["2026-11-17","2026-11-17","화"]
["2026-11-18","2026-11-18","수"]
[{"$f":"A1058+1","v":"2026-11-19"},"2026-11-19","목"]
["2026-11-20","2026-11-20","금"]
["2026-11-21","2026-11-21","토"]
["2026-11-22","2026-11-22","일"]
["2026-11-23","2026-11-23","월"]
["2026-11-24","2026-11-24","화"]
["2026-11-25","2026-11-25","수"]
["2026-11-26","2026-11-26","목"]
["2026-11-27","2026-11-27","금"]
["2026-11-28","2026-11-28","토"]
["2026-11-29","2026-11-29","일"]
["2026-11-30","2026-11-30","월"]
["2026-12-01","2026-12-01","화"]
["2026-12-02","2026-12-02","수"]
["2026-12-03","2026-12-03","목"]
["2026-12-04","2026-12-04","금"]
["2026-12-05","2026-12-05",{"$f":"CHOOSE(WEEKDAY(B1075,1),\"일\",\"월\",\"화\",\"수\",\"목\",\"금\",\"토\")","v":"토"}]
["2026-12-06","2026-12-06","일"]
["2026-12-07","2026-12-07","월"]
["2026-12-08","2026-12-08","화"]
["2026-12-09","2026-12-09","수"]
["2026-12-10","2026-12-10","목"]
["2026-12-11","2026-12-11","금"]
["2026-12-12","2026-12-12","토"]
["2026-12-13","2026-12-13","일"]
["2026-12-14","2026-12-14","월"]
["2026-12-15","2026-12-15","화"]
["2026-12-16","2026-12-16","수"]
["2026-12-17","2026-12-17","목"]
["2026-12-18","2026-12-18","금"]
["2026-12-19","2026-12-19","토"]
["2026-12-20","2026-12-20","일"]
["2026-12-21","2026-12-21","월"]
["2026-12-22","2026-12-22","화"]
["2026-12-23","2026-12-23","수"]
["2026-12-24","2026-12-24","목"]
["2026-12-25","2026-12-25","금"]
["2026-12-26",{"$f":"B1095+1","v":"2026-12-26"},"토"]
["2026-12-27","2026-12-27","일"]
["2026-12-28","2026-12-28","월"]
["2026-12-29","2026-12-29","화"]
["2026-12-30","2026-12-30","수"]
["2026-12-31","2026-12-31","목"]
["2027-01-01",{"$f":"IF(YEAR(A1101)=YEAR(A1102),A1101+1,\"\")","v":""},{"$f":"IF(B1102=\"\",\"\",CHOOSE(WEEKDAY(B1102,1),\"일\",\"월\",\"화\",\"수\",\"목\",\"금\",\"토\"))","v":""}]
[{"$f":"DATE($C$2+3,1,1)","v":"2027-01-01"},{"$f":"DATE($C$2+3,1,1)","v":"2027-01-01"},"금"]
[{"$f":"A1103+1","v":"2027-01-02"},"2027-01-02","토"]
[{"$f":"A1104+1","v":"2027-01-03"},"2027-01-03","일"]
["2027-01-04","2027-01-04","월"]
["2027-01-05","2027-01-05","화"]
["2027-01-06","2027-01-06","수"]
["2027-01-07","2027-01-07","목"]
["2027-01-08","2027-01-08","금"]
["2027-01-09","2027-01-09","토"]
["2027-01-10","2027-01-10","일"]
["2027-01-11","2027-01-11","월"]
["2027-01-12","2027-01-12","화"]
["2027-01-13","2027-01-13","수"]
["2027-01-14","2027-01-14","목"]
["2027-01-15","2027-01-15","금"]
["2027-01-16","2027-01-16","토"]
["2027-01-17","2027-01-17","일"]
["2027-01-18","2027-01-18","월"]
["2027-01-19","2027-01-19","화"]
["2027-01-20","2027-01-20","수"]
["2027-01-21","2027-01-21","목"]
["2027-01-22","2027-01-22","금"]
["2027-01-23","2027-01-23","토"]
["2027-01-24","2027-01-24","일"]
["2027-01-25","2027-01-25","월"]
["2027-01-26","2027-01-26","화"]
["2027-01-27","2027-01-27","수"]
["2027-01-28","2027-01-28","목"]
["2027-01-29","2027-01-29","금"]
["2027-01-30","2027-01-30","토"]
["2027-01-31","2027-01-31","일"]
["2027-02-01","2027-02-01","월"]
["2027-02-02","2027-02-02","화"]
["2027-02-03","2027-02-03","수"]
["2027-02-04","2027-02-04","목"]
["2027-02-05","2027-02-05","금"]
["2027-02-06","2027-02-06","토"]
["2027-02-07","2027-02-07",{"$f":"CHOOSE(WEEKDAY(B1140,1),\"일\",\"월\",\"화\",\"수\",\"목\",\"금\",\"토\")","v":"일"}]
["2027-02-08","2027-02-08","월"]
["2027-02-09","2027-02-09","화"]
["2027-02-10","2027-02-10","수"]
["2027-02-11","2027-02-11","목"]
["2027-02-12","2027-02-12","금"]
["2027-02-13","2027-02-13","토"]
["2027-02-14","2027-02-14","일"]
["2027-02-15","2027-02-15","월"]
["2027-02-16","2027-02-16","화"]
["2027-02-17","2027-02-17","수"]
["2027-02-18","2027-02-18","목"]
["2027-02-19","2027-02-19","금"]
["2027-02-20","2027-02-20","토"]
["2027-02-21","2027-02-21","일"]
["2027-02-22","2027-02-22","월"]
["2027-02-23","2027-02-23","화"]
["2027-02-24","2027-02-24","수"]
["2027-02-25","2027-02-25","목"]
["2027-02-26","2027-02-26","금"]
["2027-02-27","2027-02-27","토"]
["2027-02-28",{"$f":"B1160+1","v":"2027-02-28"},"일"]
["2027-03-01","2027-03-01","월"]
["2027-03-02","2027-03-02","화"]
["2027-03-03","2027-03-03","수"]
["2027-03-04","2027-03-04","목"]
["2027-03-05","2027-03-05","금"]
["2027-03-06","2027-03-06","토"]
["2027-03-07","2027-03-07","일"]
[{"$f":"A1168+1","v":"2027-03-08"},"2027-03-08","월"]
["2027-03-09","2027-03-09","화"]
["2027-03-10","2027-03-10","수"]
["2027-03-11","2027-03-11","목"]
["2027-03-12","2027-03-12","금"]
["2027-03-13","2027-03-13","토"]
["2027-03-14","2027-03-14","일"]
["2027-03-15","2027-03-15","월"]
["2027-03-16","2027-03-16","화"]
["2027-03-17","2027-03-17","수"]
["2027-03-18","2027-03-18","목"]
["2027-03-19","2027-03-19","금"]
["2027-03-20","2027-03-20","토"]
["2027-03-21","2027-03-21","일"]
["2027-03-22","2027-03-22","월"]
["2027-03-23","2027-03-23","화"]
["2027-03-24","2027-03-24","수"]
["2027-03-25","2027-03-25","목"]
["2027-03-26","2027-03-26","금"]
["2027-03-27","2027-03-27","토"]
["2027-03-28","2027-03-28","일"]
["2027-03-29","2027-03-29","월"]
["2027-03-30","2027-03-30","화"]
["2027-03-31","2027-03-31","수"]
["2027-04-01","2027-04-01","목"]
["2027-04-02","2027-04-02","금"]
["2027-04-03","2027-04-03","토"]
["2027-04-04","2027-04-04","일"]
["2027-04-05","2027-04-05","월"]
["2027-04-06","2027-04-06","화"]
["2027-04-07","2027-04-07","수"]
["2027-04-08","2027-04-08","목"]
["2027-04-09","2027-04-09","금"]
["2027-04-10","2027-04-10","토"]
["2027-04-11","2027-04-11","일"]
["2027-04-12","2027-04-12",{"$f":"CHOOSE(WEEKDAY(B1204,1),\"일\",\"월\",\"화\",\"수\",\"목\",\"금\",\"토\")","v":"월"}]
["2027-04-13","2027-04-13","화"]
["2027-04-14","2027-04-14","수"]
["2027-04-15","2027-04-15","목"]
["2027-04-16","2027-04-16","금"]
["2027-04-17","2027-04-17","토"]
["2027-04-18","2027-04-18","일"]
["2027-04-19","2027-04-19","월"]
["2027-04-20","2027-04-20","화"]
["2027-04-21","2027-04-21","수"]
["2027-04-22","2027-04-22","목"]
["2027-04-23","2027-04-23","금"]
["2027-04-24","2027-04-24","토"]
["2027-04-25","2027-04-25","일"]
["2027-04-26","2027-04-26","월"]
["2027-04-27","2027-04-27","화"]
["2027-04-28","2027-04-28","수"]
["2027-04-29","2027-04-29","목"]
["2027-04-30","2027-04-30","금"]
["2027-05-01","2027-05-01","토"]
["2027-05-02","2027-05-02","일"]
["2027-05-03",{"$f":"B1224+1","v":"2027-05-03"},"월"]
["2027-05-04","2027-05-04","화"]
["2027-05-05","2027-05-05","수"]
["2027-05-06","2027-05-06","목"]
["2027-05-07","2027-05-07","금"]
["2027-05-08","2027-05-08","토"]
["2027-05-09","2027-05-09","일"]
["2027-05-10","2027-05-10","월"]
[{"$f":"A1232+1","v":"2027-05-11"},"2027-05-11","화"]
["2027-05-12","2027-05-12","수"]
["2027-05-13","2027-05-13","목"]
["2027-05-14","2027-05-14","금"]
["2027-05-15","2027-05-15","토"]
["2027-05-16","2027-05-16","일"]
["2027-05-17","2027-05-17","월"]
["2027-05-18","2027-05-18","화"]
["2027-05-19","2027-05-19","수"]
["2027-05-20","2027-05-20","목"]
["2027-05-21","2027-05-21","금"]
["2027-05-22","2027-05-22","토"]
["2027-05-23","2027-05-23","일"]
["2027-05-24","2027-05-24","월"]
["2027-05-25","2027-05-25","화"]
["2027-05-26","2027-05-26","수"]
["2027-05-27","2027-05-27","목"]
["2027-05-28","2027-05-28","금"]
["2027-05-29","2027-05-29","토"]
["2027-05-30","2027-05-30","일"]
["2027-05-31","2027-05-31","월"]
["2027-06-01","2027-06-01","화"]
["2027-06-02","2027-06-02","수"]
["2027-06-03","2027-06-03","목"]
["2027-06-04","2027-06-04","금"]
["2027-06-05","2027-06-05","토"]
["2027-06-06","2027-06-06","일"]
["2027-06-07","2027-06-07","월"]
["2027-06-08","2027-06-08","화"]
["2027-06-09","2027-06-09","수"]
["2027-06-10","2027-06-10","목"]
["2027-06-11","2027-06-11","금"]
["2027-06-12","2027-06-12","토"]
["2027-06-13","2027-06-13","일"]
["2027-06-14","2027-06-14","월"]
["2027-06-15","2027-06-15",{"$f":"CHOOSE(WEEKDAY(B1268,1),\"일\",\"월\",\"화\",\"수\",\"목\",\"금\",\"토\")","v":"화"}]
["2027-06-16","2027-06-16","수"]
["2027-06-17","2027-06-17","목"]
["2027-06-18","2027-06-18","금"]
["2027-06-19","2027-06-19","토"]
["2027-06-20","2027-06-20","일"]
["2027-06-21","2027-06-21","월"]
["2027-06-22","2027-06-22","화"]
["2027-06-23","2027-06-23","수"]
["2027-06-24","2027-06-24","목"]
["2027-06-25","2027-06-25","금"]
["2027-06-26","2027-06-26","토"]
["2027-06-27","2027-06-27","일"]
["2027-06-28","2027-06-28","월"]
["2027-06-29","2027-06-29","화"]
["2027-06-30","2027-06-30","수"]
["2027-07-01","2027-07-01","목"]
["2027-07-02","2027-07-02","금"]
["2027-07-03","2027-07-03","토"]
["2027-07-04","2027-07-04","일"]
["2027-07-05","2027-07-05","월"]
["2027-07-06",{"$f":"B1288+1","v":"2027-07-06"},"화"]
["2027-07-07","2027-07-07","수"]
["2027-07-08","2027-07-08","목"]
["2027-07-09","2027-07-09","금"]
["2027-07-10","2027-07-10","토"]
["2027-07-11","2027-07-11","일"]
["2027-07-12","2027-07-12","월"]
["2027-07-13","2027-07-13","화"]
[{"$f":"A1296+1","v":"2027-07-14"},"2027-07-14","수"]
["2027-07-15","2027-07-15","목"]
["2027-07-16","2027-07-16","금"]
["2027-07-17","2027-07-17","토"]
["2027-07-18","2027-07-18","일"]
["2027-07-19","2027-07-19","월"]
["2027-07-20","2027-07-20","화"]
["2027-07-21","2027-07-21","수"]
["2027-07-22","2027-07-22","목"]
["2027-07-23","2027-07-23","금"]
["2027-07-24","2027-07-24","토"]
["2027-07-25","2027-07-25","일"]
["2027-07-26","2027-07-26","월"]
["2027-07-27","2027-07-27","화"]
["2027-07-28","2027-07-28","수"]
["2027-07-29","2027-07-29","목"]
["2027-07-30","2027-07-30","금"]
["2027-07-31","2027-07-31","토"]
["2027-08-01","2027-08-01","일"]
["2027-08-02","2027-08-02","월"]
["2027-08-03","2027-08-03","화"]
["2027-08-04","2027-08-04","수"]
["2027-08-05","2027-08-05","목"]
["2027-08-06","2027-08-06","금"]
["2027-08-07","2027-08-07","토"]
["2027-08-08","2027-08-08","일"]
["2027-08-09","2027-08-09","월"]
["2027-08-10","2027-08-10","화"]
["2027-08-11","2027-08-11","수"]
["2027-08-12","2027-08-12","목"]
["2027-08-13","2027-08-13","금"]
["2027-08-14","2027-08-14","토"]
["2027-08-15","2027-08-15","일"]
["2027-08-16","2027-08-16","월"]
["2027-08-17","2027-08-17","화"]
["2027-08-18","2027-08-18",{"$f":"CHOOSE(WEEKDAY(B1332,1),\"일\",\"월\",\"화\",\"수\",\"목\",\"금\",\"토\")","v":"수"}]
["2027-08-19","2027-08-19","목"]
["2027-08-20","2027-08-20","금"]
["2027-08-21","2027-08-21","토"]
["2027-08-22","2027-08-22","일"]
["2027-08-23","2027-08-23","월"]
["2027-08-24","2027-08-24","화"]
["2027-08-25","2027-08-25","수"]
["2027-08-26","2027-08-26","목"]
["2027-08-27","2027-08-27","금"]
["2027-08-28","2027-08-28","토"]
["2027-08-29","2027-08-29","일"]
["2027-08-30","2027-08-30","월"]
["2027-08-31","2027-08-31","화"]
["2027-09-01","2027-09-01","수"]
["2027-09-02","2027-09-02","목"]
["2027-09-03","2027-09-03","금"]
["2027-09-04","2027-09-04","토"]
["2027-09-05","2027-09-05","일"]
["2027-09-06","2027-09-06","월"]
["2027-09-07","2027-09-07","화"]
["2027-09-08",{"$f":"B1352+1","v":"2027-09-08"},"수"]
["2027-09-09","2027-09-09","목"]
["2027-09-10","2027-09-10","금"]
["2027-09-11","2027-09-11","토"]
["2027-09-12","2027-09-12","일"]
["2027-09-13","2027-09-13","월"]
["2027-09-14","2027-09-14","화"]
["2027-09-15","2027-09-15","수"]
[{"$f":"A1360+1","v":"2027-09-16"},"2027-09-16","목"]
["2027-09-17","2027-09-17","금"]
["2027-09-18","2027-09-18","토"]
["2027-09-19","2027-09-19","일"]
["2027-09-20","2027-09-20","월"]
["2027-09-21","2027-09-21","화"]
["2027-09-22","2027-09-22","수"]
["2027-09-23","2027-09-23","목"]
["2027-09-24","2027-09-24","금"]
["2027-09-25","2027-09-25","토"]
["2027-09-26","2027-09-26","일"]
["2027-09-27","2027-09-27","월"]
["2027-09-28","2027-09-28","화"]
["2027-09-29","2027-09-29","수"]
["2027-09-30","2027-09-30","목"]
["2027-10-01","2027-10-01","금"]
["2027-10-02","2027-10-02","토"]
["2027-10-03","2027-10-03","일"]
["2027-10-04","2027-10-04","월"]
["2027-10-05","2027-10-05","화"]
["2027-10-06","2027-10-06","수"]
["2027-10-07","2027-10-07","목"]
["2027-10-08","2027-10-08","금"]
["2027-10-09","2027-10-09","토"]
["2027-10-10","2027-10-10","일"]
["2027-10-11","2027-10-11","월"]
["2027-10-12","2027-10-12","화"]
["2027-10-13","2027-10-13","수"]
["2027-10-14","2027-10-14","목"]
["2027-10-15","2027-10-15","금"]
["2027-10-16","2027-10-16","토"]
["2027-10-17","2027-10-17","일"]
["2027-10-18","2027-10-18","월"]
["2027-10-19","2027-10-19","화"]
["2027-10-20","2027-10-20","수"]
["2027-10-21","2027-10-21",{"$f":"CHOOSE(WEEKDAY(B1396,1),\"일\",\"월\",\"화\",\"수\",\"목\",\"금\",\"토\")","v":"목"}]
["2027-10-22","2027-10-22","금"]
["2027-10-23","2027-10-23","토"]
["2027-10-24","2027-10-24","일"]
["2027-10-25","2027-10-25","월"]
["2027-10-26","2027-10-26","화"]
["2027-10-27","2027-10-27","수"]
["2027-10-28","2027-10-28","목"]
["2027-10-29","2027-10-29","금"]
["2027-10-30","2027-10-30","토"]
["2027-10-31","2027-10-31","일"]
["2027-11-01","2027-11-01","월"]
["2027-11-02","2027-11-02","화"]
["2027-11-03","2027-11-03","수"]
["2027-11-04","2027-11-04","목"]
["2027-11-05","2027-11-05","금"]
["2027-11-06","2027-11-06","토"]
["2027-11-07","2027-11-07","일"]
["2027-11-08","2027-11-08","월"]
["2027-11-09","2027-11-09","화"]
["2027-11-10","2027-11-10","수"]
["2027-11-11",{"$f":"B1416+1","v":"2027-11-11"},"목"]
["2027-11-12","2027-11-12","금"]
["2027-11-13","2027-11-13","토"]
["2027-11-14","2027-11-14","일"]
["2027-11-15","2027-11-15","월"]
["2027-11-16","2027-11-16","화"]
["2027-11-17","2027-11-17","수"]
["2027-11-18","2027-11-18","목"]
[{"$f":"A1424+1","v":"2027-11-19"},"2027-11-19","금"]
["2027-11-20","2027-11-20","토"]
["2027-11-21","2027-11-21","일"]
["2027-11-22","2027-11-22","월"]
["2027-11-23","2027-11-23","화"]
["2027-11-24","2027-11-24","수"]
["2027-11-25","2027-11-25","목"]
["2027-11-26","2027-11-26","금"]
["2027-11-27","2027-11-27","토"]
["2027-11-28","2027-11-28","일"]
["2027-11-29","2027-11-29","월"]
["2027-11-30","2027-11-30","화"]
["2027-12-01","2027-12-01","수"]
["2027-12-02","2027-12-02","목"]
["2027-12-03","2027-12-03","금"]
["2027-12-04","2027-12-04","토"]
["2027-12-05","2027-12-05","일"]
["2027-12-06","2027-12-06","월"]
["2027-12-07","2027-12-07","화"]
["2027-12-08","2027-12-08","수"]
["2027-12-09","2027-12-09","목"]
["2027-12-10","2027-12-10","금"]
["2027-12-11","2027-12-11","토"]
["2027-12-12","2027-12-12","일"]
["2027-12-13","2027-12-13","월"]
["2027-12-14","2027-12-14","화"]
["2027-12-15","2027-12-15","수"]
["2027-12-16","2027-12-16","목"]
["2027-12-17","2027-12-17","금"]
["2027-12-18","2027-12-18","토"]
["2027-12-19","2027-12-19","일"]
["2027-12-20","2027-12-20","월"]
["2027-12-21","2027-12-21","화"]
["2027-12-22","2027-12-22","수"]
["2027-12-23","2027-12-23","목"]
["2027-12-24","2027-12-24",{"$f":"CHOOSE(WEEKDAY(B1460,1),\"일\",\"월\",\"화\",\"수\",\"목\",\"금\",\"토\")","v":"금"}]
["2027-12-25","2027-12-25","토"]
["2027-12-26","2027-12-26","일"]
["2027-12-27","2027-12-27","월"]
["2027-12-28","2027-12-28","화"]
["2027-12-29","2027-12-29","수"]
["2027-12-30","2027-12-30","목"]
["2027-12-31","2027-12-31","금"]
["2028-01-01",{"$f":"IF(YEAR(A1467)=YEAR(A1468),A1467+1,\"\")","v":""},{"$f":"IF(B1468=\"\",\"\",CHOOSE(WEEKDAY(B1468,1),\"일\",\"월\",\"화\",\"수\",\"목\",\"금\",\"토\"))","v":""}]
[{"$f":"DATE($C$2+4,1,1)","v":"2028-01-01"},{"$f":"DATE($C$2+4,1,1)","v":"2028-01-01"},"토"]
[{"$f":"A1469+1","v":"2028-01-02"},"2028-01-02","일"]
[{"$f":"A1470+1","v":"2028-01-03"},"2028-01-03","월"]
["2028-01-04","2028-01-04","화"]
["2028-01-05","2028-01-05","수"]
["2028-01-06","2028-01-06","목"]
["2028-01-07","2028-01-07","금"]
["2028-01-08","2028-01-08","토"]
["2028-01-09","2028-01-09","일"]
["2028-01-10","2028-01-10","월"]
["2028-01-11","2028-01-11","화"]
["2028-01-12","2028-01-12","수"]
["2028-01-13","2028-01-13","목"]
["2028-01-14",{"$f":"B1481+1","v":"2028-01-14"},"금"]
["2028-01-15","2028-01-15","토"]
["2028-01-16","2028-01-16","일"]
["2028-01-17","2028-01-17","월"]
["2028-01-18","2028-01-18","화"]
["2028-01-19","2028-01-19","수"]
["2028-01-20","2028-01-20","목"]
["2028-01-21","2028-01-21","금"]
["2028-01-22","2028-01-22","토"]
["2028-01-23","2028-01-23","일"]
["2028-01-24","2028-01-24","월"]
["2028-01-25","2028-01-25","화"]
["2028-01-26","2028-01-26","수"]
["2028-01-27","2028-01-27","목"]
["2028-01-28","2028-01-28","금"]
["2028-01-29","2028-01-29","토"]
["2028-01-30","2028-01-30","일"]
["2028-01-31","2028-01-31","월"]
["2028-02-01","2028-02-01","화"]
["2028-02-02","2028-02-02","수"]
["2028-02-03","2028-02-03","목"]
["2028-02-04","2028-02-04","금"]
["2028-02-05","2028-02-05","토"]
["2028-02-06","2028-02-06","일"]
["2028-02-07","2028-02-07","월"]
["2028-02-08","2028-02-08","화"]
["2028-02-09","2028-02-09","수"]
["2028-02-10","2028-02-10","목"]
["2028-02-11","2028-02-11","금"]
["2028-02-12","2028-02-12","토"]
["2028-02-13","2028-02-13","일"]
["2028-02-14","2028-02-14","월"]
["2028-02-15","2028-02-15","화"]
["2028-02-16","2028-02-16","수"]
["2028-02-17","2028-02-17","목"]
["2028-02-18","2028-02-18","금"]
["2028-02-19","2028-02-19","토"]
["2028-02-20","2028-02-20","일"]
["2028-02-21","2028-02-21","월"]
["2028-02-22","2028-02-22","화"]
["2028-02-23","2028-02-23","수"]
["2028-02-24","2028-02-24","목"]
["2028-02-25","2028-02-25","금"]
["2028-02-26","2028-02-26",{"$f":"CHOOSE(WEEKDAY(B1525,1),\"일\",\"월\",\"화\",\"수\",\"목\",\"금\",\"토\")","v":"토"}]
["2028-02-27","2028-02-27","일"]
["2028-02-28","2028-02-28","월"]
["2028-02-29","2028-02-29","화"]
["2028-03-01","2028-03-01","수"]
["2028-03-02","2028-03-02","목"]
["2028-03-03","2028-03-03","금"]
["2028-03-04","2028-03-04","토"]
["2028-03-05","2028-03-05","일"]
["2028-03-06","2028-03-06","월"]
[{"$f":"A1534+1","v":"2028-03-07"},"2028-03-07","화"]
["2028-03-08","2028-03-08","수"]
["2028-03-09","2028-03-09","목"]
["2028-03-10","2028-03-10","금"]
["2028-03-11","2028-03-11","토"]
["2028-03-12","2028-03-12","일"]
["2028-03-13","2028-03-13","월"]
["2028-03-14","2028-03-14","화"]
["2028-03-15","2028-03-15","수"]
["2028-03-16","2028-03-16","목"]
["2028-03-17","2028-03-17","금"]
["2028-03-18",{"$f":"B1545+1","v":"2028-03-18"},"토"]
["2028-03-19","2028-03-19","일"]
["2028-03-20","2028-03-20","월"]
["2028-03-21","2028-03-21","화"]
["2028-03-22","2028-03-22","수"]
["2028-03-23","2028-03-23","목"]
["2028-03-24","2028-03-24","금"]
["2028-03-25","2028-03-25","토"]
["2028-03-26","2028-03-26","일"]
["2028-03-27","2028-03-27","월"]
["2028-03-28","2028-03-28","화"]
["2028-03-29","2028-03-29","수"]
["2028-03-30","2028-03-30","목"]
["2028-03-31","2028-03-31","금"]
["2028-04-01","2028-04-01","토"]
["2028-04-02","2028-04-02","일"]
["2028-04-03","2028-04-03","월"]
["2028-04-04","2028-04-04","화"]
["2028-04-05","2028-04-05","수"]
["2028-04-06","2028-04-06","목"]
["2028-04-07","2028-04-07","금"]
["2028-04-08","2028-04-08","토"]
["2028-04-09","2028-04-09","일"]
["2028-04-10","2028-04-10","월"]
["2028-04-11","2028-04-11","화"]
["2028-04-12","2028-04-12","수"]
["2028-04-13","2028-04-13","목"]
["2028-04-14","2028-04-14","금"]
["2028-04-15","2028-04-15","토"]
["2028-04-16","2028-04-16","일"]
["2028-04-17","2028-04-17","월"]
["2028-04-18","2028-04-18","화"]
["2028-04-19","2028-04-19","수"]
["2028-04-20","2028-04-20","목"]
["2028-04-21","2028-04-21","금"]
["2028-04-22","2028-04-22","토"]
["2028-04-23","2028-04-23","일"]
["2028-04-24","2028-04-24","월"]
["2028-04-25","2028-04-25","화"]
["2028-04-26","2028-04-26","수"]
["2028-04-27","2028-04-27","목"]
["2028-04-28","2028-04-28","금"]
["2028-04-29","2028-04-29","토"]
["2028-04-30","2028-04-30",{"$f":"CHOOSE(WEEKDAY(B1589,1),\"일\",\"월\",\"화\",\"수\",\"목\",\"금\",\"토\")","v":"일"}]
["2028-05-01","2028-05-01","월"]
["2028-05-02","2028-05-02","화"]
["2028-05-03","2028-05-03","수"]
["2028-05-04","2028-05-04","목"]
["2028-05-05","2028-05-05","금"]
["2028-05-06","2028-05-06","토"]
["2028-05-07","2028-05-07","일"]
["2028-05-08","2028-05-08","월"]
["2028-05-09","2028-05-09","화"]
[{"$f":"A1598+1","v":"2028-05-10"},"2028-05-10","수"]
["2028-05-11","2028-05-11","목"]
["2028-05-12","2028-05-12","금"]
["2028-05-13","2028-05-13","토"]
["2028-05-14","2028-05-14","일"]
["2028-05-15","2028-05-15","월"]
["2028-05-16","2028-05-16","화"]
["2028-05-17","2028-05-17","수"]
["2028-05-18","2028-05-18","목"]
["2028-05-19","2028-05-19","금"]
["2028-05-20","2028-05-20","토"]
["2028-05-21",{"$f":"B1609+1","v":"2028-05-21"},"일"]
["2028-05-22","2028-05-22","월"]
["2028-05-23","2028-05-23","화"]
["2028-05-24","2028-05-24","수"]
["2028-05-25","2028-05-25","목"]
["2028-05-26","2028-05-26","금"]
["2028-05-27","2028-05-27","토"]
["2028-05-28","2028-05-28","일"]
["2028-05-29","2028-05-29","월"]
["2028-05-30","2028-05-30","화"]
["2028-05-31","2028-05-31","수"]
["2028-06-01","2028-06-01","목"]
["2028-06-02","2028-06-02","금"]
["2028-06-03","2028-06-03","토"]
["2028-06-04","2028-06-04","일"]
["2028-06-05","2028-06-05","월"]
["2028-06-06","2028-06-06","화"]
["2028-06-07","2028-06-07","수"]
["2028-06-08","2028-06-08","목"]
["2028-06-09","2028-06-09","금"]
["2028-06-10","2028-06-10","토"]
["2028-06-11","2028-06-11","일"]
["2028-06-12","2028-06-12","월"]
["2028-06-13","2028-06-13","화"]
["2028-06-14","2028-06-14","수"]
["2028-06-15","2028-06-15","목"]
["2028-06-16","2028-06-16","금"]
["2028-06-17","2028-06-17","토"]
["2028-06-18","2028-06-18","일"]
["2028-06-19","2028-06-19","월"]
["2028-06-20","2028-06-20","화"]
["2028-06-21","2028-06-21","수"]
["2028-06-22","2028-06-22","목"]
["2028-06-23","2028-06-23","금"]
["2028-06-24","2028-06-24","토"]
["2028-06-25","2028-06-25","일"]
["2028-06-26","2028-06-26","월"]
["2028-06-27","2028-06-27","화"]
["2028-06-28","2028-06-28","수"]
["2028-06-29","2028-06-29","목"]
["2028-06-30","2028-06-30","금"]
["2028-07-01","2028-07-01","토"]
["2028-07-02","2028-07-02","일"]
["2028-07-03","2028-07-03",{"$f":"CHOOSE(WEEKDAY(B1653,1),\"일\",\"월\",\"화\",\"수\",\"목\",\"금\",\"토\")","v":"월"}]
["2028-07-04","2028-07-04","화"]
["2028-07-05","2028-07-05","수"]
["2028-07-06","2028-07-06","목"]
["2028-07-07","2028-07-07","금"]
["2028-07-08","2028-07-08","토"]
["2028-07-09","2028-07-09","일"]
["2028-07-10","2028-07-10","월"]
["2028-07-11","2028-07-11","화"]
["2028-07-12","2028-07-12","수"]
[{"$f":"A1662+1","v":"2028-07-13"},"2028-07-13","목"]
["2028-07-14","2028-07-14","금"]
["2028-07-15","2028-07-15","토"]
["2028-07-16","2028-07-16","일"]
["2028-07-17","2028-07-17","월"]
["2028-07-18","2028-07-18","화"]
["2028-07-19","2028-07-19","수"]
["2028-07-20","2028-07-20","목"]
["2028-07-21","2028-07-21","금"]
["2028-07-22","2028-07-22","토"]
["2028-07-23","2028-07-23","일"]
["2028-07-24",{"$f":"B1673+1","v":"2028-07-24"},"월"]
["2028-07-25","2028-07-25","화"]
["2028-07-26","2028-07-26","수"]
["2028-07-27","2028-07-27","목"]
["2028-07-28","2028-07-28","금"]
["2028-07-29","2028-07-29","토"]
["2028-07-30","2028-07-30","일"]
["2028-07-31","2028-07-31","월"]
["2028-08-01","2028-08-01","화"]
["2028-08-02","2028-08-02","수"]
["2028-08-03","2028-08-03","목"]
["2028-08-04","2028-08-04","금"]
["2028-08-05","2028-08-05","토"]
["2028-08-06","2028-08-06","일"]
["2028-08-07","2028-08-07","월"]
["2028-08-08","2028-08-08","화"]
["2028-08-09","2028-08-09","수"]
["2028-08-10","2028-08-10","목"]
["2028-08-11","2028-08-11","금"]
["2028-08-12","2028-08-12","토"]
["2028-08-13","2028-08-13","일"]
["2028-08-14","2028-08-14","월"]
["2028-08-15","2028-08-15","화"]
["2028-08-16","2028-08-16","수"]
["2028-08-17","2028-08-17","목"]
["2028-08-18","2028-08-18","금"]
["2028-08-19","2028-08-19","토"]
["2028-08-20","2028-08-20","일"]
["2028-08-21","2028-08-21","월"]
["2028-08-22","2028-08-22","화"]
["2028-08-23","2028-08-23","수"]
["2028-08-24","2028-08-24","목"]
["2028-08-25","2028-08-25","금"]
["2028-08-26","2028-08-26","토"]
["2028-08-27","2028-08-27","일"]
["2028-08-28","2028-08-28","월"]
["2028-08-29","2028-08-29","화"]
["2028-08-30","2028-08-30","수"]
["2028-08-31","2028-08-31","목"]
["2028-09-01","2028-09-01","금"]
["2028-09-02","2028-09-02","토"]
["2028-09-03","2028-09-03","일"]
["2028-09-04","2028-09-04","월"]
["2028-09-05","2028-09-05",{"$f":"CHOOSE(WEEKDAY(B1717,1),\"일\",\"월\",\"화\",\"수\",\"목\",\"금\",\"토\")","v":"화"}]
["2028-09-06","2028-09-06","수"]
["2028-09-07","2028-09-07","목"]
["2028-09-08","2028-09-08","금"]
["2028-09-09","2028-09-09","토"]
["2028-09-10","2028-09-10","일"]
["2028-09-11","2028-09-11","월"]
["2028-09-12","2028-09-12","화"]
["2028-09-13","2028-09-13","수"]
["2028-09-14","2028-09-14","목"]
[{"$f":"A1726+1","v":"2028-09-15"},"2028-09-15","금"]
["2028-09-16","2028-09-16","토"]
["2028-09-17","2028-09-17","일"]
["2028-09-18","2028-09-18","월"]
["2028-09-19","2028-09-19","화"]
["2028-09-20","2028-09-20","수"]
["2028-09-21","2028-09-21","목"]
["2028-09-22","2028-09-22","금"]
["2028-09-23","2028-09-23","토"]
["2028-09-24","2028-09-24","일"]
["2028-09-25","2028-09-25","월"]
["2028-09-26",{"$f":"B1737+1","v":"2028-09-26"},"화"]
["2028-09-27","2028-09-27","수"]
["2028-09-28","2028-09-28","목"]
["2028-09-29","2028-09-29","금"]
["2028-09-30","2028-09-30","토"]
["2028-10-01","2028-10-01","일"]
["2028-10-02","2028-10-02","월"]
["2028-10-03","2028-10-03","화"]
["2028-10-04","2028-10-04","수"]
["2028-10-05","2028-10-05","목"]
["2028-10-06","2028-10-06","금"]
["2028-10-07","2028-10-07","토"]
["2028-10-08","2028-10-08","일"]
["2028-10-09","2028-10-09","월"]
["2028-10-10","2028-10-10","화"]
["2028-10-11","2028-10-11","수"]
["2028-10-12","2028-10-12","목"]
["2028-10-13","2028-10-13","금"]
["2028-10-14","2028-10-14","토"]
["2028-10-15","2028-10-15","일"]
["2028-10-16","2028-10-16","월"]
["2028-10-17","2028-10-17","화"]
["2028-10-18","2028-10-18","수"]
["2028-10-19","2028-10-19","목"]
["2028-10-20","2028-10-20","금"]
["2028-10-21","2028-10-21","토"]
["2028-10-22","2028-10-22","일"]
["2028-10-23","2028-10-23","월"]
["2028-10-24","2028-10-24","화"]
["2028-10-25","2028-10-25","수"]
["2028-10-26","2028-10-26","목"]
["2028-10-27","2028-10-27","금"]
["2028-10-28","2028-10-28","토"]
["2028-10-29","2028-10-29","일"]
["2028-10-30","2028-10-30","월"]
["2028-10-31","2028-10-31","화"]
["2028-11-01","2028-11-01","수"]
["2028-11-02","2028-11-02","목"]
["2028-11-03","2028-11-03","금"]
["2028-11-04","2028-11-04","토"]
["2028-11-05","2028-11-05","일"]
["2028-11-06","2028-11-06","월"]
["2028-11-07","2028-11-07","화"]
["2028-11-08","2028-11-08",{"$f":"CHOOSE(WEEKDAY(B1781,1),\"일\",\"월\",\"화\",\"수\",\"목\",\"금\",\"토\")","v":"수"}]
["2028-11-09","2028-11-09","목"]
["2028-11-10","2028-11-10","금"]
["2028-11-11","2028-11-11","토"]
["2028-11-12","2028-11-12","일"]
["2028-11-13","2028-11-13","월"]
["2028-11-14","2028-11-14","화"]
["2028-11-15","2028-11-15","수"]
["2028-11-16","2028-11-16","목"]
["2028-11-17","2028-11-17","금"]
[{"$f":"A1790+1","v":"2028-11-18"},"2028-11-18","토"]
["2028-11-19","2028-11-19","일"]
["2028-11-20","2028-11-20","월"]
["2028-11-21","2028-11-21","화"]
["2028-11-22","2028-11-22","수"]
["2028-11-23","2028-11-23","목"]
["2028-11-24","2028-11-24","금"]
["2028-11-25","2028-11-25","토"]
["2028-11-26","2028-11-26","일"]
["2028-11-27","2028-11-27","월"]
["2028-11-28","2028-11-28","화"]
["2028-11-29",{"$f":"B1801+1","v":"2028-11-29"},"수"]
["2028-11-30","2028-11-30","목"]
["2028-12-01","2028-12-01","금"]
["2028-12-02","2028-12-02","토"]
["2028-12-03","2028-12-03","일"]
["2028-12-04","2028-12-04","월"]
["2028-12-05","2028-12-05","화"]
["2028-12-06","2028-12-06","수"]
["2028-12-07","2028-12-07","목"]
["2028-12-08","2028-12-08","금"]
["2028-12-09","2028-12-09","토"]
["2028-12-10","2028-12-10","일"]
["2028-12-11","2028-12-11","월"]
["2028-12-12","2028-12-12","화"]
["2028-12-13","2028-12-13","수"]
["2028-12-14","2028-12-14","목"]
["2028-12-15","2028-12-15","금"]
["2028-12-16","2028-12-16","토"]
["2028-12-17","2028-12-17","일"]
["2028-12-18","2028-12-18","월"]
["2028-12-19","2028-12-19","화"]
["2028-12-20","2028-12-20","수"]
["2028-12-21","2028-12-21","목"]
["2028-12-22","2028-12-22","금"]
["2028-12-23","2028-12-23","토"]
["2028-12-24","2028-12-24","일"]
["2028-12-25","2028-12-25","월"]
["2028-12-26","2028-12-26","화"]
["2028-12-27","2028-12-27","수"]
["2028-12-28","2028-12-28","목"]
["2028-12-29","2028-12-29","금"]
["2028-12-30","2028-12-30","토"]
["2028-12-31",{"$f":"IF(YEAR(A1833)=YEAR(A1834),A1833+1,\"\")","v":"2028-12-31"},{"$f":"IF(B1834=\"\",\"\",CHOOSE(WEEKDAY(B1834,1),\"일\",\"월\",\"화\",\"수\",\"목\",\"금\",\"토\"))","v":"일"}]

{"sheet":"공휴일","index":5,"n_rows":131,"n_cols":11,"rows_kept":131,"cut":false,"hidden":false,"merged":[[0,9,0,10],[0,3,0,5]]}
["연도","월","일","공휴일",null,null,"연도","월","일","기념일"]
[{"$f":"IF(D2=\"\",\"\",YEAR(D2))","v":2024},{"$f":"IF(D2=\"\",\"\",MONTH(D2))","v":1},{"$f":"IF(D2=\"\",\"\",DAY(D2))","v":1},{"$f":"DATE(일정!$C$2,1,1)","v":"2024-01-01"},{"$f":"D2","v":"2024-01-01"},"신정",{"$f":"IF(J2=\"\",\"\",YEAR(J2))","v":2024},{"$f":"IF(J2=\"\",\"\",MONTH(J2))","v":1},{"$f":"IF(J2=\"\",\"\",DAY(J2))","v":1},{"$f":"DATE(연간!$O$2,1,1)","v":"2024-01-01"},"친구생일"]
[{"$f":"IF(D3=\"\",\"\",YEAR(D3))","v":2024},{"$f":"IF(D3=\"\",\"\",MONTH(D3))","v":2},{"$f":"IF(D3=\"\",\"\",DAY(D3))","v":9},{"$f":"INDEX(날짜,MATCH(일정!$C$2,공휴일연도,0),0)","v":"2024-02-09"},{"$f":"D3","v":"2024-02-09"},"설날",{"$f":"IF(J3=\"\",\"\",YEAR(J3))","v":2025},{"$f":"IF(J3=\"\",\"\",MONTH(J3))","v":4},{"$f":"IF(J3=\"\",\"\",DAY(J3))","v":5},"2025-04-05","기념일"]
[2024,2,10,{"$f":"D3+1","v":"2024-02-10"},"2024-02-10","설날","","",""]
[2024,2,11,{"$f":"D4+1","v":"2024-02-11"},"2024-02-11","설날","","",""]
[2024,3,1,{"$f":"DATE(일정!$C$2,3,1)","v":"2024-03-01"},"2024-03-01","삼일절","","",""]
[2024,5,5,{"$f":"DATE(일정!$C$2,5,5)","v":"2024-05-05"},"2024-05-05","어린이날","","",""]
[2024,5,15,{"$f":"INDEX(날짜,MATCH(1,($F$8=휴일명)*(일정!$C$2=공휴일연도),0))","v":"2024-05-15"},"2024-05-15","석가탄신일","","",""]
[2024,6,6,{"$f":"DATE(일정!$C$2,6,6)","v":"2024-06-06"},"2024-06-06","현충일","","",""]
[2024,8,15,{"$f":"DATE(일정!$C$2,8,15)","v":"2024-08-15"},"2024-08-15","광복절","","",""]
[2024,9,16,{"$f":"INDEX(날짜,MATCH(1,($F$11=휴일명)*(일정!$C$2=공휴일연도),0))","v":"2024-09-16"},"2024-09-16","추석","","",""]
[2024,9,17,{"$f":"D11+1","v":"2024-09-17"},"2024-09-17","추석","","",""]
[2024,9,18,{"$f":"D12+1","v":"2024-09-18"},"2024-09-18","추석","","",""]
[2024,10,3,{"$f":"DATE(일정!$C$2,10,3)","v":"2024-10-03"},"2024-10-03","개천절","","",""]
[2024,10,9,{"$f":"DATE(일정!$C$2,10,9)","v":"2024-10-09"},"2024-10-09","한글날","","",""]
[2024,12,25,{"$f":"DATE(일정!$C$2,12,25)","v":"2024-12-25"},"2024-12-25","성탄절","","",""]
[2025,1,1,{"$f":"DATE(일정!$C$2+1,1,1)","v":"2025-01-01"},"2025-01-01","신정","","",""]
[2025,1,28,{"$f":"INDEX(날짜,MATCH(일정!$C$2+1,공휴일연도,0),0)","v":"2025-01-28"},"2025-01-28","설날","","",""]
[2025,1,29,{"$f":"D18+1","v":"2025-01-29"},"2025-01-29","설날","","",""]
[2025,1,30,{"$f":"D19+1","v":"2025-01-30"},"2025-01-30","설날","","",""]
[2025,3,1,{"$f":"DATE(일정!$C$2+1,3,1)","v":"2025-03-01"},"2025-03-01","삼일절","","",""]
[2025,5,5,{"$f":"DATE(일정!$C$2+1,5,5)","v":"2025-05-05"},"2025-05-05","어린이날","","",""]
[2025,5,5,{"$f":"INDEX(날짜,MATCH(1,($F$8=휴일명)*(일정!$C$2+1=공휴일연도),0))","v":"2025-05-05"},"2025-05-05","석가탄신일","","",""]
[2025,6,6,{"$f":"DATE(일정!$C$2+1,6,6)","v":"2025-06-06"},"2025-06-06","현충일","","",""]
[2025,8,15,{"$f":"DATE(일정!$C$2+1,8,15)","v":"2025-08-15"},"2025-08-15","광복절","","",""]
[2025,10,5,{"$f":"INDEX(날짜,MATCH(1,($F$11=휴일명)*(일정!$C$2+1=공휴일연도),0))","v":"2025-10-05"},"2025-10-05","추석","","",""]
[2025,10,6,{"$f":"D26+1","v":"2025-10-06"},"2025-10-06","추석","","",""]
[2025,10,7,{"$f":"D27+1","v":"2025-10-07"},"2025-10-07","추석","","",""]
[2025,10,3,{"$f":"DATE(일정!$C$2+1,10,3)","v":"2025-10-03"},"2025-10-03","개천절","","",""]
[2025,10,9,{"$f":"DATE(일정!$C$2+1,10,9)","v":"2025-10-09"},"2025-10-09","한글날","","",""]
[2025,12,25,{"$f":"DATE(일정!$C$2+1,12,25)","v":"2025-12-25"},"2025-12-25","성탄절","","",""]
[2026,1,1,{"$f":"DATE(일정!$C$2+2,1,1)","v":"2026-01-01"},"2026-01-01","신정","","",""]
[2026,2,16,{"$f":"INDEX(날짜,MATCH(일정!$C$2+2,공휴일연도,0),0)","v":"2026-02-16"},"2026-02-16","설날","","",""]
[2026,2,17,{"$f":"D33+1","v":"2026-02-17"},"2026-02-17","설날","","",""]
[2026,2,18,{"$f":"D34+1","v":"2026-02-18"},"2026-02-18","설날","","",""]
[2026,3,1,{"$f":"DATE(일정!$C$2+2,3,1)","v":"2026-03-01"},"2026-03-01","삼일절","","",""]
[2026,5,5,{"$f":"DATE(일정!$C$2+2,5,5)","v":"2026-05-05"},"2026-05-05","어린이날","","",""]
[2026,5,24,{"$f":"INDEX(날짜,MATCH(1,($F$8=휴일명)*(일정!$C$2+2=공휴일연도),0))","v":"2026-05-24"},"2026-05-24","석가탄신일","","",""]
[2026,6,6,{"$f":"DATE(일정!$C$2+2,6,6)","v":"2026-06-06"},"2026-06-06","현충일","","",""]
[2026,8,15,{"$f":"DATE(일정!$C$2+2,8,15)","v":"2026-08-15"},"2026-08-15","광복절","","",""]
[2026,9,24,{"$f":"INDEX(날짜,MATCH(1,($F$11=휴일명)*(일정!$C$2+2=공휴일연도),0))","v":"2026-09-24"},"2026-09-24","추석","","",""]
[2026,9,25,{"$f":"D41+1","v":"2026-09-25"},"2026-09-25","추석","","",""]
[2026,9,26,{"$f":"D42+1","v":"2026-09-26"},"2026-09-26","추석","","",""]
[2026,10,3,{"$f":"DATE(일정!$C$2+2,10,3)","v":"2026-10-03"},"2026-10-03","개천절","","",""]
[2026,10,9,{"$f":"DATE(일정!$C$2+2,10,9)","v":"2026-10-09"},"2026-10-09","한글날","","",""]
[2026,12,25,{"$f":"DATE(일정!$C$2+2,12,25)","v":"2026-12-25"},"2026-12-25","성탄절","","",""]
[2027,1,1,{"$f":"DATE(일정!$C$2+3,1,1)","v":"2027-01-01"},"2027-01-01","신정","","",""]
[2027,2,6,{"$f":"INDEX(날짜,MATCH(일정!$C$2+3,공휴일연도,0),0)","v":"2027-02-06"},"2027-02-06","설날","","",""]
[2027,2,7,{"$f":"D48+1","v":"2027-02-07"},"2027-02-07","설날","","",""]
[2027,2,8,{"$f":"D49+1","v":"2027-02-08"},"2027-02-08","설날","","",""]
[2027,3,1,{"$f":"DATE(일정!$C$2+3,3,1)","v":"2027-03-01"},"2027-03-01","삼일절","","",""]
[2027,5,5,{"$f":"DATE(일정!$C$2+3,5,5)","v":"2027-05-05"},"2027-05-05","어린이날","","",""]
[2027,5,13,{"$f":"INDEX(날짜,MATCH(1,($F$8=휴일명)*(일정!$C$2+3=공휴일연도),0))","v":"2027-05-13"},"2027-05-13","석가탄신일","","",""]
[2027,6,6,{"$f":"DATE(일정!$C$2+3,6,6)","v":"2027-06-06"},"2027-06-06","현충일","","",""]
[2027,8,15,{"$f":"DATE(일정!$C$2+3,8,15)","v":"2027-08-15"},"2027-08-15","광복절","","",""]
[2027,9,14,{"$f":"INDEX(날짜,MATCH(1,($F$11=휴일명)*(일정!$C$2+3=공휴일연도),0))","v":"2027-09-14"},"2027-09-14","추석","","",""]
[2027,9,15,{"$f":"D56+1","v":"2027-09-15"},"2027-09-15","추석","","",""]
[2027,9,16,{"$f":"D57+1","v":"2027-09-16"},"2027-09-16","추석","","",""]
[2027,10,3,{"$f":"DATE(일정!$C$2+3,10,3)","v":"2027-10-03"},"2027-10-03","개천절","","",""]
[2027,10,9,{"$f":"DATE(일정!$C$2+3,10,9)","v":"2027-10-09"},"2027-10-09","한글날","","",""]
[2027,12,25,{"$f":"DATE(일정!$C$2+3,12,25)","v":"2027-12-25"},"2027-12-25","성탄절","","",""]
[2028,1,1,{"$f":"DATE(일정!$C$2+4,1,1)","v":"2028-01-01"},"2028-01-01","신정","","",""]
[2028,1,26,{"$f":"INDEX(날짜,MATCH(일정!$C$2+4,공휴일연도,0),0)","v":"2028-01-26"},"2028-01-26","설날","","",""]
[2028,1,27,{"$f":"D63+1","v":"2028-01-27"},"2028-01-27","설날","","",""]
[2028,1,28,{"$f":"D64+1","v":"2028-01-28"},"2028-01-28","설날","","",""]
[2028,3,1,{"$f":"DATE(일정!$C$2+4,3,1)","v":"2028-03-01"},"2028-03-01","삼일절","","",""]
[{"$f":"IF(D67=\"\",\"\",YEAR(D67))","v":2028},5,5,{"$f":"DATE(일정!$C$2+4,5,5)","v":"2028-05-05"},{"$f":"D67","v":"2028-05-05"},"어린이날",{"$f":"IF(J67=\"\",\"\",YEAR(J67))","v":""},"",""]
[2028,5,2,{"$f":"INDEX(날짜,MATCH(1,($F$8=휴일명)*(일정!$C$2+4=공휴일연도),0))","v":"2028-05-02"},"2028-05-02","석가탄신일","","",""]
[2028,6,6,{"$f":"DATE(일정!$C$2+4,6,6)","v":"2028-06-06"},"2028-06-06","현충일","","",""]
[2028,8,15,{"$f":"DATE(일정!$C$2+4,8,15)","v":"2028-08-15"},"2028-08-15","광복절","","",""]
[2028,10,2,{"$f":"INDEX(날짜,MATCH(1,($F$11=휴일명)*(일정!$C$2+4=공휴일연도),0))","v":"2028-10-02"},"2028-10-02","추석","","",""]
[2028,10,3,{"$f":"D71+1","v":"2028-10-03"},"2028-10-03","추석","","",""]
[2028,10,4,{"$f":"D72+1","v":"2028-10-04"},"2028-10-04","추석","","",""]
[2028,10,3,{"$f":"DATE(일정!$C$2+4,10,3)","v":"2028-10-03"},"2028-10-03","개천절","","",""]
[2028,10,9,{"$f":"DATE(일정!$C$2+4,10,9)","v":"2028-10-09"},"2028-10-09","한글날","","",""]
[2028,12,25,{"$f":"DATE(일정!$C$2+4,12,25)","v":"2028-12-25"},"2028-12-25","성탄절","","",""]
[2024,2,12,"2024-02-12",{"$f":"IF(D77=\"\",\"\",D77)","v":"2024-02-12"},"설날 대체휴일","","",""]
[2024,4,10,"2024-04-10",{"$f":"IF(D78=\"\",\"\",D78)","v":"2024-04-10"},"22대 국회의원선거","","",""]
[2024,5,6,"2024-05-06","2024-05-06","어린이날 대체휴일","","",""]
[2025,3,3,"2025-03-03","2025-03-03","삼일절 대체휴일","","",""]
[2025,10,8,"2025-10-08","2025-10-08","추석 대체휴일","","",""]
[2026,3,2,"2026-03-02","2026-03-02","삼일절 대체휴일","","",""]
["","","",null,"",null,"","",""]
["","","",null,"",null,"","",""]
["","","",null,"",null,"","",""]
["","","",null,"",null,"","",""]
["","","",null,"",null,"",{"$f":"IF(J87=\"\",\"\",MONTH(J87))","v":""},{"$f":"IF(J87=\"\",\"\",DAY(J87))","v":""}]
["","","",null,"",null,"","",""]
["","","",null,"",null,"","",""]
["","","",null,"",null,"","",""]
["",{"$f":"IF(D91=\"\",\"\",MONTH(D91))","v":""},{"$f":"IF(D91=\"\",\"\",DAY(D91))","v":""},null,"",null,"","",""]
["","","",null,"",null,"","",""]
["","","",null,"",null,"","",""]
["","","",null,"",null,"","",""]
["","","",null,"",null,"","",""]
["","","",null,"",null,"","",""]
["","","",null,"",null,"","",""]
["","","",null,"",null,"","",""]
["","","",null,"",null,"","",""]
["","","",null,"",null,"","",""]
["","","",null,"",null,"","",""]
["","","",null,"",null,"","",""]
["","","",null,"",null,"","",""]
["","","",null,"",null,"","",""]
["","","",null,"",null,"","",""]
["","","",null,"",null,"","",""]
["","","",null,"",null,"","",""]
["","","",null,"",null,"","",""]
["","","",null,"",null,"","",""]
["","","",null,"",null,"","",""]
["","","",null,"",null,"","",""]
["","","",null,"",null,"","",""]
["","","",null,"",null,"","",""]
["","","",null,"",null,"","",""]
["","","",null,"",null,"","",""]
["","","",null,"",null,"","",""]
["","","",null,"",null,"","",""]
["","","",null,"",null,"","",""]
["","","",null,"",null,"","",""]
["","","",null,"",null,"","",""]
["","","",null,"",null,"","",""]
["","","",null,"",null,"","",""]
["","","",null,"",null,"","",""]
["","","",null,"",null,"","",""]
["","","",null,"",null,"","",""]
["","","",null,"",null,"","",""]
["","","",null,"",null,"","",""]
["","","",null,"",null,"","",""]
["","","",null,"",null,"","",""]
["","","",null,"",null,"","",""]
[{"$f":"IF(D131=\"\",\"\",YEAR(D131))","v":""},"","",null,"",null,{"$f":"IF(J131=\"\",\"\",YEAR(J131))","v":""},"",""]

{"sheet":"디데이","index":6,"n_rows":12,"n_cols":6,"rows_kept":12,"cut":false,"hidden":false,"merged":[]}
[]
[null,"디데이 내용 입력","프로젝트 발표",null,{"$f":"IF(C2=\"\",\"\",\"📆 \"&C2)","v":"📆 프로젝트 발표"},{"$f":"IF(C4=\"\",\"\",C5)","v":"D+58"}]
[null,"오늘 날짜",{"$f":"TODAY()","v":"2024-02-28"}]
[null,"기준일 입력","2024-01-01"]
[null,"D-day",{"$f":"IF(C4-C3<0,\"D+\"&ABS(C4-C3),\"D-\"&C4-C3)","v":"D+58"}]
[]
[null,"디데이 내용 입력","기념일",null,{"$f":"IF(C7=\"\",\"\",\"📆 \"&C7)","v":"📆 기념일"},{"$f":"IF(C9=\"\",\"\",C10)","v":"D+1121"}]
[null,"오늘 날짜",{"$f":"TODAY()","v":"2024-02-28"}]
[null,"기준일 입력","2021-02-02"]
[null,"D-day",{"$f":"IF(C9-C8<0,\"D+\"&ABS(C9-C8),\"D-\"&C9-C8)","v":"D+1121"}]
[]
[null,"*노란색 셀 배경이 채워져있는 곳만 수정하세요!"]

{"sheet":"미니달력","index":7,"n_rows":12,"n_cols":16,"rows_kept":12,"cut":false,"hidden":true,"merged":[[1,14,1,18]]}
[]
[null,{"$f":"연간!B2","v":"S"},null,null,null,null,null,null,null,null,null,null,null,null,{"$f":"연간!O2","v":2024}]
[]
[null,null,null,null,{"$f":"IF(달력!$B$3=1,12,달력!$B$3-1)","v":2},null,null,null,null,null,null,null,{"$f":"IF(달력!$B$3=12,1,달력!$B$3+1)","v":4}]
[]
[null,{"$f":"IF($B$2=\"S\",\"S\",IF($B$2=\"M\",\"M\"))","v":"S"},{"$f":"IF($B$2=\"S\",\"M\",IF($B$2=\"M\",\"T\"))","v":"M"},{"$f":"IF($B$2=\"S\",\"T\",IF($B$2=\"M\",\"W\"))","v":"T"},{"$f":"IF($B$2=\"S\",\"W\",IF($B$2=\"M\",\"T\"))","v":"W"},{"$f":"IF($B$2=\"S\",\"T\",IF($B$2=\"M\",\"F\"))","v":"T"},{"$f":"IF($B$2=\"S\",\"F\",IF($B$2=\"M\",\"S\"))","v":"F"},"S",null,{"$f":"IF($B$2=\"S\",\"S\",IF($B$2=\"M\",\"M\"))","v":"S"},{"$f":"IF($B$2=\"S\",\"M\",IF($B$2=\"M\",\"T\"))","v":"M"},{"$f":"IF($B$2=\"S\",\"T\",IF($B$2=\"M\",\"W\"))","v":"T"},{"$f":"IF($B$2=\"S\",\"W\",IF($B$2=\"M\",\"T\"))","v":"W"},{"$f":"IF($B$2=\"S\",\"T\",IF($B$2=\"M\",\"F\"))","v":"T"},{"$f":"IF($B$2=\"S\",\"F\",IF($B$2=\"M\",\"S\"))","v":"F"},"S"]
[null,{"$f":"IF(B2=\"M\",(IF(DAY(DATE(IF(달력!$B$3=1,$O$2-1,$O$2),$E$4,1)-WEEKDAY(DATE(IF(달력!$B$3=1,$O$2-1,$O$2),$E$4,1))+2)=2,DATE(IF(달력!$B$3=1,$O$2-1,$O$2),$E$4,1)-WEEKDAY(DATE(IF(달력!$B$3=1,$O$2-1,$O$2),$E$4,1))-5,DATE(IF(달력!$B$3=1,$O$2-1,$O$2),$E$4,1)-WEEKDAY(DATE(IF(달력!$B$3=1,$O$2-1,$O$2),$E$4,1))+2)),IF(B2=\"S\",DATE(IF(달력!$B$3=1,$O$2-1,$O$2),$E$4,1)-WEEKDAY(DATE(IF(달력!$B$3=1,$O$2-1,$O$2),$E$4,1))+1))","v":"2024-01-28"},{"$f":"B7+1","v":"2024-01-29"},"2024-01-30","2024-01-31","2024-02-01","2024-02-02","2024-02-03",null,{"$f":"IF(B2=\"M\",(IF(DAY(DATE(IF(달력!$B$3=12,$O$2+1,$O$2),$M$4,1)-WEEKDAY(DATE(IF(달력!$B$3=12,$O$2+1,$O$2),$M$4,1))+2)=2,DATE(IF(달력!$B$3=12,$O$2+1,$O$2),$M$4,1)-WEEKDAY(DATE(IF(달력!$B$3=12,$O$2+1,$O$2),$M$4,1))-5,DATE(IF(달력!$B$3=12,$O$2+1,$O$2),$M$4,1)-WEEKDAY(DATE(IF(달력!$B$3=12,$O$2+1,$O$2),$M$4,1))+2)),IF(B2=\"S\",DATE(IF(달력!$B$3=12,$O$2+1,$O$2),$M$4,1)-WEEKDAY(DATE(IF(달력!$B$3=12,$O$2+1,$O$2),$M$4,1))+1))","v":"2024-03-31"},{"$f":"J7+1","v":"2024-04-01"},"2024-04-02","2024-04-03","2024-04-04","2024-04-05","2024-04-06"]
[null,{"$f":"B7+7","v":"2024-02-04"},{"$f":"C7+7","v":"2024-02-05"},"2024-02-06","2024-02-07","2024-02-08","2024-02-09","2024-02-10",null,{"$f":"J7+7","v":"2024-04-07"},"2024-04-08","2024-04-09","2024-04-10","2024-04-11","2024-04-12","2024-04-13"]
[null,{"$f":"B8+7","v":"2024-02-11"},"2024-02-12","2024-02-13","2024-02-14","2024-02-15","2024-02-16","2024-02-17",null,"2024-04-14","2024-04-15","2024-04-16","2024-04-17","2024-04-18","2024-04-19","2024-04-20"]
[null,{"$f":"B9+7","v":"2024-02-18"},"2024-02-19","2024-02-20","2024-02-21","2024-02-22","2024-02-23","2024-02-24",null,"2024-04-21","2024-04-22","2024-04-23","2024-04-24","2024-04-25","2024-04-26","2024-04-27"]
[null,{"$f":"B10+7","v":"2024-02-25"},"2024-02-26","2024-02-27","2024-02-28","2024-02-29","2024-03-01","2024-03-02",null,"2024-04-28","2024-04-29","2024-04-30","2024-05-01","2024-05-02","2024-05-03","2024-05-04"]
[null,{"$f":"B11+7","v":"2024-03-03"},"2024-03-04","2024-03-05","2024-03-06","2024-03-07","2024-03-08","2024-03-09",null,"2024-05-05","2024-05-06","2024-05-07","2024-05-08","2024-05-09","2024-05-10","2024-05-11"]

{"sheet":"이름지정","index":8,"n_rows":637,"n_cols":5,"rows_kept":637,"cut":false,"hidden":true,"merged":[]}
["년도","월","연도","날짜","휴일명"]
[2010,1,{"$f":"YEAR(D2)","v":2010},"2010-02-13","설날"]
[2011,2,{"$f":"YEAR(D3)","v":2010},"2010-02-14","설날"]
[2012,3,2010,"2010-02-15","설날"]
[2013,4,2010,"2010-05-21","석가탄신일"]
[2014,5,2010,"2010-09-21","추석"]
[2015,6,2010,"2010-09-22","추석"]
[2016,7,2010,"2010-09-23","추석"]
[2017,8,2011,"2011-02-02","설날"]
[2018,9,2011,"2011-02-03","설날"]
[2019,10,2011,"2011-02-04","설날"]
[2020,11,2011,"2011-05-10","석가탄신일"]
[2021,12,2011,"2011-09-11","추석"]
[2022,null,2011,"2011-09-12","추석"]
[2023,null,2011,"2011-09-13","추석"]
[2024,null,2012,"2012-01-22","설날"]
[2025,null,2012,"2012-01-23","설날"]
[2026,null,2012,"2012-01-24","설날"]
[2027,null,2012,"2012-05-28","석가탄신일"]
[2028,null,2012,"2012-09-29","추석"]
[2029,null,2012,"2012-09-30","추석"]
[2030,null,2012,"2012-10-01","추석"]
[2031,null,2013,"2013-02-09","설날"]
[2032,null,2013,"2013-02-10","설날"]
[2033,null,2013,"2013-02-11","설날"]
[2034,null,2013,"2013-05-17","석가탄신일"]
[2035,null,2013,"2013-09-18","추석"]
[2036,null,2013,"2013-09-19","추석"]
[2037,null,2013,"2013-09-20","추석"]
[2038,null,2014,"2014-01-30","설날"]
[2039,null,2014,"2014-01-31","설날"]
[2040,null,2014,"2014-02-01","설날"]
[2041,null,2014,"2014-05-06","석가탄신일"]
[2042,null,2014,"2014-09-07","추석"]
[2043,null,2014,"2014-09-08","추석"]
[2044,null,2014,"2014-09-09","추석"]
[2045,null,2015,"2015-02-18","설날"]
[2046,null,2015,"2015-02-19","설날"]
[2047,null,2015,"2015-02-20","설날"]
[2048,null,2015,"2015-05-25","석가탄신일"]
[2049,null,2015,"2015-09-26","추석"]
[2050,null,2015,"2015-09-27","추석"]
[2051,null,2015,"2015-09-28","추석"]
[2052,null,2016,"2016-02-08","설날"]
[2053,null,2016,"2016-02-09","설날"]
[2054,null,2016,"2016-02-10","설날"]
[2055,null,2016,"2016-05-14","석가탄신일"]
[2056,null,2016,"2016-09-14","추석"]
[2057,null,2016,"2016-09-15","추석"]
[2058,null,2016,"2016-09-16","추석"]
[2059,null,2017,"2017-01-27","설날"]
[2060,null,2017,"2017-01-28","설날"]
[2061,null,2017,"2017-01-29","설날"]
[2062,null,2017,"2017-05-03","석가탄신일"]
[2063,null,2017,"2017-10-03","추석"]
[2064,null,2017,"2017-10-04","추석"]
[2065,null,2017,"2017-10-05","추석"]
[2066,null,2018,"2018-02-15","설날"]
[2067,null,2018,"2018-02-16","설날"]
[2068,null,2018,"2018-02-17","설날"]
[2069,null,2018,"2018-05-22","석가탄신일"]
[2070,null,2018,"2018-09-23","추석"]
[2071,null,2018,"2018-09-24","추석"]
[2072,null,2018,"2018-09-25","추석"]
[2073,null,2019,"2019-02-04","설날"]
[2074,null,2019,"2019-02-05","설날"]
[2075,null,{"$f":"YEAR(D67)","v":2019},"2019-02-06","설날"]
[2076,null,2019,"2019-05-12","석가탄신일"]
[2077,null,2019,"2019-09-12","추석"]
[2078,null,2019,"2019-09-13","추석"]
[2079,null,2019,"2019-09-14","추석"]
[2080,null,2020,"2020-01-24","설날"]
[2081,null,2020,"2020-01-25","설날"]
[2082,null,2020,"2020-01-26","설날"]
[2083,null,2020,"2020-04-30","석가탄신일"]
[2084,null,2020,"2020-09-30","추석"]
[2085,null,2020,"2020-10-01","추석"]
[2086,null,2020,"2020-10-02","추석"]
[2087,null,2021,"2021-02-11","설날"]
[2088,null,2021,"2021-02-12","설날"]
[2089,null,2021,"2021-02-13","설날"]
[2090,null,2021,"2021-05-19","석가탄신일"]
[2091,null,2021,"2021-09-20","추석"]
[2092,null,2021,"2021-09-21","추석"]
[2093,null,2021,"2021-09-22","추석"]
[2094,null,2022,"2022-01-31","설날"]
[2095,null,2022,"2022-02-01","설날"]
[2096,null,2022,"2022-02-02","설날"]
[2097,null,2022,"2022-05-08","석가탄신일"]
[2098,null,2022,"2022-09-09","추석"]
[2099,null,2022,"2022-09-10","추석"]
[2100,null,2022,"2022-09-11","추석"]
[null,null,2023,"2023-01-21","설날"]
[null,null,2023,"2023-01-22","설날"]
[null,null,2023,"2023-01-23","설날"]
[null,null,2023,"2023-05-27","석가탄신일"]
[null,null,2023,"2023-09-28","추석"]
[null,null,2023,"2023-09-29","추석"]
[null,null,2023,"2023-09-30","추석"]
[null,null,2024,"2024-02-09","설날"]
[null,null,2024,"2024-02-10","설날"]
[null,null,2024,"2024-02-11","설날"]
[null,null,2024,"2024-05-15","석가탄신일"]
[null,null,2024,"2024-09-16","추석"]
[null,null,2024,"2024-09-17","추석"]
[null,null,2024,"2024-09-18","추석"]
[null,null,2025,"2025-01-28","설날"]
[null,null,2025,"2025-01-29","설날"]
[null,null,2025,"2025-01-30","설날"]
[null,null,2025,"2025-05-05","석가탄신일"]
[null,null,2025,"2025-10-05","추석"]
[null,null,2025,"2025-10-06","추석"]
[null,null,2025,"2025-10-07","추석"]
[null,null,2026,"2026-02-16","설날"]
[null,null,2026,"2026-02-17","설날"]
[null,null,2026,"2026-02-18","설날"]
[null,null,2026,"2026-05-24","석가탄신일"]
[null,null,2026,"2026-09-24","추석"]
[null,null,2026,"2026-09-25","추석"]
[null,null,2026,"2026-09-26","추석"]
[null,null,2027,"2027-02-06","설날"]
[null,null,2027,"2027-02-07","설날"]
[null,null,2027,"2027-02-08","설날"]
[null,null,2027,"2027-05-13","석가탄신일"]
[null,null,2027,"2027-09-14","추석"]
[null,null,2027,"2027-09-15","추석"]
[null,null,2027,"2027-09-16","추석"]
[null,null,2028,"2028-01-26","설날"]
[null,null,2028,"2028-01-27","설날"]
[null,null,2028,"2028-01-28","설날"]
[null,null,{"$f":"YEAR(D131)","v":2028},"2028-05-02","석가탄신일"]
[null,null,2028,"2028-10-02","추석"]
[null,null,2028,"2028-10-03","추석"]
[null,null,2028,"2028-10-04","추석"]
[null,null,2029,"2029-02-12","설날"]
[null,null,2029,"2029-02-13","설날"]
[null,null,2029,"2029-02-14","설날"]
[null,null,2029,"2029-05-20","석가탄신일"]
[null,null,2029,"2029-09-21","추석"]
[null,null,2029,"2029-09-22","추석"]
[null,null,2029,"2029-09-23","추석"]
[null,null,2030,"2030-02-02","설날"]
[null,null,2030,"2030-02-03","설날"]
[null,null,2030,"2030-02-04","설날"]
[null,null,2030,"2030-05-09","석가탄신일"]
[null,null,2030,"2030-09-11","추석"]
[null,null,2030,"2030-09-12","추석"]
[null,null,2030,"2030-09-13","추석"]
[null,null,2031,"2031-01-22","설날"]
[null,null,2031,"2031-01-23","설날"]
[null,null,2031,"2031-01-24","설날"]
[null,null,2031,"2031-05-28","석가탄신일"]
[null,null,2031,"2031-09-30","추석"]
[null,null,2031,"2031-10-01","추석"]
[null,null,2031,"2031-10-02","추석"]
[null,null,2032,"2032-02-10","설날"]
[null,null,2032,"2032-02-11","설날"]
[null,null,2032,"2032-02-12","설날"]
[null,null,2032,"2032-05-16","석가탄신일"]
[null,null,2032,"2032-09-18","추석"]
[null,null,2032,"2032-09-19","추석"]
[null,null,2032,"2032-09-20","추석"]
[null,null,2033,"2033-01-30","설날"]
[null,null,2033,"2033-01-31","설날"]
[null,null,2033,"2033-02-01","설날"]
[null,null,2033,"2033-05-06","석가탄신일"]
[null,null,2033,"2033-10-06","추석"]
[null,null,2033,"2033-10-07","추석"]
[null,null,2033,"2033-10-08","추석"]
[null,null,2034,"2034-02-18","설날"]
[null,null,2034,"2034-02-19","설날"]
[null,null,2034,"2034-02-20","설날"]
[null,null,2034,"2034-05-25","석가탄신일"]
[null,null,2034,"2034-09-26","추석"]
[null,null,2034,"2034-09-27","추석"]
[null,null,2034,"2034-09-28","추석"]
[null,null,2035,"2035-02-07","설날"]
[null,null,2035,"2035-02-08","설날"]
[null,null,2035,"2035-02-09","설날"]
[null,null,2035,"2035-05-15","석가탄신일"]
[null,null,2035,"2035-09-15","추석"]
[null,null,2035,"2035-09-16","추석"]
[null,null,2035,"2035-09-17","추석"]
[null,null,2036,"2036-01-27","설날"]
[null,null,2036,"2036-01-28","설날"]
[null,null,2036,"2036-01-29","설날"]
[null,null,2036,"2036-05-03","석가탄신일"]
[null,null,2036,"2036-10-03","추석"]
[null,null,2036,"2036-10-04","추석"]
[null,null,2036,"2036-10-05","추석"]
[null,null,2037,"2037-02-14","설날"]
[null,null,2037,"2037-02-15","설날"]
[null,null,2037,"2037-02-16","설날"]
[null,null,2037,"2037-05-22","석가탄신일"]
[null,null,{"$f":"YEAR(D195)","v":2037},"2037-09-23","추석"]
[null,null,2037,"2037-09-24","추석"]
[null,null,2037,"2037-09-25","추석"]
[null,null,2038,"2038-02-03","설날"]
[null,null,2038,"2038-02-04","설날"]
[null,null,2038,"2038-02-05","설날"]
[null,null,2038,"2038-05-11","석가탄신일"]
[null,null,2038,"2038-09-12","추석"]
[null,null,2038,"2038-09-13","추석"]
[null,null,2038,"2038-09-14","추석"]
[null,null,2039,"2039-01-23","설날"]
[null,null,2039,"2039-01-24","설날"]
[null,null,2039,"2039-01-25","설날"]
[null,null,2039,"2039-04-30","석가탄신일"]
[null,null,2039,"2039-10-01","추석"]
[null,null,2039,"2039-10-02","추석"]
[null,null,2039,"2039-10-03","추석"]
[null,null,2040,"2040-02-11","설날"]
[null,null,2040,"2040-02-12","설날"]
[null,null,2040,"2040-02-13","설날"]
[null,null,2040,"2040-05-18","석가탄신일"]
[null,null,2040,"2040-09-20","추석"]
[null,null,2040,"2040-09-21","추석"]
[null,null,2040,"2040-09-22","추석"]
[null,null,2041,"2041-01-31","설날"]
[null,null,2041,"2041-02-01","설날"]
[null,null,2041,"2041-02-02","설날"]
[null,null,2041,"2041-05-07","석가탄신일"]
[null,null,2041,"2041-09-09","추석"]
[null,null,2041,"2041-09-10","추석"]
[null,null,2041,"2041-09-11","추석"]
[null,null,2042,"2042-01-21","설날"]
[null,null,2042,"2042-01-22","설날"]
[null,null,2042,"2042-01-23","설날"]
[null,null,2042,"2042-05-26","석가탄신일"]
[null,null,2042,"2042-09-27","추석"]
[null,null,2042,"2042-09-28","추석"]
[null,null,2042,"2042-09-29","추석"]
[null,null,2043,"2043-02-09","설날"]
[null,null,2043,"2043-02-10","설날"]
[null,null,2043,"2043-02-11","설날"]
[null,null,2043,"2043-05-16","석가탄신일"]
[null,null,2043,"2043-09-16","추석"]
[null,null,2043,"2043-09-17","추석"]
[null,null,2043,"2043-09-18","추석"]
[null,null,2044,"2044-01-29","설날"]
[null,null,2044,"2044-01-30","설날"]
[null,null,2044,"2044-01-31","설날"]
[null,null,2044,"2044-05-05","석가탄신일"]
[null,null,2044,"2044-10-04","추석"]
[null,null,2044,"2044-10-05","추석"]
[null,null,2044,"2044-10-06","추석"]
[null,null,2045,"2045-02-16","설날"]
[null,null,2045,"2045-02-17","설날"]
[null,null,2045,"2045-02-18","설날"]
[null,null,2045,"2045-05-24","석가탄신일"]
[null,null,2045,"2045-09-24","추석"]
[null,null,2045,"2045-09-25","추석"]
[null,null,2045,"2045-09-26","추석"]
[null,null,2046,"2046-02-05","설날"]
[null,null,2046,"2046-02-06","설날"]
[null,null,2046,"2046-02-07","설날"]
[null,null,2046,"2046-05-13","석가탄신일"]
[null,null,2046,"2046-09-14","추석"]
[null,null,{"$f":"YEAR(D259)","v":2046},"2046-09-15","추석"]
[null,null,2046,"2046-09-16","추석"]
[null,null,2047,"2047-01-25","설날"]
[null,null,2047,"2047-01-26","설날"]
[null,null,2047,"2047-01-27","설날"]
[null,null,2047,"2047-05-02","석가탄신일"]
[null,null,2047,"2047-10-04","추석"]
[null,null,2047,"2047-10-05","추석"]
[null,null,2048,"2048-02-13","설날"]
[null,null,2048,"2048-02-14","설날"]
[null,null,2048,"2048-02-15","설날"]
[null,null,2048,"2048-05-20","석가탄신일"]
[null,null,2048,"2048-09-21","추석"]
[null,null,2048,"2048-09-22","추석"]
[null,null,2048,"2048-09-23","추석"]
[null,null,2049,"2049-02-01","설날"]
[null,null,2049,"2049-02-02","설날"]
[null,null,2049,"2049-02-03","설날"]
[null,null,2049,"2049-05-09","석가탄신일"]
[null,null,2049,"2049-09-10","추석"]
[null,null,2049,"2049-09-11","추석"]
[null,null,2049,"2049-09-12","추석"]
[null,null,2050,"2050-01-22","설날"]
[null,null,2050,"2050-01-23","설날"]
[null,null,2050,"2050-01-24","설날"]
[null,null,2050,"2050-05-28","석가탄신일"]
[null,null,2050,"2050-09-29","추석"]
[null,null,2050,"2050-09-30","추석"]
[null,null,2050,"2050-10-01","추석"]
[null,null,2051,"2051-02-10","설날"]
[null,null,2051,"2051-02-11","설날"]
[null,null,2051,"2051-02-12","설날"]
[null,null,2051,"2051-05-17","석가탄신일"]
[null,null,2051,"2051-09-18","추석"]
[null,null,2051,"2051-09-19","추석"]
[null,null,2051,"2051-09-20","추석"]
[null,null,2052,"2052-01-31","설날"]
[null,null,2052,"2052-02-01","설날"]
[null,null,2052,"2052-02-02","설날"]
[null,null,2052,"2052-05-06","석가탄신일"]
[null,null,2052,"2052-09-06","추석"]
[null,null,2052,"2052-09-07","추석"]
[null,null,2052,"2052-09-08","추석"]
[null,null,2053,"2053-02-18","설날"]
[null,null,2053,"2053-02-19","설날"]
[null,null,2053,"2053-02-20","설날"]
[null,null,2053,"2053-05-25","석가탄신일"]
[null,null,2053,"2053-09-25","추석"]
[null,null,2053,"2053-09-26","추석"]
[null,null,2053,"2053-09-27","추석"]
[null,null,2054,"2054-02-07","설날"]
[null,null,2054,"2054-02-08","설날"]
[null,null,2054,"2054-02-09","설날"]
[null,null,2054,"2054-05-15","석가탄신일"]
[null,null,2054,"2054-09-15","추석"]
[null,null,2054,"2054-09-16","추석"]
[null,null,2054,"2054-09-17","추석"]
[null,null,2055,"2055-01-27","설날"]
[null,null,2055,"2055-01-28","설날"]
[null,null,2055,"2055-01-29","설날"]
[null,null,2055,"2055-05-04","석가탄신일"]
[null,null,2055,"2055-10-04","추석"]
[null,null,2055,"2055-10-05","추석"]
[null,null,2055,"2055-10-06","추석"]
[null,null,{"$f":"YEAR(D323)","v":2056},"2056-02-14","설날"]
[null,null,2056,"2056-02-15","설날"]
[null,null,2056,"2056-02-16","설날"]
[null,null,2056,"2056-05-22","석가탄신일"]
[null,null,2056,"2056-09-23","추석"]
[null,null,2056,"2056-09-24","추석"]
[null,null,2056,"2056-09-25","추석"]
[null,null,2057,"2057-02-03","설날"]
[null,null,2057,"2057-02-04","설날"]
[null,null,2057,"2057-02-05","설날"]
[null,null,2057,"2057-05-11","석가탄신일"]
[null,null,2057,"2057-09-12","추석"]
[null,null,2057,"2057-09-13","추석"]
[null,null,2057,"2057-09-14","추석"]
[null,null,2058,"2058-01-23","설날"]
[null,null,2058,"2058-01-24","설날"]
[null,null,2058,"2058-01-25","설날"]
[null,null,2058,"2058-04-30","석가탄신일"]
[null,null,2058,"2058-10-01","추석"]
[null,null,2058,"2058-10-02","추석"]
[null,null,2058,"2058-10-03","추석"]
[null,null,2059,"2059-02-11","설날"]
[null,null,2059,"2059-02-12","설날"]
[null,null,2059,"2059-02-13","설날"]
[null,null,2059,"2059-05-19","석가탄신일"]
[null,null,2059,"2059-09-20","추석"]
[null,null,2059,"2059-09-21","추석"]
[null,null,2059,"2059-09-22","추석"]
[null,null,2060,"2060-02-01","설날"]
[null,null,2060,"2060-02-02","설날"]
[null,null,2060,"2060-02-03","설날"]
[null,null,2060,"2060-05-07","석가탄신일"]
[null,null,2060,"2060-09-08","추석"]
[null,null,2060,"2060-09-09","추석"]
[null,null,2060,"2060-09-10","추석"]
[null,null,2061,"2061-01-21","설날"]
[null,null,2061,"2061-01-22","설날"]
[null,null,2061,"2061-01-23","설날"]
[null,null,2061,"2061-05-26","석가탄신일"]
[null,null,2061,"2061-09-27","추석"]
[null,null,2061,"2061-09-28","추석"]
[null,null,2061,"2061-09-29","추석"]
[null,null,2062,"2062-02-08","설날"]
[null,null,2062,"2062-02-09","설날"]
[null,null,2062,"2062-02-10","설날"]
[null,null,2062,"2062-05-16","석가탄신일"]
[null,null,2062,"2062-09-16","추석"]
[null,null,2062,"2062-09-17","추석"]
[null,null,2062,"2062-09-18","추석"]
[null,null,2063,"2063-01-28","설날"]
[null,null,2063,"2063-01-29","설날"]
[null,null,2063,"2063-01-30","설날"]
[null,null,2063,"2063-05-06","석가탄신일"]
[null,null,2063,"2063-10-05","추석"]
[null,null,2063,"2063-10-06","추석"]
[null,null,2063,"2063-10-07","추석"]
[null,null,2064,"2064-02-16","설날"]
[null,null,2064,"2064-02-17","설날"]
[null,null,2064,"2064-02-18","설날"]
[null,null,2064,"2064-05-23","석가탄신일"]
[null,null,2064,"2064-09-24","추석"]
[null,null,2064,"2064-09-25","추석"]
[null,null,2064,"2064-09-26","추석"]
[null,null,2065,"2065-02-04","설날"]
[null,null,{"$f":"YEAR(D387)","v":2065},"2065-02-05","설날"]
[null,null,2065,"2065-02-06","설날"]
[null,null,2065,"2065-05-12","석가탄신일"]
[null,null,2065,"2065-09-14","추석"]
[null,null,2065,"2065-09-15","추석"]
[null,null,2065,"2065-09-16","추석"]
[null,null,2066,"2066-01-25","설날"]
[null,null,2066,"2066-01-26","설날"]
[null,null,2066,"2066-01-27","설날"]
[null,null,2066,"2066-05-01","석가탄신일"]
[null,null,2066,"2066-10-02","추석"]
[null,null,2066,"2066-10-03","추석"]
[null,null,2066,"2066-10-04","추석"]
[null,null,2067,"2067-02-13","설날"]
[null,null,2067,"2067-02-14","설날"]
[null,null,2067,"2067-02-15","설날"]
[null,null,2067,"2067-05-20","석가탄신일"]
[null,null,2067,"2067-09-22","추석"]
[null,null,2067,"2067-09-23","추석"]
[null,null,2067,"2067-09-24","추석"]
[null,null,2068,"2068-02-02","설날"]
[null,null,2068,"2068-02-03","설날"]
[null,null,2068,"2068-02-04","설날"]
[null,null,2068,"2068-05-09","석가탄신일"]
[null,null,2068,"2068-09-10","추석"]
[null,null,2068,"2068-09-11","추석"]
[null,null,2068,"2068-09-12","추석"]
[null,null,2069,"2069-01-22","설날"]
[null,null,2069,"2069-01-23","설날"]
[null,null,2069,"2069-01-24","설날"]
[null,null,2069,"2069-04-28","석가탄신일"]
[null,null,2069,"2069-09-28","추석"]
[null,null,2069,"2069-09-29","추석"]
[null,null,2069,"2069-09-30","추석"]
[null,null,2070,"2070-02-10","설날"]
[null,null,2070,"2070-02-11","설날"]
[null,null,2070,"2070-02-12","설날"]
[null,null,2070,"2070-05-17","석가탄신일"]
[null,null,2070,"2070-09-18","추석"]
[null,null,2070,"2070-09-19","추석"]
[null,null,2070,"2070-09-20","추석"]
[null,null,2071,"2071-01-30","설날"]
[null,null,2071,"2071-01-31","설날"]
[null,null,2071,"2071-02-01","설날"]
[null,null,2071,"2071-05-07","석가탄신일"]
[null,null,2071,"2071-09-07","추석"]
[null,null,2071,"2071-09-08","추석"]
[null,null,2071,"2071-09-09","추석"]
[null,null,2072,"2072-02-18","설날"]
[null,null,2072,"2072-02-19","설날"]
[null,null,2072,"2072-02-20","설날"]
[null,null,2072,"2072-05-25","석가탄신일"]
[null,null,2072,"2072-09-25","추석"]
[null,null,2072,"2072-09-26","추석"]
[null,null,2072,"2072-09-27","추석"]
[null,null,2073,"2073-02-06","설날"]
[null,null,2073,"2073-02-07","설날"]
[null,null,2073,"2073-02-08","설날"]
[null,null,2073,"2073-05-14","석가탄신일"]
[null,null,2073,"2073-09-15","추석"]
[null,null,2073,"2073-09-16","추석"]
[null,null,2073,"2073-09-17","추석"]
[null,null,2074,"2074-01-26","설날"]
[null,null,2074,"2074-01-27","설날"]
[null,null,{"$f":"YEAR(D451)","v":2074},"2074-01-28","설날"]
[null,null,2074,"2074-05-03","석가탄신일"]
[null,null,2074,"2074-10-04","추석"]
[null,null,2074,"2074-10-05","추석"]
[null,null,2074,"2074-10-06","추석"]
[null,null,2075,"2075-02-14","설날"]
[null,null,2075,"2075-02-15","설날"]
[null,null,2075,"2075-02-16","설날"]
[null,null,2075,"2075-05-22","석가탄신일"]
[null,null,2075,"2075-09-23","추석"]
[null,null,2075,"2075-09-24","추석"]
[null,null,2075,"2075-09-25","추석"]
[null,null,2076,"2076-02-04","설날"]
[null,null,2076,"2076-02-05","설날"]
[null,null,2076,"2076-02-06","설날"]
[null,null,2076,"2076-05-10","석가탄신일"]
[null,null,2076,"2076-09-11","추석"]
[null,null,2076,"2076-09-12","추석"]
[null,null,2076,"2076-09-13","추석"]
[null,null,2077,"2077-01-23","설날"]
[null,null,2077,"2077-01-24","설날"]
[null,null,2077,"2077-01-25","설날"]
[null,null,2077,"2077-04-30","석가탄신일"]
[null,null,2077,"2077-09-30","추석"]
[null,null,2077,"2077-10-01","추석"]
[null,null,2077,"2077-10-02","추석"]
[null,null,2078,"2078-02-11","설날"]
[null,null,2078,"2078-02-12","설날"]
[null,null,2078,"2078-02-13","설날"]
[null,null,2078,"2078-05-19","석가탄신일"]
[null,null,2078,"2078-09-19","추석"]
[null,null,2078,"2078-09-20","추석"]
[null,null,2078,"2078-09-21","추석"]
[null,null,2079,"2079-02-01","설날"]
[null,null,2079,"2079-02-02","설날"]
[null,null,2079,"2079-02-03","설날"]
[null,null,2079,"2079-05-08","석가탄신일"]
[null,null,2079,"2079-09-09","추석"]
[null,null,2079,"2079-09-10","추석"]
[null,null,2079,"2079-09-11","추석"]
[null,null,2080,"2080-01-21","설날"]
[null,null,2080,"2080-01-22","설날"]
[null,null,2080,"2080-01-23","설날"]
[null,null,2080,"2080-05-26","석가탄신일"]
[null,null,2080,"2080-09-27","추석"]
[null,null,2080,"2080-09-28","추석"]
[null,null,2080,"2080-09-29","추석"]
[null,null,2081,"2081-02-08","설날"]
[null,null,2081,"2081-02-09","설날"]
[null,null,2081,"2081-02-10","설날"]
[null,null,2081,"2081-05-16","석가탄신일"]
[null,null,2081,"2081-09-16","추석"]
[null,null,2081,"2081-09-17","추석"]
[null,null,2081,"2081-09-18","추석"]
[null,null,2082,"2082-01-28","설날"]
[null,null,2082,"2082-01-29","설날"]
[null,null,2082,"2082-01-30","설날"]
[null,null,2082,"2082-05-05","석가탄신일"]
[null,null,2082,"2082-10-05","추석"]
[null,null,2082,"2082-10-06","추석"]
[null,null,2082,"2082-10-07","추석"]
[null,null,2083,"2083-02-16","설날"]
[null,null,2083,"2083-02-17","설날"]
[null,null,2083,"2083-02-18","설날"]
[null,null,{"$f":"YEAR(D515)","v":2083},"2083-05-24","석가탄신일"]
[null,null,2083,"2083-09-25","추석"]
[null,null,2083,"2083-09-26","추석"]
[null,null,2083,"2083-09-27","추석"]
[null,null,2084,"2084-02-05","설날"]
[null,null,2084,"2084-02-06","설날"]
[null,null,2084,"2084-02-07","설날"]
[null,null,2084,"2084-05-12","석가탄신일"]
[null,null,2084,"2084-09-13","추석"]
[null,null,2084,"2084-09-14","추석"]
[null,null,2084,"2084-09-15","추석"]
[null,null,2085,"2085-01-25","설날"]
[null,null,2085,"2085-01-26","설날"]
[null,null,2085,"2085-01-27","설날"]
[null,null,2085,"2085-05-01","석가탄신일"]
[null,null,2085,"2085-10-02","추석"]
[null,null,2085,"2085-10-03","추석"]
[null,null,2085,"2085-10-04","추석"]
[null,null,2086,"2086-02-13","설날"]
[null,null,2086,"2086-02-14","설날"]
[null,null,2086,"2086-02-15","설날"]
[null,null,2086,"2086-05-20","석가탄신일"]
[null,null,2086,"2086-09-21","추석"]
[null,null,2086,"2086-09-22","추석"]
[null,null,2086,"2086-09-23","추석"]
[null,null,2087,"2087-02-02","설날"]
[null,null,2087,"2087-02-03","설날"]
[null,null,2087,"2087-02-04","설날"]
[null,null,2087,"2087-05-10","석가탄신일"]
[null,null,2087,"2087-09-10","추석"]
[null,null,2087,"2087-09-11","추석"]
[null,null,2087,"2087-09-12","추석"]
[null,null,2088,"2088-01-23","설날"]
[null,null,2088,"2088-01-24","설날"]
[null,null,2088,"2088-01-25","설날"]
[null,null,2088,"2088-04-28","석가탄신일"]
[null,null,2088,"2088-09-28","추석"]
[null,null,2088,"2088-09-29","추석"]
[null,null,2088,"2088-09-30","추석"]
[null,null,2089,"2089-02-10","설날"]
[null,null,2089,"2089-02-11","설날"]
[null,null,2089,"2089-02-12","설날"]
[null,null,2089,"2089-05-17","석가탄신일"]
[null,null,2089,"2089-09-18","추석"]
[null,null,2089,"2089-09-19","추석"]
[null,null,2089,"2089-09-20","추석"]
[null,null,2090,"2090-01-29","설날"]
[null,null,2090,"2090-01-30","설날"]
[null,null,2090,"2090-01-31","설날"]
[null,null,2090,"2090-05-07","석가탄신일"]
[null,null,2090,"2090-09-07","추석"]
[null,null,2090,"2090-09-08","추석"]
[null,null,2090,"2090-09-09","추석"]
[null,null,2091,"2091-02-17","설날"]
[null,null,2091,"2091-02-18","설날"]
[null,null,2091,"2091-02-19","설날"]
[null,null,2091,"2091-05-25","석가탄신일"]
[null,null,2091,"2091-09-26","추석"]
[null,null,2091,"2091-09-27","추석"]
[null,null,2091,"2091-09-28","추석"]
[null,null,2092,"2092-02-06","설날"]
[null,null,2092,"2092-02-07","설날"]
[null,null,2092,"2092-02-08","설날"]
[null,null,2092,"2092-05-13","석가탄신일"]
[null,null,{"$f":"YEAR(D579)","v":2092},"2092-09-15","추석"]
[null,null,2092,"2092-09-16","추석"]
[null,null,2092,"2092-09-17","추석"]
[null,null,2093,"2093-01-26","설날"]
[null,null,2093,"2093-01-27","설날"]
[null,null,2093,"2093-01-28","설날"]
[null,null,2093,"2093-05-03","석가탄신일"]
[null,null,2093,"2093-10-04","추석"]
[null,null,2093,"2093-10-05","추석"]
[null,null,2093,"2093-10-06","추석"]
[null,null,2094,"2094-02-14","설날"]
[null,null,2094,"2094-02-15","설날"]
[null,null,2094,"2094-02-16","설날"]
[null,null,2094,"2094-05-21","석가탄신일"]
[null,null,2094,"2094-09-23","추석"]
[null,null,2094,"2094-09-24","추석"]
[null,null,2094,"2094-09-25","추석"]
[null,null,2095,"2095-02-04","설날"]
[null,null,2095,"2095-02-05","설날"]
[null,null,2095,"2095-02-06","설날"]
[null,null,2095,"2095-05-11","석가탄신일"]
[null,null,2095,"2095-09-12","추석"]
[null,null,2095,"2095-09-13","추석"]
[null,null,2095,"2095-09-14","추석"]
[null,null,2096,"2096-01-24","설날"]
[null,null,2096,"2096-01-25","설날"]
[null,null,2096,"2096-01-26","설날"]
[null,null,2096,"2096-04-30","석가탄신일"]
[null,null,2096,"2096-09-30","추석"]
[null,null,2096,"2096-10-01","추석"]
[null,null,2096,"2096-10-02","추석"]
[null,null,2097,"2097-02-11","설날"]
[null,null,2097,"2097-02-12","설날"]
[null,null,2097,"2097-02-13","설날"]
[null,null,2097,"2097-05-19","석가탄신일"]
[null,null,2097,"2097-09-19","추석"]
[null,null,2097,"2097-09-20","추석"]
[null,null,2097,"2097-09-21","추석"]
[null,null,2098,"2098-01-31","설날"]
[null,null,2098,"2098-02-01","설날"]
[null,null,2098,"2098-02-02","설날"]
[null,null,2098,"2098-05-08","석가탄신일"]
[null,null,2098,"2098-09-09","추석"]
[null,null,2098,"2098-09-10","추석"]
[null,null,2098,"2098-09-11","추석"]
[null,null,2099,"2099-01-20","설날"]
[null,null,2099,"2099-01-21","설날"]
[null,null,2099,"2099-01-22","설날"]
[null,null,2099,"2099-05-27","석가탄신일"]
[null,null,2099,"2099-09-28","추석"]
[null,null,2099,"2099-09-29","추석"]
[null,null,2099,"2099-09-30","추석"]
[null,null,2100,"2100-02-08","설날"]
[null,null,2100,"2100-02-09","설날"]
[null,null,2100,"2100-02-10","설날"]
[null,null,2100,"2100-05-16","석가탄신일"]
[null,null,2100,"2100-09-17","추석"]
[null,null,2100,"2100-09-18","추석"]
[null,null,2100,"2100-09-19","추석"]