{"text_format":"1","workbook":"xlsx","n_sheets":9,"sheets":["사용안내","연간","달력","색상","일정","공휴일","디데이","미니달력","이름지정"],"not_rendered":{"charts":0,"images":9,"macros":1,"external_links":0,"defined_names":28,"comments":4,"pivot_tables":0},"unopened":[],"bounds":{"document_bytes":16777216,"sheet_cells":100000,"rows_first":2000,"rows_last":500,"rows_between":2000,"halvings":0,"cell_chars":16384,"cell_head_chars":4096},"cells_cut":0,"cells_raw":0,"read":"whole","date_system":"1900"}

{"sheet":"사용안내","index":0,"n_rows":31,"n_cols":7,"rows_kept":31,"cut":false,"hidden":false,"merged":[[0,1,0,10],[17,1,17,10],[6,1,6,5],[6,6,6,10],[7,1,7,5],[8,1,8,5],[9,1,9,5],[10,1,10,5],[2,1,2,10],[3,1,3,10],[4,1,4,10],[7,6,7,10],[8,6,8,10],[9,6,9,10],[10,6,10,10],[11,6,11,10],[30,6,30,8],[28,1,28,10],[29,1,29,10],[13,1,13,10],[14,1,14,10],[15,1,15,10],[20,1,20,10],[22,1,22,10],[23,1,23,10],[24,1,24,10],[25,1,25,10],[27,1,27,10],[19,1,19,10],[18,1,18,10]]}
[null,"탭다 엑셀 양식 사용 안내"]
[]
[null,"탭다 블로그 내 엑셀 양식은"]
[null,"사용 범위를 준수할 경우 모두 무료입니다. "]
[null,"금지 사항 적발 시 관련법에 의거 제재 및 법적 처벌을 받을 수 있습니다."]
[]
[null,"O",null,null,null,null,"X"]
[null,"개인적 비상업적 용도의 사용",null,null,null,null,"디자인 무단 도용 및 판매 금지"]
[null,"온라인 및 오프라인 이용 가능",null,null,null,null,"재배포(개인적, 비상업적 용도라도) 금지"]
[null,"회사원 개인의 회사 내부 보고, 제출, 공유용",null,null,null,null,"외부 유출, 대외적 게시 금지"]
{"$rows_left_out":22}
{"sheet":"연간","index":1,"n_rows":32,"n_cols":32,"rows_kept":32,"cut":false,"hidden":false,"merged":[[1,14,1,18]]}
[]
[null,"S",null,null,null,null,null,null,null,null,null,null,null,null,2024]
[]
[null,null,null,null,1,null,null,null,null,null,null,null,2,null,null,null,null,null,null,null,3,null,null,null,null,null,null,null,4]
[]
[null,{"$f":"IF($B$2=\"S\",\"S\",IF($B$2=\"M\",\"M\"))","v":"S"},{"$f":"IF($B$2=\"S\",\"M\",IF($B$2=\"M\",\"T\"))","v":"M"},{"$f":"IF($B$2=\"S\",\"T\",IF($B$2=\"M\",\"W\"))","v":"T"},{"$f":"IF($B$2=\"S\",\"W\",IF($B$2=\"M\",\"T\"))","v":"W"},{"$f":"IF($B$2=\"S\",\"T\",IF($B$2=\"M\",\"F\"))","v":"T"},{"$f":"IF($B$2=\"S\",\"F\",IF($B$2=\"M\",\"S\"))","v":"F"},"S",null,{"$f":"IF($B$2=\"S\",\"S\",IF($B$2=\"M\",\"M\"))","v":"S"},{"$f":"IF($B$2=\"S\",\"M\",IF($B$2=\"M\",\"T\"))","v":"M"},{"$f":"IF($B$2=\"S\",\"T\",IF($B$2=\"M\",\"W\"))","v":"T"},{"$f":"IF($B$2=\"S\",\"W\",IF($B$2=\"M\",\"T\"))","v":"W"},{"$f":"IF($B$2=\"S\",\"T\",IF($B$2=\"M\",\"F\"))","v":"T"},{"$f":"IF($B$2=\"S\",\"F\",IF($B$2=\"M\",\"S\"))","v":"F"},"S",null,{"$f":"IF($B$2=\"S\",\"S\",IF($B$2=\"M\",\"M\"))","v":"S"},{"$f":"IF($B$2=\"S\",\"M\",IF($B$2=\"M\",\"T\"))","v":"M"},{"$f":"IF($B$2=\"S\",\"T\",IF($B$2=\"M\",\"W\"))","v":"T"},{"$f":"IF($B$2=\"S\",\"W\",IF($B$2=\"M\",\"T\"))","v":"W"},{"$f":"IF($B$2=\"S\",\"T\",IF($B$2=\"M\",\"F\"))","v":"T"},{"$f":"IF($B$2=\"S\",\"F\",IF($B$2=\"M\",\"S\"))","v":"F"},"S",null,{"$f":"IF($B$2=\"S\",\"S\",IF($B$2=\"M\",\"M\"))","v":"S"},{"$f":"IF($B$2=\"S\",\"M\",IF($B$2=\"M\",\"T\"))","v":"M"},{"$f":"IF($B$2=\"S\",\"T\",IF($B$2=\"M\",\"W\"))","v":"T"},{"$f":"IF($B$2=\"S\",\"W\",IF($B$2=\"M\",\"T\"))","v":"W"},{"$f":"IF($B$2=\"S\",\"T\",IF($B$2=\"M\",\"F\"))","v":"T"},{"$f":"IF($B$2=\"S\",\"F\",IF($B$2=\"M\",\"S\"))","v":"F"},"S"]
[null,{"$f":"IF(B2=\"M\",(IF(DAY(DATE($O$2,$E$4,1)-WEEKDAY(DATE($O$2,$E$4,1))+2)=2,DATE($O$2,$E$4,1)-WEEKDAY(DATE($O$2,$E$4,1))-5,DATE($O$2,$E$4,1)-WEEKDAY(DATE($O$2,$E$4,1))+2)),IF(B2=\"S\",DATE($O$2,$E$4,1)-WEEKDAY(DATE($O$2,$E$4,1))+1))","v":"2023-12-31"},{"$f":"B7+1","v":"2024-01-01"},"2024-01-02","2024-01-03","2024-01-04","2024-01-05","2024-01-06",null,{"$f":"IF(B2=\"M\",(IF(DAY(DATE($O$2,$M$4,1)-WEEKDAY(DATE($O$2,$M$4,1))+2)=2,DATE($O$2,$M$4,1)-WEEKDAY(DATE($O$2,$M$4,1))-5,DATE($O$2,$M$4,1)-WEEKDAY(DATE($O$2,$M$4,1))+2)),IF(B2=\"S\",DATE($O$2,$M$4,1)-WEEKDAY(DATE($O$2,$M$4,1))+1))","v":"2024-01-28"},{"$f":"J7+1","v":"2024-01-29"},"2024-01-30","2024-01-31","2024-02-01","2024-02-02","2024-02-03",null,{"$f":"IF(B2=\"M\",(IF(DAY(DATE($O$2,$U$4,1)-WEEKDAY(DATE($O$2,$U$4,1))+2)=2,DATE($O$2,$U$4,1)-WEEKDAY(DATE($O$2,$U$4,1))-5,DATE($O$2,$U$4,1)-WEEKDAY(DATE($O$2,$U$4,1))+2)),IF(B2=\"S\",DATE($O$2,$U$4,1)-WEEKDAY(DATE($O$2,$U$4,1))+1))","v":"2024-02-25"},{"$f":"R7+1","v":"2024-02-26"},"2024-02-27","2024-02-28","2024-02-29","2024-03-01","2024-03-02",null,{"$f":"IF(B2=\"M\",(IF(DAY(DATE($O$2,$AC$4,1)-WEEKDAY(DATE($O$2,$AC$4,1))+2)=2,DATE($O$2,$AC$4,1)-WEEKDAY(DATE($O$2,$AC$4,1))-5,DATE($O$2,$AC$4,1)-WEEKDAY(DATE($O$2,$AC$4,1))+2)),IF(B2=\"S\",DATE($O$2,$AC$4,1)-WEEKDAY(DATE($O$2,$AC$4,1))+1))","v":"2024-03-31"},{"$f":"Z7+1","v":"2024-04-01"},"2024-04-02","2024-04-03","2024-04-04","2024-04-05","2024-04-06"]
[null,{"$f":"B7+7","v":"2024-01-07"},{"$f":"C7+7","v":"2024-01-08"},"2024-01-09","2024-01-10","2024-01-11","2024-01-12","2024-01-13",null,{"$f":"J7+7","v":"2024-02-04"},"2024-02-05","2024-02-06","2024-02-07","2024-02-08","2024-02-09","2024-02-10",null,{"$f":"R7+7","v":"2024-03-03"},"2024-03-04","2024-03-05","2024-03-06","2024-03-07","2024-03-08","2024-03-09",null,{"$f":"Z7+7","v":"2024-04-07"},"2024-04-08","2024-04-09","2024-04-10","2024-04-11","2024-04-12","2024-04-13"]
[null,{"$f":"B8+7","v":"2024-01-14"},"2024-01-15","2024-01-16","2024-01-17","2024-01-18","2024-01-19","2024-01-20",null,"2024-02-11","2024-02-12","2024-02-13","2024-02-14","2024-02-15","2024-02-16","2024-02-17",null,"2024-03-10","2024-03-11","2024-03-12","2024-03-13","2024-03-14","2024-03-15","2024-03-16",null,"2024-04-14","2024-04-15","2024-04-16","2024-04-17","2024-04-18","2024-04-19","2024-04-20"]
[null,{"$f":"B9+7","v":"2024-01-21"},"2024-01-22","2024-01-23","2024-01-24","2024-01-25","2024-01-26","2024-01-27",null,"2024-02-18","2024-02-19","2024-02-20","2024-02-21","2024-02-22","2024-02-23","2024-02-24",null,"2024-03-17","2024-03-18","2024-03-19","2024-03-20","2024-03-21","2024-03-22","2024-03-23",null,"2024-04-21","2024-04-22","2024-04-23","2024-04-24","2024-04-25","2024-04-26","2024-04-27"]
{"$rows_left_out":23}
{"sheet":"달력","index":2,"n_rows":4948,"n_cols":20,"rows_kept":4948,"cut":false,"hidden":false,"merged":[[52,1,52,2],[51,1,51,2],[50,1,50,2],[49,1,49,2],[52,9,52,10],[51,9,51,10],[50,9,50,10],[49,9,49,10],[49,7,49,8],[50,7,50,8],[51,7,51,8],[52,7,52,8],[52,5,52,6],[51,5,51,6],[50,5,50,6],[49,5,49,6],[49,13,49,14],[49,11,49,12],[50,11,50,12],[51,11,51,12],[52,11,52,12],[49,3,49,4],[50,3,50,4],[51,3,51,4],[52,3,52,4],[14,3,14,4],[14,5,14,6],[14,7,14,8],[14,9,14,10],[14,11,14,12],[14,13,14,14],[12,1,12,2],[12,3,12,4],[2,1,4,2],[12,11,12,12],[12,9,12,10],[12,13,12,14],[12,5,12,6],[12,7,12,8],[2,9,2,14],[3,9,3,14],[4,9,4,14],[3,3,4,3],[14,1,14,2],[7,1,7,8],[8,1,8,8],[9,1,9,8],[10,1,10,8],[15,13,15,14],[16,1,16,2],[16,3,16,4],[16,5,16,6],[16,7,16,8],[16,9,16,10],[16,11,16,12],[16,13,16,14],[15,1,15,2],[15,3,15,4],[15,5,15,6],[15,7,15,8],[15,9,15,10],[15,11,15,12],[17,13,17,14],[18,1,18,2],[18,3,18,4],[18,5,18,6],[18,7,18,8],[18,9,18,10],[18,11,18,12],[18,13,18,14],[17,1,17,2],[17,3,17,4],[17,5,17,6],[17,7,17,8],[17,9,17,10],[17,11,17,12],[23,3,23,4],[23,5,23,6],[23,7,23,8],[23,9,23,10],[23,11,23,12],[21,13,21,14],[22,1,22,2],[22,3,22,4],[22,5,22,6],[22,7,22,8],[22,9,22,10],[22,11,22,12],[22,13,22,14],[21,1,21,2],[21,3,21,4],[21,5,21,6],[21,7,21,8],[21,9,21,10],[21,11,21,12],[28,1,28,2],[28,3,28,4],[28,5,28,6],[28,7,28,8],[28,9,28,10],[28,11,28,12],[28,13,28,14],[25,1,25,2],[25,3,25,4],[25,5,25,6],[25,7,25,8],[25,9,25,10],[25,11,25,12],[29,13,29,14],[30,1,30,2],[30,3,30,4],[30,5,30,6],[30,7,30,8],[30,9,30,10],[30,11,30,12],[30,13,30,14],[29,1,29,2],[29,3,29,4],[29,5,29,6],[29,7,29,8],[29,9,29,10],[29,11,29,12],[31,13,31,14],[32,1,32,2],[32,3,32,4],[32,5,32,6],[32,7,32,8],[32,9,32,10],[32,11,32,12],[32,13,32,14],[31,1,31,2],[31,3,31,4],[31,5,31,6],[31,7,31,8],[31,9,31,10],[31,11,31,12],[37,3,37,4],[37,5,37,6],[37,7,37,8],[37,9,37,10],[37,11,37,12],[35,13,35,14],[36,1,36,2],[36,3,36,4],[36,5,36,6],[36,7,36,8],[36,9,36,10],[36,11,36,12],[36,13,36,14],[35,1,35,2],[35,3,35,4],[35,5,35,6],[35,7,35,8],[35,9,35,10],[35,11,35,12],[42,1,42,2],[42,3,42,4],[42,5,42,6],[42,7,42,8],[42,9,42,10],[42,11,42,12],[42,13,42,14],[39,1,39,2],[39,3,39,4],[39,5,39,6],[39,7,39,8],[39,9,39,10],[39,11,39,12],[43,13,43,14],[44,1,44,2],[44,3,44,4],[44,5,44,6],[44,7,44,8],[44,9,44,10],[44,11,44,12],[44,13,44,14],[43,1,43,2],[43,3,43,4],[43,5,43,6],[43,7,43,8],[43,9,43,10],[43,11,43,12],[45,13,45,14],[46,1,46,2],[46,3,46,4],[46,5,46,6],[46,7,46,8],[46,9,46,10],[46,11,46,12],[46,13,46,14],[45,1,45,2],[45,3,45,4],[45,5,45,6],[45,7,45,8],[45,9,45,10],[45,11,45,12],[19,1,19,2],[19,3,19,4],[19,5,19,6],[19,7,19,8],[19,9,19,10],[19,11,19,12],[19,13,19,14],[26,1,26,2],[26,3,26,4],[26,5,26,6],[26,7,26,8],[26,9,26,10],[26,11,26,12],[26,13,26,14],[25,13,25,14],[23,13,23,14],[24,1,24,2],[24,3,24,4],[24,5,24,6],[24,7,24,8],[24,9,24,10],[24,11,24,12],[24,13,24,14],[23,1,23,2],[33,1,33,2],[33,3,33,4],[33,5,33,6],[33,7,33,8],[33,9,33,10],[33,11,33,12],[33,13,33,14],[40,1,40,2],[40,3,40,4],[40,5,40,6],[40,7,40,8],[40,9,40,10],[40,11,40,12],[40,13,40,14],[39,13,39,14],[37,13,37,14],[38,1,38,2],[38,3,38,4],[38,5,38,6],[38,7,38,8],[38,9,38,10],[38,11,38,12],[38,13,38,14],[37,1,37,2],[47,1,47,2],[47,3,47,4],[47,5,47,6],[47,7,47,8],[47,9,47,10],[47,11,47,12],[47,13,47,14],[54,1,54,2],[54,3,54,4],[54,5,54,6],[54,7,54,8],[54,9,54,10],[54,11,54,12],[54,13,54,14],[53,1,53,2],[53,3,53,4],[53,5,53,6],[53,7,53,8],[53,9,53,10],[53,11,53,12],[53,13,53,14],[52,13,52,14],[51,13,51,14],[50,13,50,14]]}
[]
[]
[null,3,null,{"$f":"연간!$O$2","v":2024}]
[null,null,null,{"$f":"TEXT(DATE(D3,B3,1),\"mmmm\")","v":"March"}]
[]
[]
[null,"MEMO",null,null,null,null,null,null,"MADE BY 엠키(tabda.tistory.com)"]
[]
[]
[]
{"$rows_left_out":4939}
{"sheet":"색상","index":3,"n_rows":42,"n_cols":14,"rows_kept":42,"cut":false,"hidden":true,"merged":[]}
[null,1,null,2,null,3,null,4,null,5,null,6,null,7]
[1,{"$f":"IF(MONTH(달력!C14)<>달력!$B$3,\"\",IF(VLOOKUP(달력!C14,일정!$B$4:$O$2001,4,0)=0,\"\",VLOOKUP(달력!C14,일정!$B$4:$O$2001,4,0)))","v":""},null,{"$f":"IF(MONTH(달력!E14)<>달력!$B$3,\"\",IF(VLOOKUP(달력!E14,일정!$B$4:$O$2001,4,0)=0,\"\",VLOOKUP(달력!E14,일정!$B$4:$O$2001,4,0)))","v":""},null,{"$f":"IF(MONTH(달력!G14)<>달력!$B$3,\"\",IF(VLOOKUP(달력!G14,일정!$B$4:$O$2001,4,0)=0,\"\",VLOOKUP(달력!G14,일정!$B$4:$O$2001,4,0)))","v":""},null,{"$f":"IF(MONTH(달력!I14)<>달력!$B$3,\"\",IF(VLOOKUP(달력!I14,일정!$B$4:$O$2001,4,0)=0,\"\",VLOOKUP(달력!I14,일정!$B$4:$O$2001,4,0)))","v":""},null,{"$f":"IF(MONTH(달력!K14)<>달력!$B$3,\"\",IF(VLOOKUP(달력!K14,일정!$B$4:$O$2001,4,0)=0,\"\",VLOOKUP(달력!K14,일정!$B$4:$O$2001,4,0)))","v":""},null,{"$f":"IF(MONTH(달력!M14)<>달력!$B$3,\"\",IF(VLOOKUP(달력!M14,일정!$B$4:$O$2001,4,0)=0,\"\",VLOOKUP(달력!M14,일정!$B$4:$O$2001,4,0)))","v":""},null,{"$f":"IF(MONTH(달력!O14)<>달력!$B$3,\"\",IF(VLOOKUP(달력!O14,일정!$B$4:$O$2001,4,0)=0,\"\",VLOOKUP(달력!O14,일정!$B$4:$O$2001,4,0)))","v":""}]
[2,{"$f":"IF(MONTH(달력!C14)<>달력!$B$3,\"\",IF(VLOOKUP(달력!C14,일정!$B$4:$O$2001,6,0)=0,\"\",VLOOKUP(달력!C14,일정!$B$4:$O$2001,6,0)))","v":""},null,{"$f":"IF(MONTH(달력!E14)<>달력!$B$3,\"\",IF(VLOOKUP(달력!E14,일정!$B$4:$O$2001,6,0)=0,\"\",VLOOKUP(달력!E14,일정!$B$4:$O$2001,6,0)))","v":""},null,{"$f":"IF(MONTH(달력!G14)<>달력!$B$3,\"\",IF(VLOOKUP(달력!G14,일정!$B$4:$O$2001,6,0)=0,\"\",VLOOKUP(달력!G14,일정!$B$4:$O$2001,6,0)))","v":""},null,{"$f":"IF(MONTH(달력!I14)<>달력!$B$3,\"\",IF(VLOOKUP(달력!I14,일정!$B$4:$O$2001,6,0)=0,\"\",VLOOKUP(달력!I14,일정!$B$4:$O$2001,6,0)))","v":""},null,{"$f":"IF(MONTH(달력!K14)<>달력!$B$3,\"\",IF(VLOOKUP(달력!K14,일정!$B$4:$O$2001,6,0)=0,\"\",VLOOKUP(달력!K14,일정!$B$4:$O$2001,6,0)))","v":""},null,{"$f":"IF(MONTH(달력!M14)<>달력!$B$3,\"\",IF(VLOOKUP(달력!M14,일정!$B$4:$O$2001,6,0)=0,\"\",VLOOKUP(달력!M14,일정!$B$4:$O$2001,6,0)))","v":""},null,{"$f":"IF(MONTH(달력!O14)<>달력!$B$3,\"\",IF(VLOOKUP(달력!O14,일정!$B$4:$O$2001,6,0)=0,\"\",VLOOKUP(달력!O14,일정!$B$4:$O$2001,6,0)))","v":""}]
[3,{"$f":"IF(MONTH(달력!C14)<>달력!$B$3,\"\",IF(VLOOKUP(달력!C14,일정!$B$4:$O$2001,8,0)=0,\"\",VLOOKUP(달력!C14,일정!$B$4:$O$2001,8,0)))","v":""},null,{"$f":"IF(MONTH(달력!E14)<>달력!$B$3,\"\",IF(VLOOKUP(달력!E14,일정!$B$4:$O$2001,8,0)=0,\"\",VLOOKUP(달력!E14,일정!$B$4:$O$2001,8,0)))","v":""},null,{"$f":"IF(MONTH(달력!G14)<>달력!$B$3,\"\",IF(VLOOKUP(달력!G14,일정!$B$4:$O$2001,8,0)=0,\"\",VLOOKUP(달력!G14,일정!$B$4:$O$2001,8,0)))","v":""},null,{"$f":"IF(MONTH(달력!I14)<>달력!$B$3,\"\",IF(VLOOKUP(달력!I14,일정!$B$4:$O$2001,8,0)=0,\"\",VLOOKUP(달력!I14,일정!$B$4:$O$2001,8,0)))","v":""},null,{"$f":"IF(MONTH(달력!K14)<>달력!$B$3,\"\",IF(VLOOKUP(달력!K14,일정!$B$4:$O$2001,8,0)=0,\"\",VLOOKUP(달력!K14,일정!$B$4:$O$2001,8,0)))","v":""},null,{"$f":"IF(MONTH(달력!M14)<>달력!$B$3,\"\",IF(VLOOKUP(달력!M14,일정!$B$4:$O$2001,8,0)=0,\"\",VLOOKUP(달력!M14,일정!$B$4:$O$2001,8,0)))","v":""},null,{"$f":"IF(MONTH(달력!O14)<>달력!$B$3,\"\",IF(VLOOKUP(달력!O14,일정!$B$4:$O$2001,8,0)=0,\"\",VLOOKUP(달력!O14,일정!$B$4:$O$2001,8,0)))","v":""}]
[4,{"$f":"IF(MONTH(달력!C14)<>달력!$B$3,\"\",IF(VLOOKUP(달력!C14,일정!$B$4:$O$2001,10,0)=0,\"\",VLOOKUP(달력!C14,일정!$B$4:$O$2001,10,0)))","v":""},null,{"$f":"IF(MONTH(달력!E14)<>달력!$B$3,\"\",IF(VLOOKUP(달력!E14,일정!$B$4:$O$2001,10,0)=0,\"\",VLOOKUP(달력!E14,일정!$B$4:$O$2001,10,0)))","v":""},null,{"$f":"IF(MONTH(달력!G14)<>달력!$B$3,\"\",IF(VLOOKUP(달력!G14,일정!$B$4:$O$2001,10,0)=0,\"\",VLOOKUP(달력!G14,일정!$B$4:$O$2001,10,0)))","v":""},null,{"$f":"IF(MONTH(달력!I14)<>달력!$B$3,\"\",IF(VLOOKUP(달력!I14,일정!$B$4:$O$2001,10,0)=0,\"\",VLOOKUP(달력!I14,일정!$B$4:$O$2001,10,0)))","v":""},null,{"$f":"IF(MONTH(달력!K14)<>달력!$B$3,\"\",IF(VLOOKUP(달력!K14,일정!$B$4:$O$2001,10,0)=0,\"\",VLOOKUP(달력!K14,일정!$B$4:$O$2001,10,0)))","v":""},null,{"$f":"IF(MONTH(달력!M14)<>달력!$B$3,\"\",IF(VLOOKUP(달력!M14,일정!$B$4:$O$2001,10,0)=0,\"\",VLOOKUP(달력!M14,일정!$B$4:$O$2001,10,0)))","v":""},null,{"$f":"IF(MONTH(달력!O14)<>달력!$B$3,\"\",IF(VLOOKUP(달력!O14,일정!$B$4:$O$2001,10,0)=0,\"\",VLOOKUP(달력!O14,일정!$B$4:$O$2001,10,0)))","v":""}]
[5,{"$f":"IF(MONTH(달력!C14)<>달력!$B$3,\"\",IF(VLOOKUP(달력!C14,일정!$B$4:$O$2001,12,0)=0,\"\",VLOOKUP(달력!C14,일정!$B$4:$O$2001,12,0)))","v":""},null,{"$f":"IF(MONTH(달력!E14)<>달력!$B$3,\"\",IF(VLOOKUP(달력!E14,일정!$B$4:$O$2001,12,0)=0,\"\",VLOOKUP(달력!E14,일정!$B$4:$O$2001,12,0)))","v":""},null,{"$f":"IF(MONTH(달력!G14)<>달력!$B$3,\"\",IF(VLOOKUP(달력!G14,일정!$B$4:$O$2001,12,0)=0,\"\",VLOOKUP(달력!G14,일정!$B$4:$O$2001,12,0)))","v":""},null,{"$f":"IF(MONTH(달력!I14)<>달력!$B$3,\"\",IF(VLOOKUP(달력!I14,일정!$B$4:$O$2001,12,0)=0,\"\",VLOOKUP(달력!I14,일정!$B$4:$O$2001,12,0)))","v":""},null,{"$f":"IF(MONTH(달력!K14)<>달력!$B$3,\"\",IF(VLOOKUP(달력!K14,일정!$B$4:$O$2001,12,0)=0,\"\",VLOOKUP(달력!K14,일정!$B$4:$O$2001,12,0)))","v":""},null,{"$f":"IF(MONTH(달력!M14)<>달력!$B$3,\"\",IF(VLOOKUP(달력!M14,일정!$B$4:$O$2001,12,0)=0,\"\",VLOOKUP(달력!M14,일정!$B$4:$O$2001,12,0)))","v":""},null,{"$f":"IF(MONTH(달력!O14)<>달력!$B$3,\"\",IF(VLOOKUP(달력!O14,일정!$B$4:$O$2001,12,0)=0,\"\",VLOOKUP(달력!O14,일정!$B$4:$O$2001,12,0)))","v":""}]
[6,{"$f":"IF(MONTH(달력!C14)<>달력!$B$3,\"\",IF(VLOOKUP(달력!C14,일정!$B$4:$O$2001,14,0)=0,\"\",VLOOKUP(달력!C14,일정!$B$4:$O$2001,14,0)))","v":""},null,{"$f":"IF(MONTH(달력!E14)<>달력!$B$3,\"\",IF(VLOOKUP(달력!E14,일정!$B$4:$O$2001,14,0)=0,\"\",VLOOKUP(달력!E14,일정!$B$4:$O$2001,14,0)))","v":""},null,{"$f":"IF(MONTH(달력!G14)<>달력!$B$3,\"\",IF(VLOOKUP(달력!G14,일정!$B$4:$O$2001,14,0)=0,\"\",VLOOKUP(달력!G14,일정!$B$4:$O$2001,14,0)))","v":""},null,{"$f":"IF(MONTH(달력!I14)<>달력!$B$3,\"\",IF(VLOOKUP(달력!I14,일정!$B$4:$O$2001,14,0)=0,\"\",VLOOKUP(달력!I14,일정!$B$4:$O$2001,14,0)))","v":""},null,{"$f":"IF(MONTH(달력!K14)<>달력!$B$3,\"\",IF(VLOOKUP(달력!K14,일정!$B$4:$O$2001,14,0)=0,\"\",VLOOKUP(달력!K14,일정!$B$4:$O$2001,14,0)))","v":""},null,{"$f":"IF(MONTH(달력!M14)<>달력!$B$3,\"\",IF(VLOOKUP(달력!M14,일정!$B$4:$O$2001,14,0)=0,\"\",VLOOKUP(달력!M14,일정!$B$4:$O$2001,14,0)))","v":""},null,{"$f":"IF(MONTH(달력!O14)<>달력!$B$3,\"\",IF(VLOOKUP(달력!O14,일정!$B$4:$O$2001,14,0)=0,\"\",VLOOKUP(달력!O14,일정!$B$4:$O$2001,14,0)))","v":""}]
[]
[1,{"$f":"IF(MONTH(달력!C21)<>달력!$B$3,\"\",IF(VLOOKUP(달력!C21,일정!$B$4:$O$2001,4,0)=0,\"\",VLOOKUP(달력!C21,일정!$B$4:$O$2001,4,0)))","v":""},null,{"$f":"IF(MONTH(달력!E21)<>달력!$B$3,\"\",IF(VLOOKUP(달력!E21,일정!$B$4:$O$2001,4,0)=0,\"\",VLOOKUP(달력!E21,일정!$B$4:$O$2001,4,0)))","v":""},null,{"$f":"IF(MONTH(달력!G21)<>달력!$B$3,\"\",IF(VLOOKUP(달력!G21,일정!$B$4:$O$2001,4,0)=0,\"\",VLOOKUP(달력!G21,일정!$B$4:$O$2001,4,0)))","v":""},null,{"$f":"IF(MONTH(달력!I21)<>달력!$B$3,\"\",IF(VLOOKUP(달력!I21,일정!$B$4:$O$2001,4,0)=0,\"\",VLOOKUP(달력!I21,일정!$B$4:$O$2001,4,0)))","v":""},null,{"$f":"IF(MONTH(달력!K21)<>달력!$B$3,\"\",IF(VLOOKUP(달력!K21,일정!$B$4:$O$2001,4,0)=0,\"\",VLOOKUP(달력!K21,일정!$B$4:$O$2001,4,0)))","v":""},null,{"$f":"IF(MONTH(달력!M21)<>달력!$B$3,\"\",IF(VLOOKUP(달력!M21,일정!$B$4:$O$2001,4,0)=0,\"\",VLOOKUP(달력!M21,일정!$B$4:$O$2001,4,0)))","v":""},null,{"$f":"IF(MONTH(달력!O21)<>달력!$B$3,\"\",IF(VLOOKUP(달력!O21,일정!$B$4:$O$2001,4,0)=0,\"\",VLOOKUP(달력!O21,일정!$B$4:$O$2001,4,0)))","v":""}]
[2,{"$f":"IF(MONTH(달력!C21)<>달력!$B$3,\"\",IF(VLOOKUP(달력!C21,일정!$B$4:$O$2001,6,0)=0,\"\",VLOOKUP(달력!C21,일정!$B$4:$O$2001,6,0)))","v":""},null,{"$f":"IF(MONTH(달력!E21)<>달력!$B$3,\"\",IF(VLOOKUP(달력!E21,일정!$B$4:$O$2001,6,0)=0,\"\",VLOOKUP(달력!E21,일정!$B$4:$O$2001,6,0)))","v":""},null,{"$f":"IF(MONTH(달력!G21)<>달력!$B$3,\"\",IF(VLOOKUP(달력!G21,일정!$B$4:$O$2001,6,0)=0,\"\",VLOOKUP(달력!G21,일정!$B$4:$O$2001,6,0)))","v":""},null,{"$f":"IF(MONTH(달력!I21)<>달력!$B$3,\"\",IF(VLOOKUP(달력!I21,일정!$B$4:$O$2001,6,0)=0,\"\",VLOOKUP(달력!I21,일정!$B$4:$O$2001,6,0)))","v":""},null,{"$f":"IF(MONTH(달력!K21)<>달력!$B$3,\"\",IF(VLOOKUP(달력!K21,일정!$B$4:$O$2001,6,0)=0,\"\",VLOOKUP(달력!K21,일정!$B$4:$O$2001,6,0)))","v":""},null,{"$f":"IF(MONTH(달력!M21)<>달력!$B$3,\"\",IF(VLOOKUP(달력!M21,일정!$B$4:$O$2001,6,0)=0,\"\",VLOOKUP(달력!M21,일정!$B$4:$O$2001,6,0)))","v":""},null,{"$f":"IF(MONTH(달력!O21)<>달력!$B$3,\"\",IF(VLOOKUP(달력!O21,일정!$B$4:$O$2001,6,0)=0,\"\",VLOOKUP(달력!O21,일정!$B$4:$O$2001,6,0)))","v":""}]
{"$rows_left_out":33}
{"sheet":"일정","index":4,"n_rows":1834,"n_cols":15,"rows_kept":1834,"cut":false,"hidden":false,"merged":[]}
[]
[null,"시작연도",2024,{"$f":"C2&\"년\"","v":"2024년"},{"$f":"C2+1&\"년\"","v":"2025년"},{"$f":"C2+2&\"년       \"&C2+3&\"년\"","v":"2026년       2027년"},{"$f":"\"      \"&C2+4&\"년\"","v":"      2028년"}]
[]
[null,"날짜","요일","일정1 내용","일정1 범례","일정2 내용","일정2 범례","일정3 내용","일정3 범례","일정4 내용","일정4 범례","일정5 내용","일정5 범례","일정6 내용","일정6 범례"]
[{"$f":"DATE($C$2,1,1)","v":"2024-01-01"},{"$f":"DATE($C$2,1,1)","v":"2024-01-01"},{"$f":"CHOOSE(WEEKDAY(B5,1),\"일\",\"월\",\"화\",\"수\",\"목\",\"금\",\"토\")","v":"월"}]
[{"$f":"A5+1","v":"2024-01-02"},{"$f":"B5+1","v":"2024-01-02"},{"$f":"CHOOSE(WEEKDAY(B6,1),\"일\",\"월\",\"화\",\"수\",\"목\",\"금\",\"토\")","v":"화"}]
[{"$f":"A6+1","v":"2024-01-03"},{"$f":"B6+1","v":"2024-01-03"},"수"]
["2024-01-04","2024-01-04","목"]
["2024-01-05","2024-01-05","금"]
["2024-01-06","2024-01-06","토"]
{"$rows_left_out":1825}
{"sheet":"공휴일","index":5,"n_rows":131,"n_cols":11,"rows_kept":131,"cut":false,"hidden":false,"merged":[[0,9,0,10],[0,3,0,5]]}
["연도","월","일","공휴일",null,null,"연도","월","일","기념일"]
[{"$f":"IF(D2=\"\",\"\",YEAR(D2))","v":2024},{"$f":"IF(D2=\"\",\"\",MONTH(D2))","v":1},{"$f":"IF(D2=\"\",\"\",DAY(D2))","v":1},{"$f":"DATE(일정!$C$2,1,1)","v":"2024-01-01"},{"$f":"D2","v":"2024-01-01"},"신정",{"$f":"IF(J2=\"\",\"\",YEAR(J2))","v":2024},{"$f":"IF(J2=\"\",\"\",MONTH(J2))","v":1},{"$f":"IF(J2=\"\",\"\",DAY(J2))","v":1},{"$f":"DATE(연간!$O$2,1,1)","v":"2024-01-01"},"친구생일"]
[{"$f":"IF(D3=\"\",\"\",YEAR(D3))","v":2024},{"$f":"IF(D3=\"\",\"\",MONTH(D3))","v":2},{"$f":"IF(D3=\"\",\"\",DAY(D3))","v":9},{"$f":"INDEX(날짜,MATCH(일정!$C$2,공휴일연도,0),0)","v":"2024-02-09"},{"$f":"D3","v":"2024-02-09"},"설날",{"$f":"IF(J3=\"\",\"\",YEAR(J3))","v":2025},{"$f":"IF(J3=\"\",\"\",MONTH(J3))","v":4},{"$f":"IF(J3=\"\",\"\",DAY(J3))","v":5},"2025-04-05","기념일"]
[2024,2,10,{"$f":"D3+1","v":"2024-02-10"},"2024-02-10","설날","","",""]
[2024,2,11,{"$f":"D4+1","v":"2024-02-11"},"2024-02-11","설날","","",""]
[2024,3,1,{"$f":"DATE(일정!$C$2,3,1)","v":"2024-03-01"},"2024-03-01","삼일절","","",""]
[2024,5,5,{"$f":"DATE(일정!$C$2,5,5)","v":"2024-05-05"},"2024-05-05","어린이날","","",""]
[2024,5,15,{"$f":"INDEX(날짜,MATCH(1,($F$8=휴일명)*(일정!$C$2=공휴일연도),0))","v":"2024-05-15"},"2024-05-15","석가탄신일","","",""]
[2024,6,6,{"$f":"DATE(일정!$C$2,6,6)","v":"2024-06-06"},"2024-06-06","현충일","","",""]
[2024,8,15,{"$f":"DATE(일정!$C$2,8,15)","v":"2024-08-15"},"2024-08-15","광복절","","",""]
{"$rows_left_out":122}
{"sheet":"디데이","index":6,"n_rows":12,"n_cols":6,"rows_kept":12,"cut":false,"hidden":false,"merged":[]}
[]
[null,"디데이 내용 입력","프로젝트 발표",null,{"$f":"IF(C2=\"\",\"\",\"📆 \"&C2)","v":"📆 프로젝트 발표"},{"$f":"IF(C4=\"\",\"\",C5)","v":"D+58"}]
[null,"오늘 날짜",{"$f":"TODAY()","v":"2024-02-28"}]
[null,"기준일 입력","2024-01-01"]
[null,"D-day",{"$f":"IF(C4-C3<0,\"D+\"&ABS(C4-C3),\"D-\"&C4-C3)","v":"D+58"}]
[]
[null,"디데이 내용 입력","기념일",null,{"$f":"IF(C7=\"\",\"\",\"📆 \"&C7)","v":"📆 기념일"},{"$f":"IF(C9=\"\",\"\",C10)","v":"D+1121"}]
[null,"오늘 날짜",{"$f":"TODAY()","v":"2024-02-28"}]
[null,"기준일 입력","2021-02-02"]
[null,"D-day",{"$f":"IF(C9-C8<0,\"D+\"&ABS(C9-C8),\"D-\"&C9-C8)","v":"D+1121"}]
{"$rows_left_out":3}
{"sheet":"미니달력","index":7,"n_rows":12,"n_cols":16,"rows_kept":12,"cut":false,"hidden":true,"merged":[[1,14,1,18]]}
[]
[null,{"$f":"연간!B2","v":"S"},null,null,null,null,null,null,null,null,null,null,null,null,{"$f":"연간!O2","v":2024}]
[]
[null,null,null,null,{"$f":"IF(달력!$B$3=1,12,달력!$B$3-1)","v":2},null,null,null,null,null,null,null,{"$f":"IF(달력!$B$3=12,1,달력!$B$3+1)","v":4}]
[]
[null,{"$f":"IF($B$2=\"S\",\"S\",IF($B$2=\"M\",\"M\"))","v":"S"},{"$f":"IF($B$2=\"S\",\"M\",IF($B$2=\"M\",\"T\"))","v":"M"},{"$f":"IF($B$2=\"S\",\"T\",IF($B$2=\"M\",\"W\"))","v":"T"},{"$f":"IF($B$2=\"S\",\"W\",IF($B$2=\"M\",\"T\"))","v":"W"},{"$f":"IF($B$2=\"S\",\"T\",IF($B$2=\"M\",\"F\"))","v":"T"},{"$f":"IF($B$2=\"S\",\"F\",IF($B$2=\"M\",\"S\"))","v":"F"},"S",null,{"$f":"IF($B$2=\"S\",\"S\",IF($B$2=\"M\",\"M\"))","v":"S"},{"$f":"IF($B$2=\"S\",\"M\",IF($B$2=\"M\",\"T\"))","v":"M"},{"$f":"IF($B$2=\"S\",\"T\",IF($B$2=\"M\",\"W\"))","v":"T"},{"$f":"IF($B$2=\"S\",\"W\",IF($B$2=\"M\",\"T\"))","v":"W"},{"$f":"IF($B$2=\"S\",\"T\",IF($B$2=\"M\",\"F\"))","v":"T"},{"$f":"IF($B$2=\"S\",\"F\",IF($B$2=\"M\",\"S\"))","v":"F"},"S"]
[null,{"$f":"IF(B2=\"M\",(IF(DAY(DATE(IF(달력!$B$3=1,$O$2-1,$O$2),$E$4,1)-WEEKDAY(DATE(IF(달력!$B$3=1,$O$2-1,$O$2),$E$4,1))+2)=2,DATE(IF(달력!$B$3=1,$O$2-1,$O$2),$E$4,1)-WEEKDAY(DATE(IF(달력!$B$3=1,$O$2-1,$O$2),$E$4,1))-5,DATE(IF(달력!$B$3=1,$O$2-1,$O$2),$E$4,1)-WEEKDAY(DATE(IF(달력!$B$3=1,$O$2-1,$O$2),$E$4,1))+2)),IF(B2=\"S\",DATE(IF(달력!$B$3=1,$O$2-1,$O$2),$E$4,1)-WEEKDAY(DATE(IF(달력!$B$3=1,$O$2-1,$O$2),$E$4,1))+1))","v":"2024-01-28"},{"$f":"B7+1","v":"2024-01-29"},"2024-01-30","2024-01-31","2024-02-01","2024-02-02","2024-02-03",null,{"$f":"IF(B2=\"M\",(IF(DAY(DATE(IF(달력!$B$3=12,$O$2+1,$O$2),$M$4,1)-WEEKDAY(DATE(IF(달력!$B$3=12,$O$2+1,$O$2),$M$4,1))+2)=2,DATE(IF(달력!$B$3=12,$O$2+1,$O$2),$M$4,1)-WEEKDAY(DATE(IF(달력!$B$3=12,$O$2+1,$O$2),$M$4,1))-5,DATE(IF(달력!$B$3=12,$O$2+1,$O$2),$M$4,1)-WEEKDAY(DATE(IF(달력!$B$3=12,$O$2+1,$O$2),$M$4,1))+2)),IF(B2=\"S\",DATE(IF(달력!$B$3=12,$O$2+1,$O$2),$M$4,1)-WEEKDAY(DATE(IF(달력!$B$3=12,$O$2+1,$O$2),$M$4,1))+1))","v":"2024-03-31"},{"$f":"J7+1","v":"2024-04-01"},"2024-04-02","2024-04-03","2024-04-04","2024-04-05","2024-04-06"]
[null,{"$f":"B7+7","v":"2024-02-04"},{"$f":"C7+7","v":"2024-02-05"},"2024-02-06","2024-02-07","2024-02-08","2024-02-09","2024-02-10",null,{"$f":"J7+7","v":"2024-04-07"},"2024-04-08","2024-04-09","2024-04-10","2024-04-11","2024-04-12","2024-04-13"]
[null,{"$f":"B8+7","v":"2024-02-11"},"2024-02-12","2024-02-13","2024-02-14","2024-02-15","2024-02-16","2024-02-17",null,"2024-04-14","2024-04-15","2024-04-16","2024-04-17","2024-04-18","2024-04-19","2024-04-20"]
[null,{"$f":"B9+7","v":"2024-02-18"},"2024-02-19","2024-02-20","2024-02-21","2024-02-22","2024-02-23","2024-02-24",null,"2024-04-21","2024-04-22","2024-04-23","2024-04-24","2024-04-25","2024-04-26","2024-04-27"]
{"$rows_left_out":3}
{"sheet":"이름지정","index":8,"n_rows":637,"n_cols":5,"rows_kept":637,"cut":false,"hidden":true,"merged":[]}
["년도","월","연도","날짜","휴일명"]
[2010,1,{"$f":"YEAR(D2)","v":2010},"2010-02-13","설날"]
[2011,2,{"$f":"YEAR(D3)","v":2010},"2010-02-14","설날"]
[2012,3,2010,"2010-02-15","설날"]
[2013,4,2010,"2010-05-21","석가탄신일"]
[2014,5,2010,"2010-09-21","추석"]
[2015,6,2010,"2010-09-22","추석"]
[2016,7,2010,"2010-09-23","추석"]
[2017,8,2011,"2011-02-02","설날"]
[2018,9,2011,"2011-02-03","설날"]
{"$rows_left_out":627}